Skip to content
Skipping 7,892 KB.. Full Log
profiling:/var/lib/jenkins1/ws/OpenModelica/build_cmake/OMCompiler/SimulationRuntime/c/util/CMakeFiles/OpenModelicaRuntimeCUtilMMC.dir/write_csv.c.gcda:Skip
profiling:/var/lib/jenkins1:Cannot create directory
profiling:/var/lib/jenkins1/ws/OpenModelica/build_cmake/OMCompiler/SimulationRuntime/c/util/CMakeFiles/OpenModelicaRuntimeCUtilMMC.dir/tinymt64.c.gcda:Skip
profiling:/var/lib/jenkins1:Cannot create directory
profiling:/var/lib/jenkins1/ws/OpenModelica/build_cmake/OMCompiler/SimulationRuntime/c/util/CMakeFiles/OpenModelicaRuntimeCUtilMMC.dir/read_matlab4.c.gcda:Skip
profiling:/var/lib/jenkins1:Cannot create directory
profiling:/var/lib/jenkins1/ws/OpenModelica/build_cmake/OMCompiler/SimulationRuntime/c/util/CMakeFiles/OpenModelicaRuntimeCUtilMMC.dir/read_csv.c.gcda:Skip
profiling:/var/lib/jenkins1:Cannot create directory
profiling:/var/lib/jenkins1/ws/OpenModelica/build_cmake/OMCompiler/SimulationRuntime/c/util/CMakeFiles/OpenModelicaRuntimeCUtilMMC.dir/omc_numbers.c.gcda:Skip
profiling:/var/lib/jenkins1:Cannot create directory
profiling:/var/lib/jenkins1/ws/OpenModelica/build_cmake/OMCompiler/SimulationRuntime/c/util/CMakeFiles/OpenModelicaRuntimeCUtilMMC.dir/OldModelicaTables.c.gcda:Skip
profiling:/var/lib/jenkins1:Cannot create directory
profiling:/var/lib/jenkins1/ws/OpenModelica/build_cmake/OMCompiler/SimulationRuntime/c/util/CMakeFiles/OpenModelicaRuntimeCUtilMMC.dir/libcsv.c.gcda:Skip
profiling:/var/lib/jenkins1:Cannot create directory
profiling:/var/lib/jenkins1/ws/OpenModelica/build_cmake/OMCompiler/SimulationRuntime/c/meta/CMakeFiles/OpenModelicaRuntimeMMC.dir/meta_modelica_catch.c.gcda:Skip
[ 79%] Translating DiffAlgorithm.mo for MSVC
profiling:/var/lib/jenkins1:Cannot create directory
profiling:/var/lib/jenkins1/ws/OpenModelica/build_cmake/OMCompiler/SimulationRuntime/c/util/CMakeFiles/OpenModelicaRuntimeCUtilMMC.dir/write_matlab4.c.gcda:Skip
profiling:/var/lib/jenkins1:Cannot create directory
profiling:/var/lib/jenkins1/ws/OpenModelica/build_cmake/OMCompiler/SimulationRuntime/c/util/CMakeFiles/OpenModelicaRuntimeCUtilMMC.dir/write_csv.c.gcda:Skip
profiling:/var/lib/jenkins1:Cannot create directory
profiling:/var/lib/jenkins1/ws/OpenModelica/build_cmake/OMCompiler/SimulationRuntime/c/util/CMakeFiles/OpenModelicaRuntimeCUtilMMC.dir/tinymt64.c.gcda:Skip
profiling:/var/lib/jenkins1:Cannot create directory
profiling:/var/lib/jenkins1/ws/OpenModelica/build_cmake/OMCompiler/SimulationRuntime/c/util/CMakeFiles/OpenModelicaRuntimeCUtilMMC.dir/read_matlab4.c.gcda:Skip
profiling:/var/lib/jenkins1:Cannot create directory
profiling:/var/lib/jenkins1/ws/OpenModelica/build_cmake/OMCompiler/SimulationRuntime/c/util/CMakeFiles/OpenModelicaRuntimeCUtilMMC.dir/read_csv.c.gcda:Skip
profiling:/var/lib/jenkins1:Cannot create directory
profiling:/var/lib/jenkins1/ws/OpenModelica/build_cmake/OMCompiler/SimulationRuntime/c/util/CMakeFiles/OpenModelicaRuntimeCUtilMMC.dir/omc_numbers.c.gcda:Skip
profiling:/var/lib/jenkins1:Cannot create directory
profiling:/var/lib/jenkins1/ws/OpenModelica/build_cmake/OMCompiler/SimulationRuntime/c/util/CMakeFiles/OpenModelicaRuntimeCUtilMMC.dir/OldModelicaTables.c.gcda:Skip
profiling:/var/lib/jenkins1:Cannot create directory
profiling:/var/lib/jenkins1/ws/OpenModelica/build_cmake/OMCompiler/SimulationRuntime/c/util/CMakeFiles/OpenModelicaRuntimeCUtilMMC.dir/libcsv.c.gcda:Skip
profiling:/var/lib/jenkins1:Cannot create directory
profiling:/var/lib/jenkins1/ws/OpenModelica/build_cmake/OMCompiler/SimulationRuntime/c/meta/CMakeFiles/OpenModelicaRuntimeMMC.dir/meta_modelica_catch.c.gcda:Skip
[ 79%] Translating DisjointSets.mo for MSVC
profiling:/var/lib/jenkins1:Cannot create directory
profiling:/var/lib/jenkins1/ws/OpenModelica/build_cmake/OMCompiler/SimulationRuntime/c/util/CMakeFiles/OpenModelicaRuntimeCUtilMMC.dir/write_matlab4.c.gcda:Skip
profiling:/var/lib/jenkins1:Cannot create directory
profiling:/var/lib/jenkins1/ws/OpenModelica/build_cmake/OMCompiler/SimulationRuntime/c/util/CMakeFiles/OpenModelicaRuntimeCUtilMMC.dir/write_csv.c.gcda:Skip
profiling:/var/lib/jenkins1:Cannot create directory
profiling:/var/lib/jenkins1/ws/OpenModelica/build_cmake/OMCompiler/SimulationRuntime/c/util/CMakeFiles/OpenModelicaRuntimeCUtilMMC.dir/tinymt64.c.gcda:Skip
profiling:/var/lib/jenkins1:Cannot create directory
profiling:/var/lib/jenkins1/ws/OpenModelica/build_cmake/OMCompiler/SimulationRuntime/c/util/CMakeFiles/OpenModelicaRuntimeCUtilMMC.dir/read_matlab4.c.gcda:Skip
profiling:/var/lib/jenkins1:Cannot create directory
profiling:/var/lib/jenkins1/ws/OpenModelica/build_cmake/OMCompiler/SimulationRuntime/c/util/CMakeFiles/OpenModelicaRuntimeCUtilMMC.dir/read_csv.c.gcda:Skip
profiling:/var/lib/jenkins1:Cannot create directory
profiling:/var/lib/jenkins1/ws/OpenModelica/build_cmake/OMCompiler/SimulationRuntime/c/util/CMakeFiles/OpenModelicaRuntimeCUtilMMC.dir/omc_numbers.c.gcda:Skip
profiling:/var/lib/jenkins1:Cannot create directory
profiling:/var/lib/jenkins1/ws/OpenModelica/build_cmake/OMCompiler/SimulationRuntime/c/util/CMakeFiles/OpenModelicaRuntimeCUtilMMC.dir/OldModelicaTables.c.gcda:Skip
profiling:/var/lib/jenkins1:Cannot create directory
profiling:/var/lib/jenkins1/ws/OpenModelica/build_cmake/OMCompiler/SimulationRuntime/c/util/CMakeFiles/OpenModelicaRuntimeCUtilMMC.dir/libcsv.c.gcda:Skip
profiling:/var/lib/jenkins1:Cannot create directory
profiling:/var/lib/jenkins1/ws/OpenModelica/build_cmake/OMCompiler/SimulationRuntime/c/meta/CMakeFiles/OpenModelicaRuntimeMMC.dir/meta_modelica_catch.c.gcda:Skip
[ 79%] Translating ExpandableArray.mo for MSVC
profiling:/var/lib/jenkins1:Cannot create directory
profiling:/var/lib/jenkins1/ws/OpenModelica/build_cmake/OMCompiler/SimulationRuntime/c/util/CMakeFiles/OpenModelicaRuntimeCUtilMMC.dir/write_matlab4.c.gcda:Skip
profiling:/var/lib/jenkins1:Cannot create directory
profiling:/var/lib/jenkins1/ws/OpenModelica/build_cmake/OMCompiler/SimulationRuntime/c/util/CMakeFiles/OpenModelicaRuntimeCUtilMMC.dir/write_csv.c.gcda:Skip
profiling:/var/lib/jenkins1:Cannot create directory
profiling:/var/lib/jenkins1/ws/OpenModelica/build_cmake/OMCompiler/SimulationRuntime/c/util/CMakeFiles/OpenModelicaRuntimeCUtilMMC.dir/tinymt64.c.gcda:Skip
profiling:/var/lib/jenkins1:Cannot create directory
profiling:/var/lib/jenkins1/ws/OpenModelica/build_cmake/OMCompiler/SimulationRuntime/c/util/CMakeFiles/OpenModelicaRuntimeCUtilMMC.dir/read_matlab4.c.gcda:Skip
profiling:/var/lib/jenkins1:Cannot create directory
profiling:/var/lib/jenkins1/ws/OpenModelica/build_cmake/OMCompiler/SimulationRuntime/c/util/CMakeFiles/OpenModelicaRuntimeCUtilMMC.dir/read_csv.c.gcda:Skip
profiling:/var/lib/jenkins1:Cannot create directory
profiling:/var/lib/jenkins1/ws/OpenModelica/build_cmake/OMCompiler/SimulationRuntime/c/util/CMakeFiles/OpenModelicaRuntimeCUtilMMC.dir/omc_numbers.c.gcda:Skip
profiling:/var/lib/jenkins1:Cannot create directory
profiling:/var/lib/jenkins1/ws/OpenModelica/build_cmake/OMCompiler/SimulationRuntime/c/util/CMakeFiles/OpenModelicaRuntimeCUtilMMC.dir/OldModelicaTables.c.gcda:Skip
profiling:/var/lib/jenkins1:Cannot create directory
profiling:/var/lib/jenkins1/ws/OpenModelica/build_cmake/OMCompiler/SimulationRuntime/c/util/CMakeFiles/OpenModelicaRuntimeCUtilMMC.dir/libcsv.c.gcda:Skip
profiling:/var/lib/jenkins1:Cannot create directory
profiling:/var/lib/jenkins1/ws/OpenModelica/build_cmake/OMCompiler/SimulationRuntime/c/meta/CMakeFiles/OpenModelicaRuntimeMMC.dir/meta_modelica_catch.c.gcda:Skip
[ 79%] Translating FFI.mo for MSVC
profiling:/var/lib/jenkins1:Cannot create directory
profiling:/var/lib/jenkins1/ws/OpenModelica/build_cmake/OMCompiler/SimulationRuntime/c/util/CMakeFiles/OpenModelicaRuntimeCUtilMMC.dir/write_matlab4.c.gcda:Skip
profiling:/var/lib/jenkins1:Cannot create directory
profiling:/var/lib/jenkins1/ws/OpenModelica/build_cmake/OMCompiler/SimulationRuntime/c/util/CMakeFiles/OpenModelicaRuntimeCUtilMMC.dir/write_csv.c.gcda:Skip
profiling:/var/lib/jenkins1:Cannot create directory
profiling:/var/lib/jenkins1/ws/OpenModelica/build_cmake/OMCompiler/SimulationRuntime/c/util/CMakeFiles/OpenModelicaRuntimeCUtilMMC.dir/tinymt64.c.gcda:Skip
profiling:/var/lib/jenkins1:Cannot create directory
profiling:/var/lib/jenkins1/ws/OpenModelica/build_cmake/OMCompiler/SimulationRuntime/c/util/CMakeFiles/OpenModelicaRuntimeCUtilMMC.dir/read_matlab4.c.gcda:Skip
profiling:/var/lib/jenkins1:Cannot create directory
profiling:/var/lib/jenkins1/ws/OpenModelica/build_cmake/OMCompiler/SimulationRuntime/c/util/CMakeFiles/OpenModelicaRuntimeCUtilMMC.dir/read_csv.c.gcda:Skip
profiling:/var/lib/jenkins1:Cannot create directory
profiling:/var/lib/jenkins1/ws/OpenModelica/build_cmake/OMCompiler/SimulationRuntime/c/util/CMakeFiles/OpenModelicaRuntimeCUtilMMC.dir/omc_numbers.c.gcda:Skip
profiling:/var/lib/jenkins1:Cannot create directory
profiling:/var/lib/jenkins1/ws/OpenModelica/build_cmake/OMCompiler/SimulationRuntime/c/util/CMakeFiles/OpenModelicaRuntimeCUtilMMC.dir/OldModelicaTables.c.gcda:Skip
profiling:/var/lib/jenkins1:Cannot create directory
profiling:/var/lib/jenkins1/ws/OpenModelica/build_cmake/OMCompiler/SimulationRuntime/c/util/CMakeFiles/OpenModelicaRuntimeCUtilMMC.dir/libcsv.c.gcda:Skip
profiling:/var/lib/jenkins1:Cannot create directory
profiling:/var/lib/jenkins1/ws/OpenModelica/build_cmake/OMCompiler/SimulationRuntime/c/meta/CMakeFiles/OpenModelicaRuntimeMMC.dir/meta_modelica_catch.c.gcda:Skip
[ 79%] Translating FMI.mo for MSVC
profiling:/var/lib/jenkins1:Cannot create directory
profiling:/var/lib/jenkins1/ws/OpenModelica/build_cmake/OMCompiler/SimulationRuntime/c/util/CMakeFiles/OpenModelicaRuntimeCUtilMMC.dir/write_matlab4.c.gcda:Skip
profiling:/var/lib/jenkins1:Cannot create directory
profiling:/var/lib/jenkins1/ws/OpenModelica/build_cmake/OMCompiler/SimulationRuntime/c/util/CMakeFiles/OpenModelicaRuntimeCUtilMMC.dir/write_csv.c.gcda:Skip
profiling:/var/lib/jenkins1:Cannot create directory
profiling:/var/lib/jenkins1/ws/OpenModelica/build_cmake/OMCompiler/SimulationRuntime/c/util/CMakeFiles/OpenModelicaRuntimeCUtilMMC.dir/tinymt64.c.gcda:Skip
profiling:/var/lib/jenkins1:Cannot create directory
profiling:/var/lib/jenkins1/ws/OpenModelica/build_cmake/OMCompiler/SimulationRuntime/c/util/CMakeFiles/OpenModelicaRuntimeCUtilMMC.dir/read_matlab4.c.gcda:Skip
profiling:/var/lib/jenkins1:Cannot create directory
profiling:/var/lib/jenkins1/ws/OpenModelica/build_cmake/OMCompiler/SimulationRuntime/c/util/CMakeFiles/OpenModelicaRuntimeCUtilMMC.dir/read_csv.c.gcda:Skip
profiling:/var/lib/jenkins1:Cannot create directory
profiling:/var/lib/jenkins1/ws/OpenModelica/build_cmake/OMCompiler/SimulationRuntime/c/util/CMakeFiles/OpenModelicaRuntimeCUtilMMC.dir/omc_numbers.c.gcda:Skip
profiling:/var/lib/jenkins1:Cannot create directory
profiling:/var/lib/jenkins1/ws/OpenModelica/build_cmake/OMCompiler/SimulationRuntime/c/util/CMakeFiles/OpenModelicaRuntimeCUtilMMC.dir/OldModelicaTables.c.gcda:Skip
profiling:/var/lib/jenkins1:Cannot create directory
profiling:/var/lib/jenkins1/ws/OpenModelica/build_cmake/OMCompiler/SimulationRuntime/c/util/CMakeFiles/OpenModelicaRuntimeCUtilMMC.dir/libcsv.c.gcda:Skip
profiling:/var/lib/jenkins1:Cannot create directory
profiling:/var/lib/jenkins1/ws/OpenModelica/build_cmake/OMCompiler/SimulationRuntime/c/meta/CMakeFiles/OpenModelicaRuntimeMMC.dir/meta_modelica_catch.c.gcda:Skip
[ 79%] Translating FMIExt.mo for MSVC
profiling:/var/lib/jenkins1:Cannot create directory
profiling:/var/lib/jenkins1/ws/OpenModelica/build_cmake/OMCompiler/SimulationRuntime/c/util/CMakeFiles/OpenModelicaRuntimeCUtilMMC.dir/write_matlab4.c.gcda:Skip
profiling:/var/lib/jenkins1:Cannot create directory
profiling:/var/lib/jenkins1/ws/OpenModelica/build_cmake/OMCompiler/SimulationRuntime/c/util/CMakeFiles/OpenModelicaRuntimeCUtilMMC.dir/write_csv.c.gcda:Skip
profiling:/var/lib/jenkins1:Cannot create directory
profiling:/var/lib/jenkins1/ws/OpenModelica/build_cmake/OMCompiler/SimulationRuntime/c/util/CMakeFiles/OpenModelicaRuntimeCUtilMMC.dir/tinymt64.c.gcda:Skip
profiling:/var/lib/jenkins1:Cannot create directory
profiling:/var/lib/jenkins1/ws/OpenModelica/build_cmake/OMCompiler/SimulationRuntime/c/util/CMakeFiles/OpenModelicaRuntimeCUtilMMC.dir/read_matlab4.c.gcda:Skip
profiling:/var/lib/jenkins1:Cannot create directory
profiling:/var/lib/jenkins1/ws/OpenModelica/build_cmake/OMCompiler/SimulationRuntime/c/util/CMakeFiles/OpenModelicaRuntimeCUtilMMC.dir/read_csv.c.gcda:Skip
profiling:/var/lib/jenkins1:Cannot create directory
profiling:/var/lib/jenkins1/ws/OpenModelica/build_cmake/OMCompiler/SimulationRuntime/c/util/CMakeFiles/OpenModelicaRuntimeCUtilMMC.dir/omc_numbers.c.gcda:Skip
profiling:/var/lib/jenkins1:Cannot create directory
profiling:/var/lib/jenkins1/ws/OpenModelica/build_cmake/OMCompiler/SimulationRuntime/c/util/CMakeFiles/OpenModelicaRuntimeCUtilMMC.dir/OldModelicaTables.c.gcda:Skip
profiling:/var/lib/jenkins1:Cannot create directory
profiling:/var/lib/jenkins1/ws/OpenModelica/build_cmake/OMCompiler/SimulationRuntime/c/util/CMakeFiles/OpenModelicaRuntimeCUtilMMC.dir/libcsv.c.gcda:Skip
profiling:/var/lib/jenkins1:Cannot create directory
profiling:/var/lib/jenkins1/ws/OpenModelica/build_cmake/OMCompiler/SimulationRuntime/c/meta/CMakeFiles/OpenModelicaRuntimeMMC.dir/meta_modelica_catch.c.gcda:Skip
[ 79%] Translating GraphML.mo for MSVC
profiling:/var/lib/jenkins1:Cannot create directory
profiling:/var/lib/jenkins1/ws/OpenModelica/build_cmake/OMCompiler/SimulationRuntime/c/util/CMakeFiles/OpenModelicaRuntimeCUtilMMC.dir/write_matlab4.c.gcda:Skip
profiling:/var/lib/jenkins1:Cannot create directory
profiling:/var/lib/jenkins1/ws/OpenModelica/build_cmake/OMCompiler/SimulationRuntime/c/util/CMakeFiles/OpenModelicaRuntimeCUtilMMC.dir/write_csv.c.gcda:Skip
profiling:/var/lib/jenkins1:Cannot create directory
profiling:/var/lib/jenkins1/ws/OpenModelica/build_cmake/OMCompiler/SimulationRuntime/c/util/CMakeFiles/OpenModelicaRuntimeCUtilMMC.dir/tinymt64.c.gcda:Skip
profiling:/var/lib/jenkins1:Cannot create directory
profiling:/var/lib/jenkins1/ws/OpenModelica/build_cmake/OMCompiler/SimulationRuntime/c/util/CMakeFiles/OpenModelicaRuntimeCUtilMMC.dir/read_matlab4.c.gcda:Skip
profiling:/var/lib/jenkins1:Cannot create directory
profiling:/var/lib/jenkins1/ws/OpenModelica/build_cmake/OMCompiler/SimulationRuntime/c/util/CMakeFiles/OpenModelicaRuntimeCUtilMMC.dir/read_csv.c.gcda:Skip
profiling:/var/lib/jenkins1:Cannot create directory
profiling:/var/lib/jenkins1/ws/OpenModelica/build_cmake/OMCompiler/SimulationRuntime/c/util/CMakeFiles/OpenModelicaRuntimeCUtilMMC.dir/omc_numbers.c.gcda:Skip
profiling:/var/lib/jenkins1:Cannot create directory
profiling:/var/lib/jenkins1/ws/OpenModelica/build_cmake/OMCompiler/SimulationRuntime/c/util/CMakeFiles/OpenModelicaRuntimeCUtilMMC.dir/OldModelicaTables.c.gcda:Skip
profiling:/var/lib/jenkins1:Cannot create directory
profiling:/var/lib/jenkins1/ws/OpenModelica/build_cmake/OMCompiler/SimulationRuntime/c/util/CMakeFiles/OpenModelicaRuntimeCUtilMMC.dir/libcsv.c.gcda:Skip
profiling:/var/lib/jenkins1:Cannot create directory
profiling:/var/lib/jenkins1/ws/OpenModelica/build_cmake/OMCompiler/SimulationRuntime/c/meta/CMakeFiles/OpenModelicaRuntimeMMC.dir/meta_modelica_catch.c.gcda:Skip
[ 79%] Translating HashTableCrToExp.mo for MSVC
profiling:/var/lib/jenkins1:Cannot create directory
profiling:/var/lib/jenkins1/ws/OpenModelica/build_cmake/OMCompiler/SimulationRuntime/c/util/CMakeFiles/OpenModelicaRuntimeCUtilMMC.dir/write_matlab4.c.gcda:Skip
profiling:/var/lib/jenkins1:Cannot create directory
profiling:/var/lib/jenkins1/ws/OpenModelica/build_cmake/OMCompiler/SimulationRuntime/c/util/CMakeFiles/OpenModelicaRuntimeCUtilMMC.dir/write_csv.c.gcda:Skip
profiling:/var/lib/jenkins1:Cannot create directory
profiling:/var/lib/jenkins1/ws/OpenModelica/build_cmake/OMCompiler/SimulationRuntime/c/util/CMakeFiles/OpenModelicaRuntimeCUtilMMC.dir/tinymt64.c.gcda:Skip
profiling:/var/lib/jenkins1:Cannot create directory
profiling:/var/lib/jenkins1/ws/OpenModelica/build_cmake/OMCompiler/SimulationRuntime/c/util/CMakeFiles/OpenModelicaRuntimeCUtilMMC.dir/read_matlab4.c.gcda:Skip
profiling:/var/lib/jenkins1:Cannot create directory
profiling:/var/lib/jenkins1/ws/OpenModelica/build_cmake/OMCompiler/SimulationRuntime/c/util/CMakeFiles/OpenModelicaRuntimeCUtilMMC.dir/read_csv.c.gcda:Skip
profiling:/var/lib/jenkins1:Cannot create directory
profiling:/var/lib/jenkins1/ws/OpenModelica/build_cmake/OMCompiler/SimulationRuntime/c/util/CMakeFiles/OpenModelicaRuntimeCUtilMMC.dir/omc_numbers.c.gcda:Skip
profiling:/var/lib/jenkins1:Cannot create directory
profiling:/var/lib/jenkins1/ws/OpenModelica/build_cmake/OMCompiler/SimulationRuntime/c/util/CMakeFiles/OpenModelicaRuntimeCUtilMMC.dir/OldModelicaTables.c.gcda:Skip
profiling:/var/lib/jenkins1:Cannot create directory
profiling:/var/lib/jenkins1/ws/OpenModelica/build_cmake/OMCompiler/SimulationRuntime/c/util/CMakeFiles/OpenModelicaRuntimeCUtilMMC.dir/libcsv.c.gcda:Skip
profiling:/var/lib/jenkins1:Cannot create directory
profiling:/var/lib/jenkins1/ws/OpenModelica/build_cmake/OMCompiler/SimulationRuntime/c/meta/CMakeFiles/OpenModelicaRuntimeMMC.dir/meta_modelica_catch.c.gcda:Skip
[ 79%] Translating HashTableExpToExp.mo for MSVC
profiling:/var/lib/jenkins1:Cannot create directory
profiling:/var/lib/jenkins1/ws/OpenModelica/build_cmake/OMCompiler/SimulationRuntime/c/util/CMakeFiles/OpenModelicaRuntimeCUtilMMC.dir/write_matlab4.c.gcda:Skip
profiling:/var/lib/jenkins1:Cannot create directory
profiling:/var/lib/jenkins1/ws/OpenModelica/build_cmake/OMCompiler/SimulationRuntime/c/util/CMakeFiles/OpenModelicaRuntimeCUtilMMC.dir/write_csv.c.gcda:Skip
profiling:/var/lib/jenkins1:Cannot create directory
profiling:/var/lib/jenkins1/ws/OpenModelica/build_cmake/OMCompiler/SimulationRuntime/c/util/CMakeFiles/OpenModelicaRuntimeCUtilMMC.dir/tinymt64.c.gcda:Skip
profiling:/var/lib/jenkins1:Cannot create directory
profiling:/var/lib/jenkins1/ws/OpenModelica/build_cmake/OMCompiler/SimulationRuntime/c/util/CMakeFiles/OpenModelicaRuntimeCUtilMMC.dir/read_matlab4.c.gcda:Skip
profiling:/var/lib/jenkins1:Cannot create directory
profiling:/var/lib/jenkins1/ws/OpenModelica/build_cmake/OMCompiler/SimulationRuntime/c/util/CMakeFiles/OpenModelicaRuntimeCUtilMMC.dir/read_csv.c.gcda:Skip
profiling:/var/lib/jenkins1:Cannot create directory
profiling:/var/lib/jenkins1/ws/OpenModelica/build_cmake/OMCompiler/SimulationRuntime/c/util/CMakeFiles/OpenModelicaRuntimeCUtilMMC.dir/omc_numbers.c.gcda:Skip
profiling:/var/lib/jenkins1:Cannot create directory
profiling:/var/lib/jenkins1/ws/OpenModelica/build_cmake/OMCompiler/SimulationRuntime/c/util/CMakeFiles/OpenModelicaRuntimeCUtilMMC.dir/OldModelicaTables.c.gcda:Skip
profiling:/var/lib/jenkins1:Cannot create directory
profiling:/var/lib/jenkins1/ws/OpenModelica/build_cmake/OMCompiler/SimulationRuntime/c/util/CMakeFiles/OpenModelicaRuntimeCUtilMMC.dir/libcsv.c.gcda:Skip
profiling:/var/lib/jenkins1:Cannot create directory
profiling:/var/lib/jenkins1/ws/OpenModelica/build_cmake/OMCompiler/SimulationRuntime/c/meta/CMakeFiles/OpenModelicaRuntimeMMC.dir/meta_modelica_catch.c.gcda:Skip
[ 79%] Translating HashTableCrIntToExp.mo for MSVC
profiling:/var/lib/jenkins1:Cannot create directory
profiling:/var/lib/jenkins1/ws/OpenModelica/build_cmake/OMCompiler/SimulationRuntime/c/util/CMakeFiles/OpenModelicaRuntimeCUtilMMC.dir/write_matlab4.c.gcda:Skip
profiling:/var/lib/jenkins1:Cannot create directory
profiling:/var/lib/jenkins1/ws/OpenModelica/build_cmake/OMCompiler/SimulationRuntime/c/util/CMakeFiles/OpenModelicaRuntimeCUtilMMC.dir/write_csv.c.gcda:Skip
profiling:/var/lib/jenkins1:Cannot create directory
profiling:/var/lib/jenkins1/ws/OpenModelica/build_cmake/OMCompiler/SimulationRuntime/c/util/CMakeFiles/OpenModelicaRuntimeCUtilMMC.dir/tinymt64.c.gcda:Skip
profiling:/var/lib/jenkins1:Cannot create directory
profiling:/var/lib/jenkins1/ws/OpenModelica/build_cmake/OMCompiler/SimulationRuntime/c/util/CMakeFiles/OpenModelicaRuntimeCUtilMMC.dir/read_matlab4.c.gcda:Skip
profiling:/var/lib/jenkins1:Cannot create directory
profiling:/var/lib/jenkins1/ws/OpenModelica/build_cmake/OMCompiler/SimulationRuntime/c/util/CMakeFiles/OpenModelicaRuntimeCUtilMMC.dir/read_csv.c.gcda:Skip
profiling:/var/lib/jenkins1:Cannot create directory
profiling:/var/lib/jenkins1/ws/OpenModelica/build_cmake/OMCompiler/SimulationRuntime/c/util/CMakeFiles/OpenModelicaRuntimeCUtilMMC.dir/omc_numbers.c.gcda:Skip
profiling:/var/lib/jenkins1:Cannot create directory
profiling:/var/lib/jenkins1/ws/OpenModelica/build_cmake/OMCompiler/SimulationRuntime/c/util/CMakeFiles/OpenModelicaRuntimeCUtilMMC.dir/OldModelicaTables.c.gcda:Skip
profiling:/var/lib/jenkins1:Cannot create directory
profiling:/var/lib/jenkins1/ws/OpenModelica/build_cmake/OMCompiler/SimulationRuntime/c/util/CMakeFiles/OpenModelicaRuntimeCUtilMMC.dir/libcsv.c.gcda:Skip
profiling:/var/lib/jenkins1:Cannot create directory
profiling:/var/lib/jenkins1/ws/OpenModelica/build_cmake/OMCompiler/SimulationRuntime/c/meta/CMakeFiles/OpenModelicaRuntimeMMC.dir/meta_modelica_catch.c.gcda:Skip
[ 79%] Translating HashTableCrToExpSourceTpl.mo for MSVC
profiling:/var/lib/jenkins1:Cannot create directory
profiling:/var/lib/jenkins1/ws/OpenModelica/build_cmake/OMCompiler/SimulationRuntime/c/util/CMakeFiles/OpenModelicaRuntimeCUtilMMC.dir/write_matlab4.c.gcda:Skip
profiling:/var/lib/jenkins1:Cannot create directory
profiling:/var/lib/jenkins1/ws/OpenModelica/build_cmake/OMCompiler/SimulationRuntime/c/util/CMakeFiles/OpenModelicaRuntimeCUtilMMC.dir/write_csv.c.gcda:Skip
profiling:/var/lib/jenkins1:Cannot create directory
profiling:/var/lib/jenkins1/ws/OpenModelica/build_cmake/OMCompiler/SimulationRuntime/c/util/CMakeFiles/OpenModelicaRuntimeCUtilMMC.dir/tinymt64.c.gcda:Skip
profiling:/var/lib/jenkins1:Cannot create directory
profiling:/var/lib/jenkins1/ws/OpenModelica/build_cmake/OMCompiler/SimulationRuntime/c/util/CMakeFiles/OpenModelicaRuntimeCUtilMMC.dir/read_matlab4.c.gcda:Skip
profiling:/var/lib/jenkins1:Cannot create directory
profiling:/var/lib/jenkins1/ws/OpenModelica/build_cmake/OMCompiler/SimulationRuntime/c/util/CMakeFiles/OpenModelicaRuntimeCUtilMMC.dir/read_csv.c.gcda:Skip
profiling:/var/lib/jenkins1:Cannot create directory
profiling:/var/lib/jenkins1/ws/OpenModelica/build_cmake/OMCompiler/SimulationRuntime/c/util/CMakeFiles/OpenModelicaRuntimeCUtilMMC.dir/omc_numbers.c.gcda:Skip
profiling:/var/lib/jenkins1:Cannot create directory
profiling:/var/lib/jenkins1/ws/OpenModelica/build_cmake/OMCompiler/SimulationRuntime/c/util/CMakeFiles/OpenModelicaRuntimeCUtilMMC.dir/OldModelicaTables.c.gcda:Skip
profiling:/var/lib/jenkins1:Cannot create directory
profiling:/var/lib/jenkins1/ws/OpenModelica/build_cmake/OMCompiler/SimulationRuntime/c/util/CMakeFiles/OpenModelicaRuntimeCUtilMMC.dir/libcsv.c.gcda:Skip
profiling:/var/lib/jenkins1:Cannot create directory
profiling:/var/lib/jenkins1/ws/OpenModelica/build_cmake/OMCompiler/SimulationRuntime/c/meta/CMakeFiles/OpenModelicaRuntimeMMC.dir/meta_modelica_catch.c.gcda:Skip
[ 79%] Translating HashTableCrToCrEqLst.mo for MSVC
profiling:/var/lib/jenkins1:Cannot create directory
profiling:/var/lib/jenkins1/ws/OpenModelica/build_cmake/OMCompiler/SimulationRuntime/c/util/CMakeFiles/OpenModelicaRuntimeCUtilMMC.dir/write_matlab4.c.gcda:Skip
profiling:/var/lib/jenkins1:Cannot create directory
profiling:/var/lib/jenkins1/ws/OpenModelica/build_cmake/OMCompiler/SimulationRuntime/c/util/CMakeFiles/OpenModelicaRuntimeCUtilMMC.dir/write_csv.c.gcda:Skip
profiling:/var/lib/jenkins1:Cannot create directory
profiling:/var/lib/jenkins1/ws/OpenModelica/build_cmake/OMCompiler/SimulationRuntime/c/util/CMakeFiles/OpenModelicaRuntimeCUtilMMC.dir/tinymt64.c.gcda:Skip
profiling:/var/lib/jenkins1:Cannot create directory
profiling:/var/lib/jenkins1/ws/OpenModelica/build_cmake/OMCompiler/SimulationRuntime/c/util/CMakeFiles/OpenModelicaRuntimeCUtilMMC.dir/read_matlab4.c.gcda:Skip
profiling:/var/lib/jenkins1:Cannot create directory
profiling:/var/lib/jenkins1/ws/OpenModelica/build_cmake/OMCompiler/SimulationRuntime/c/util/CMakeFiles/OpenModelicaRuntimeCUtilMMC.dir/read_csv.c.gcda:Skip
profiling:/var/lib/jenkins1:Cannot create directory
profiling:/var/lib/jenkins1/ws/OpenModelica/build_cmake/OMCompiler/SimulationRuntime/c/util/CMakeFiles/OpenModelicaRuntimeCUtilMMC.dir/omc_numbers.c.gcda:Skip
profiling:/var/lib/jenkins1:Cannot create directory
profiling:/var/lib/jenkins1/ws/OpenModelica/build_cmake/OMCompiler/SimulationRuntime/c/util/CMakeFiles/OpenModelicaRuntimeCUtilMMC.dir/OldModelicaTables.c.gcda:Skip
profiling:/var/lib/jenkins1:Cannot create directory
profiling:/var/lib/jenkins1/ws/OpenModelica/build_cmake/OMCompiler/SimulationRuntime/c/util/CMakeFiles/OpenModelicaRuntimeCUtilMMC.dir/libcsv.c.gcda:Skip
profiling:/var/lib/jenkins1:Cannot create directory
profiling:/var/lib/jenkins1/ws/OpenModelica/build_cmake/OMCompiler/SimulationRuntime/c/meta/CMakeFiles/OpenModelicaRuntimeMMC.dir/meta_modelica_catch.c.gcda:Skip
[ 79%] Translating HashTableSimCodeEqCache.mo for MSVC
profiling:/var/lib/jenkins1:Cannot create directory
profiling:/var/lib/jenkins1/ws/OpenModelica/build_cmake/OMCompiler/SimulationRuntime/c/util/CMakeFiles/OpenModelicaRuntimeCUtilMMC.dir/write_matlab4.c.gcda:Skip
profiling:/var/lib/jenkins1:Cannot create directory
profiling:/var/lib/jenkins1/ws/OpenModelica/build_cmake/OMCompiler/SimulationRuntime/c/util/CMakeFiles/OpenModelicaRuntimeCUtilMMC.dir/write_csv.c.gcda:Skip
profiling:/var/lib/jenkins1:Cannot create directory
profiling:/var/lib/jenkins1/ws/OpenModelica/build_cmake/OMCompiler/SimulationRuntime/c/util/CMakeFiles/OpenModelicaRuntimeCUtilMMC.dir/tinymt64.c.gcda:Skip
profiling:/var/lib/jenkins1:Cannot create directory
profiling:/var/lib/jenkins1/ws/OpenModelica/build_cmake/OMCompiler/SimulationRuntime/c/util/CMakeFiles/OpenModelicaRuntimeCUtilMMC.dir/read_matlab4.c.gcda:Skip
profiling:/var/lib/jenkins1:Cannot create directory
profiling:/var/lib/jenkins1/ws/OpenModelica/build_cmake/OMCompiler/SimulationRuntime/c/util/CMakeFiles/OpenModelicaRuntimeCUtilMMC.dir/read_csv.c.gcda:Skip
profiling:/var/lib/jenkins1:Cannot create directory
profiling:/var/lib/jenkins1/ws/OpenModelica/build_cmake/OMCompiler/SimulationRuntime/c/util/CMakeFiles/OpenModelicaRuntimeCUtilMMC.dir/omc_numbers.c.gcda:Skip
profiling:/var/lib/jenkins1:Cannot create directory
profiling:/var/lib/jenkins1/ws/OpenModelica/build_cmake/OMCompiler/SimulationRuntime/c/util/CMakeFiles/OpenModelicaRuntimeCUtilMMC.dir/OldModelicaTables.c.gcda:Skip
profiling:/var/lib/jenkins1:Cannot create directory
profiling:/var/lib/jenkins1/ws/OpenModelica/build_cmake/OMCompiler/SimulationRuntime/c/util/CMakeFiles/OpenModelicaRuntimeCUtilMMC.dir/libcsv.c.gcda:Skip
profiling:/var/lib/jenkins1:Cannot create directory
profiling:/var/lib/jenkins1/ws/OpenModelica/build_cmake/OMCompiler/SimulationRuntime/c/meta/CMakeFiles/OpenModelicaRuntimeMMC.dir/meta_modelica_catch.c.gcda:Skip
[ 79%] Translating HashTableSM1.mo for MSVC
profiling:/var/lib/jenkins1:Cannot create directory
profiling:/var/lib/jenkins1/ws/OpenModelica/build_cmake/OMCompiler/SimulationRuntime/c/util/CMakeFiles/OpenModelicaRuntimeCUtilMMC.dir/write_matlab4.c.gcda:Skip
profiling:/var/lib/jenkins1:Cannot create directory
profiling:/var/lib/jenkins1/ws/OpenModelica/build_cmake/OMCompiler/SimulationRuntime/c/util/CMakeFiles/OpenModelicaRuntimeCUtilMMC.dir/write_csv.c.gcda:Skip
profiling:/var/lib/jenkins1:Cannot create directory
profiling:/var/lib/jenkins1/ws/OpenModelica/build_cmake/OMCompiler/SimulationRuntime/c/util/CMakeFiles/OpenModelicaRuntimeCUtilMMC.dir/tinymt64.c.gcda:Skip
profiling:/var/lib/jenkins1:Cannot create directory
profiling:/var/lib/jenkins1/ws/OpenModelica/build_cmake/OMCompiler/SimulationRuntime/c/util/CMakeFiles/OpenModelicaRuntimeCUtilMMC.dir/read_matlab4.c.gcda:Skip
profiling:/var/lib/jenkins1:Cannot create directory
profiling:/var/lib/jenkins1/ws/OpenModelica/build_cmake/OMCompiler/SimulationRuntime/c/util/CMakeFiles/OpenModelicaRuntimeCUtilMMC.dir/read_csv.c.gcda:Skip
profiling:/var/lib/jenkins1:Cannot create directory
profiling:/var/lib/jenkins1/ws/OpenModelica/build_cmake/OMCompiler/SimulationRuntime/c/util/CMakeFiles/OpenModelicaRuntimeCUtilMMC.dir/omc_numbers.c.gcda:Skip
profiling:/var/lib/jenkins1:Cannot create directory
profiling:/var/lib/jenkins1/ws/OpenModelica/build_cmake/OMCompiler/SimulationRuntime/c/util/CMakeFiles/OpenModelicaRuntimeCUtilMMC.dir/OldModelicaTables.c.gcda:Skip
profiling:/var/lib/jenkins1:Cannot create directory
profiling:/var/lib/jenkins1/ws/OpenModelica/build_cmake/OMCompiler/SimulationRuntime/c/util/CMakeFiles/OpenModelicaRuntimeCUtilMMC.dir/libcsv.c.gcda:Skip
profiling:/var/lib/jenkins1:Cannot create directory
profiling:/var/lib/jenkins1/ws/OpenModelica/build_cmake/OMCompiler/SimulationRuntime/c/meta/CMakeFiles/OpenModelicaRuntimeMMC.dir/meta_modelica_catch.c.gcda:Skip
[ 79%] Translating OMGraphics.mo for MSVC
profiling:/var/lib/jenkins1:Cannot create directory
profiling:/var/lib/jenkins1/ws/OpenModelica/build_cmake/OMCompiler/SimulationRuntime/c/util/CMakeFiles/OpenModelicaRuntimeCUtilMMC.dir/write_matlab4.c.gcda:Skip
profiling:/var/lib/jenkins1:Cannot create directory
profiling:/var/lib/jenkins1/ws/OpenModelica/build_cmake/OMCompiler/SimulationRuntime/c/util/CMakeFiles/OpenModelicaRuntimeCUtilMMC.dir/write_csv.c.gcda:Skip
profiling:/var/lib/jenkins1:Cannot create directory
profiling:/var/lib/jenkins1/ws/OpenModelica/build_cmake/OMCompiler/SimulationRuntime/c/util/CMakeFiles/OpenModelicaRuntimeCUtilMMC.dir/tinymt64.c.gcda:Skip
profiling:/var/lib/jenkins1:Cannot create directory
profiling:/var/lib/jenkins1/ws/OpenModelica/build_cmake/OMCompiler/SimulationRuntime/c/util/CMakeFiles/OpenModelicaRuntimeCUtilMMC.dir/read_matlab4.c.gcda:Skip
profiling:/var/lib/jenkins1:Cannot create directory
profiling:/var/lib/jenkins1/ws/OpenModelica/build_cmake/OMCompiler/SimulationRuntime/c/util/CMakeFiles/OpenModelicaRuntimeCUtilMMC.dir/read_csv.c.gcda:Skip
profiling:/var/lib/jenkins1:Cannot create directory
profiling:/var/lib/jenkins1/ws/OpenModelica/build_cmake/OMCompiler/SimulationRuntime/c/util/CMakeFiles/OpenModelicaRuntimeCUtilMMC.dir/omc_numbers.c.gcda:Skip
profiling:/var/lib/jenkins1:Cannot create directory
profiling:/var/lib/jenkins1/ws/OpenModelica/build_cmake/OMCompiler/SimulationRuntime/c/util/CMakeFiles/OpenModelicaRuntimeCUtilMMC.dir/OldModelicaTables.c.gcda:Skip
profiling:/var/lib/jenkins1:Cannot create directory
profiling:/var/lib/jenkins1/ws/OpenModelica/build_cmake/OMCompiler/SimulationRuntime/c/util/CMakeFiles/OpenModelicaRuntimeCUtilMMC.dir/libcsv.c.gcda:Skip
profiling:/var/lib/jenkins1:Cannot create directory
profiling:/var/lib/jenkins1/ws/OpenModelica/build_cmake/OMCompiler/SimulationRuntime/c/meta/CMakeFiles/OpenModelicaRuntimeMMC.dir/meta_modelica_catch.c.gcda:Skip
[ 79%] Translating OMSimulatorExt.mo for MSVC
profiling:/var/lib/jenkins1:Cannot create directory
profiling:/var/lib/jenkins1/ws/OpenModelica/build_cmake/OMCompiler/SimulationRuntime/c/util/CMakeFiles/OpenModelicaRuntimeCUtilMMC.dir/write_matlab4.c.gcda:Skip
profiling:/var/lib/jenkins1:Cannot create directory
profiling:/var/lib/jenkins1/ws/OpenModelica/build_cmake/OMCompiler/SimulationRuntime/c/util/CMakeFiles/OpenModelicaRuntimeCUtilMMC.dir/write_csv.c.gcda:Skip
profiling:/var/lib/jenkins1:Cannot create directory
profiling:/var/lib/jenkins1/ws/OpenModelica/build_cmake/OMCompiler/SimulationRuntime/c/util/CMakeFiles/OpenModelicaRuntimeCUtilMMC.dir/tinymt64.c.gcda:Skip
profiling:/var/lib/jenkins1:Cannot create directory
profiling:/var/lib/jenkins1/ws/OpenModelica/build_cmake/OMCompiler/SimulationRuntime/c/util/CMakeFiles/OpenModelicaRuntimeCUtilMMC.dir/read_matlab4.c.gcda:Skip
profiling:/var/lib/jenkins1:Cannot create directory
profiling:/var/lib/jenkins1/ws/OpenModelica/build_cmake/OMCompiler/SimulationRuntime/c/util/CMakeFiles/OpenModelicaRuntimeCUtilMMC.dir/read_csv.c.gcda:Skip
profiling:/var/lib/jenkins1:Cannot create directory
profiling:/var/lib/jenkins1/ws/OpenModelica/build_cmake/OMCompiler/SimulationRuntime/c/util/CMakeFiles/OpenModelicaRuntimeCUtilMMC.dir/omc_numbers.c.gcda:Skip
profiling:/var/lib/jenkins1:Cannot create directory
profiling:/var/lib/jenkins1/ws/OpenModelica/build_cmake/OMCompiler/SimulationRuntime/c/util/CMakeFiles/OpenModelicaRuntimeCUtilMMC.dir/OldModelicaTables.c.gcda:Skip
profiling:/var/lib/jenkins1:Cannot create directory
profiling:/var/lib/jenkins1/ws/OpenModelica/build_cmake/OMCompiler/SimulationRuntime/c/util/CMakeFiles/OpenModelicaRuntimeCUtilMMC.dir/libcsv.c.gcda:Skip
profiling:/var/lib/jenkins1:Cannot create directory
profiling:/var/lib/jenkins1/ws/OpenModelica/build_cmake/OMCompiler/SimulationRuntime/c/util/CMakeFiles/OpenModelicaRuntimeCUtilMMC.dir/write_matlab4.c.gcda:Skip
profiling:/var/lib/jenkins1:Cannot create directory
profiling:/var/lib/jenkins1/ws/OpenModelica/build_cmake/OMCompiler/SimulationRuntime/c/util/CMakeFiles/OpenModelicaRuntimeCUtilMMC.dir/write_csv.c.gcda:Skip
profiling:/var/lib/jenkins1:Cannot create directory
profiling:/var/lib/jenkins1/ws/OpenModelica/build_cmake/OMCompiler/SimulationRuntime/c/util/CMakeFiles/OpenModelicaRuntimeCUtilMMC.dir/tinymt64.c.gcda:Skip
profiling:/var/lib/jenkins1:Cannot create directory
profiling:/var/lib/jenkins1/ws/OpenModelica/build_cmake/OMCompiler/SimulationRuntime/c/util/CMakeFiles/OpenModelicaRuntimeCUtilMMC.dir/read_matlab4.c.gcda:Skip
profiling:/var/lib/jenkins1:Cannot create directory
profiling:/var/lib/jenkins1/ws/OpenModelica/build_cmake/OMCompiler/SimulationRuntime/c/util/CMakeFiles/OpenModelicaRuntimeCUtilMMC.dir/read_csv.c.gcda:Skip
profiling:/var/lib/jenkins1:Cannot create directory
profiling:/var/lib/jenkins1/ws/OpenModelica/build_cmake/OMCompiler/SimulationRuntime/c/util/CMakeFiles/OpenModelicaRuntimeCUtilMMC.dir/omc_numbers.c.gcda:Skip
profiling:/var/lib/jenkins1:Cannot create directory
profiling:/var/lib/jenkins1:Cannot create directory
profiling:/var/lib/jenkins1/ws/OpenModelica/build_cmake/OMCompiler/SimulationRuntime/c/meta/CMakeFiles/OpenModelicaRuntimeMMC.dir/meta_modelica_catch.c.gcda:Skip
profiling:/var/lib/jenkins1/ws/OpenModelica/build_cmake/OMCompiler/SimulationRuntime/c/util/CMakeFiles/OpenModelicaRuntimeCUtilMMC.dir/OldModelicaTables.c.gcda:Skip
profiling:/var/lib/jenkins1:Cannot create directory
profiling:/var/lib/jenkins1/ws/OpenModelica/build_cmake/OMCompiler/SimulationRuntime/c/util/CMakeFiles/OpenModelicaRuntimeCUtilMMC.dir/libcsv.c.gcda:Skip
profiling:/var/lib/jenkins1:Cannot create directory
profiling:/var/lib/jenkins1/ws/OpenModelica/build_cmake/OMCompiler/SimulationRuntime/c/meta/CMakeFiles/OpenModelicaRuntimeMMC.dir/meta_modelica_catch.c.gcda:Skip
[ 79%] Translating PriorityQueue.mo for MSVC
[ 79%] Translating Rational.mo for MSVC
profiling:/var/lib/jenkins1:Cannot create directory
profiling:/var/lib/jenkins1/ws/OpenModelica/build_cmake/OMCompiler/SimulationRuntime/c/util/CMakeFiles/OpenModelicaRuntimeCUtilMMC.dir/write_matlab4.c.gcda:Skip
profiling:/var/lib/jenkins1:Cannot create directory
profiling:/var/lib/jenkins1/ws/OpenModelica/build_cmake/OMCompiler/SimulationRuntime/c/util/CMakeFiles/OpenModelicaRuntimeCUtilMMC.dir/write_csv.c.gcda:Skip
profiling:/var/lib/jenkins1:Cannot create directory
profiling:/var/lib/jenkins1/ws/OpenModelica/build_cmake/OMCompiler/SimulationRuntime/c/util/CMakeFiles/OpenModelicaRuntimeCUtilMMC.dir/tinymt64.c.gcda:Skip
profiling:/var/lib/jenkins1:Cannot create directory
profiling:/var/lib/jenkins1/ws/OpenModelica/build_cmake/OMCompiler/SimulationRuntime/c/util/CMakeFiles/OpenModelicaRuntimeCUtilMMC.dir/read_matlab4.c.gcda:Skip
profiling:/var/lib/jenkins1:Cannot create directory
profiling:/var/lib/jenkins1/ws/OpenModelica/build_cmake/OMCompiler/SimulationRuntime/c/util/CMakeFiles/OpenModelicaRuntimeCUtilMMC.dir/read_csv.c.gcda:Skip
profiling:/var/lib/jenkins1:Cannot create directory
profiling:/var/lib/jenkins1/ws/OpenModelica/build_cmake/OMCompiler/SimulationRuntime/c/util/CMakeFiles/OpenModelicaRuntimeCUtilMMC.dir/omc_numbers.c.gcda:Skip
profiling:/var/lib/jenkins1:Cannot create directory
profiling:/var/lib/jenkins1/ws/OpenModelica/build_cmake/OMCompiler/SimulationRuntime/c/util/CMakeFiles/OpenModelicaRuntimeCUtilMMC.dir/OldModelicaTables.c.gcda:Skip
profiling:/var/lib/jenkins1:Cannot create directory
profiling:/var/lib/jenkins1/ws/OpenModelica/build_cmake/OMCompiler/SimulationRuntime/c/util/CMakeFiles/OpenModelicaRuntimeCUtilMMC.dir/libcsv.c.gcda:Skip
profiling:/var/lib/jenkins1:Cannot create directory
profiling:/var/lib/jenkins1/ws/OpenModelica/build_cmake/OMCompiler/SimulationRuntime/c/meta/CMakeFiles/OpenModelicaRuntimeMMC.dir/meta_modelica_catch.c.gcda:Skip
[ 82%] Translating SBAtomicSet.mo for MSVC
profiling:/var/lib/jenkins1:Cannot create directory
profiling:/var/lib/jenkins1/ws/OpenModelica/build_cmake/OMCompiler/SimulationRuntime/c/util/CMakeFiles/OpenModelicaRuntimeCUtilMMC.dir/write_matlab4.c.gcda:Skip
profiling:/var/lib/jenkins1:Cannot create directory
profiling:/var/lib/jenkins1/ws/OpenModelica/build_cmake/OMCompiler/SimulationRuntime/c/util/CMakeFiles/OpenModelicaRuntimeCUtilMMC.dir/write_csv.c.gcda:Skip
profiling:/var/lib/jenkins1:Cannot create directory
profiling:/var/lib/jenkins1/ws/OpenModelica/build_cmake/OMCompiler/SimulationRuntime/c/util/CMakeFiles/OpenModelicaRuntimeCUtilMMC.dir/tinymt64.c.gcda:Skip
profiling:/var/lib/jenkins1:Cannot create directory
profiling:/var/lib/jenkins1/ws/OpenModelica/build_cmake/OMCompiler/SimulationRuntime/c/util/CMakeFiles/OpenModelicaRuntimeCUtilMMC.dir/read_matlab4.c.gcda:Skip
profiling:/var/lib/jenkins1:Cannot create directory
profiling:/var/lib/jenkins1/ws/OpenModelica/build_cmake/OMCompiler/SimulationRuntime/c/util/CMakeFiles/OpenModelicaRuntimeCUtilMMC.dir/read_csv.c.gcda:Skip
profiling:/var/lib/jenkins1:Cannot create directory
profiling:/var/lib/jenkins1/ws/OpenModelica/build_cmake/OMCompiler/SimulationRuntime/c/util/CMakeFiles/OpenModelicaRuntimeCUtilMMC.dir/omc_numbers.c.gcda:Skip
profiling:/var/lib/jenkins1:Cannot create directory
profiling:/var/lib/jenkins1/ws/OpenModelica/build_cmake/OMCompiler/SimulationRuntime/c/util/CMakeFiles/OpenModelicaRuntimeCUtilMMC.dir/OldModelicaTables.c.gcda:Skip
profiling:/var/lib/jenkins1:Cannot create directory
profiling:/var/lib/jenkins1/ws/OpenModelica/build_cmake/OMCompiler/SimulationRuntime/c/util/CMakeFiles/OpenModelicaRuntimeCUtilMMC.dir/libcsv.c.gcda:Skip
profiling:/var/lib/jenkins1:Cannot create directory
profiling:/var/lib/jenkins1/ws/OpenModelica/build_cmake/OMCompiler/SimulationRuntime/c/meta/CMakeFiles/OpenModelicaRuntimeMMC.dir/meta_modelica_catch.c.gcda:Skip
[ 82%] Translating SBFunctions.mo for MSVC
profiling:/var/lib/jenkins1:Cannot create directory
profiling:/var/lib/jenkins1/ws/OpenModelica/build_cmake/OMCompiler/SimulationRuntime/c/util/CMakeFiles/OpenModelicaRuntimeCUtilMMC.dir/write_matlab4.c.gcda:Skip
profiling:/var/lib/jenkins1:Cannot create directory
profiling:/var/lib/jenkins1/ws/OpenModelica/build_cmake/OMCompiler/SimulationRuntime/c/util/CMakeFiles/OpenModelicaRuntimeCUtilMMC.dir/write_csv.c.gcda:Skip
profiling:/var/lib/jenkins1:Cannot create directory
profiling:/var/lib/jenkins1/ws/OpenModelica/build_cmake/OMCompiler/SimulationRuntime/c/util/CMakeFiles/OpenModelicaRuntimeCUtilMMC.dir/tinymt64.c.gcda:Skip
profiling:/var/lib/jenkins1:Cannot create directory
profiling:/var/lib/jenkins1/ws/OpenModelica/build_cmake/OMCompiler/SimulationRuntime/c/util/CMakeFiles/OpenModelicaRuntimeCUtilMMC.dir/read_matlab4.c.gcda:Skip
profiling:/var/lib/jenkins1:Cannot create directory
profiling:/var/lib/jenkins1/ws/OpenModelica/build_cmake/OMCompiler/SimulationRuntime/c/util/CMakeFiles/OpenModelicaRuntimeCUtilMMC.dir/read_csv.c.gcda:Skip
profiling:/var/lib/jenkins1:Cannot create directory
profiling:/var/lib/jenkins1/ws/OpenModelica/build_cmake/OMCompiler/SimulationRuntime/c/util/CMakeFiles/OpenModelicaRuntimeCUtilMMC.dir/omc_numbers.c.gcda:Skip
profiling:/var/lib/jenkins1:Cannot create directory
profiling:/var/lib/jenkins1/ws/OpenModelica/build_cmake/OMCompiler/SimulationRuntime/c/util/CMakeFiles/OpenModelicaRuntimeCUtilMMC.dir/OldModelicaTables.c.gcda:Skip
profiling:/var/lib/jenkins1:Cannot create directory
profiling:/var/lib/jenkins1/ws/OpenModelica/build_cmake/OMCompiler/SimulationRuntime/c/util/CMakeFiles/OpenModelicaRuntimeCUtilMMC.dir/libcsv.c.gcda:Skip
profiling:/var/lib/jenkins1:Cannot create directory
profiling:/var/lib/jenkins1/ws/OpenModelica/build_cmake/OMCompiler/SimulationRuntime/c/meta/CMakeFiles/OpenModelicaRuntimeMMC.dir/meta_modelica_catch.c.gcda:Skip
[ 82%] Translating SBGraph.mo for MSVC
profiling:/var/lib/jenkins1:Cannot create directory
profiling:/var/lib/jenkins1/ws/OpenModelica/build_cmake/OMCompiler/SimulationRuntime/c/util/CMakeFiles/OpenModelicaRuntimeCUtilMMC.dir/write_matlab4.c.gcda:Skip
profiling:/var/lib/jenkins1:Cannot create directory
profiling:/var/lib/jenkins1/ws/OpenModelica/build_cmake/OMCompiler/SimulationRuntime/c/util/CMakeFiles/OpenModelicaRuntimeCUtilMMC.dir/write_csv.c.gcda:Skip
profiling:/var/lib/jenkins1:Cannot create directory
profiling:/var/lib/jenkins1/ws/OpenModelica/build_cmake/OMCompiler/SimulationRuntime/c/util/CMakeFiles/OpenModelicaRuntimeCUtilMMC.dir/tinymt64.c.gcda:Skip
profiling:/var/lib/jenkins1:Cannot create directory
profiling:/var/lib/jenkins1/ws/OpenModelica/build_cmake/OMCompiler/SimulationRuntime/c/util/CMakeFiles/OpenModelicaRuntimeCUtilMMC.dir/read_matlab4.c.gcda:Skip
profiling:/var/lib/jenkins1:Cannot create directory
profiling:/var/lib/jenkins1/ws/OpenModelica/build_cmake/OMCompiler/SimulationRuntime/c/util/CMakeFiles/OpenModelicaRuntimeCUtilMMC.dir/read_csv.c.gcda:Skip
profiling:/var/lib/jenkins1:Cannot create directory
profiling:/var/lib/jenkins1/ws/OpenModelica/build_cmake/OMCompiler/SimulationRuntime/c/util/CMakeFiles/OpenModelicaRuntimeCUtilMMC.dir/omc_numbers.c.gcda:Skip
profiling:/var/lib/jenkins1:Cannot create directory
profiling:/var/lib/jenkins1/ws/OpenModelica/build_cmake/OMCompiler/SimulationRuntime/c/util/CMakeFiles/OpenModelicaRuntimeCUtilMMC.dir/OldModelicaTables.c.gcda:Skip
profiling:/var/lib/jenkins1:Cannot create directory
profiling:/var/lib/jenkins1/ws/OpenModelica/build_cmake/OMCompiler/SimulationRuntime/c/util/CMakeFiles/OpenModelicaRuntimeCUtilMMC.dir/libcsv.c.gcda:Skip
profiling:/var/lib/jenkins1:Cannot create directory
profiling:/var/lib/jenkins1/ws/OpenModelica/build_cmake/OMCompiler/SimulationRuntime/c/meta/CMakeFiles/OpenModelicaRuntimeMMC.dir/meta_modelica_catch.c.gcda:Skip
profiling:/var/lib/jenkins1:Cannot create directory
profiling:/var/lib/jenkins1/ws/OpenModelica/build_cmake/OMCompiler/SimulationRuntime/c/util/CMakeFiles/OpenModelicaRuntimeCUtilMMC.dir/write_matlab4.c.gcda:Skip
profiling:/var/lib/jenkins1:Cannot create directory
profiling:/var/lib/jenkins1/ws/OpenModelica/build_cmake/OMCompiler/SimulationRuntime/c/util/CMakeFiles/OpenModelicaRuntimeCUtilMMC.dir/write_csv.c.gcda:Skip
profiling:/var/lib/jenkins1:Cannot create directory
profiling:/var/lib/jenkins1/ws/OpenModelica/build_cmake/OMCompiler/SimulationRuntime/c/util/CMakeFiles/OpenModelicaRuntimeCUtilMMC.dir/tinymt64.c.gcda:Skip
profiling:/var/lib/jenkins1:Cannot create directory
profiling:/var/lib/jenkins1/ws/OpenModelica/build_cmake/OMCompiler/SimulationRuntime/c/util/CMakeFiles/OpenModelicaRuntimeCUtilMMC.dir/read_matlab4.c.gcda:Skip
profiling:/var/lib/jenkins1:Cannot create directory
profiling:/var/lib/jenkins1/ws/OpenModelica/build_cmake/OMCompiler/SimulationRuntime/c/util/CMakeFiles/OpenModelicaRuntimeCUtilMMC.dir/read_csv.c.gcda:Skip
profiling:/var/lib/jenkins1:Cannot create directory
profiling:/var/lib/jenkins1/ws/OpenModelica/build_cmake/OMCompiler/SimulationRuntime/c/util/CMakeFiles/OpenModelicaRuntimeCUtilMMC.dir/omc_numbers.c.gcda:Skip
profiling:/var/lib/jenkins1:Cannot create directory
profiling:/var/lib/jenkins1/ws/OpenModelica/build_cmake/OMCompiler/SimulationRuntime/c/util/CMakeFiles/OpenModelicaRuntimeCUtilMMC.dir/OldModelicaTables.c.gcda:Skip
profiling:/var/lib/jenkins1:Cannot create directory
profiling:/var/lib/jenkins1/ws/OpenModelica/build_cmake/OMCompiler/SimulationRuntime/c/util/CMakeFiles/OpenModelicaRuntimeCUtilMMC.dir/libcsv.c.gcda:Skip
profiling:/var/lib/jenkins1:Cannot create directory
profiling:/var/lib/jenkins1/ws/OpenModelica/build_cmake/OMCompiler/SimulationRuntime/c/meta/CMakeFiles/OpenModelicaRuntimeMMC.dir/meta_modelica_catch.c.gcda:Skip
[ 82%] Translating SBInterval.mo for MSVC
[ 82%] Translating SBLinearMap.mo for MSVC
profiling:/var/lib/jenkins1:Cannot create directory
profiling:/var/lib/jenkins1/ws/OpenModelica/build_cmake/OMCompiler/SimulationRuntime/c/util/CMakeFiles/OpenModelicaRuntimeCUtilMMC.dir/write_matlab4.c.gcda:Skip
profiling:/var/lib/jenkins1:Cannot create directory
profiling:/var/lib/jenkins1/ws/OpenModelica/build_cmake/OMCompiler/SimulationRuntime/c/util/CMakeFiles/OpenModelicaRuntimeCUtilMMC.dir/write_csv.c.gcda:Skip
profiling:/var/lib/jenkins1:Cannot create directory
profiling:/var/lib/jenkins1/ws/OpenModelica/build_cmake/OMCompiler/SimulationRuntime/c/util/CMakeFiles/OpenModelicaRuntimeCUtilMMC.dir/tinymt64.c.gcda:Skip
profiling:/var/lib/jenkins1:Cannot create directory
profiling:/var/lib/jenkins1/ws/OpenModelica/build_cmake/OMCompiler/SimulationRuntime/c/util/CMakeFiles/OpenModelicaRuntimeCUtilMMC.dir/read_matlab4.c.gcda:Skip
profiling:/var/lib/jenkins1:Cannot create directory
profiling:/var/lib/jenkins1/ws/OpenModelica/build_cmake/OMCompiler/SimulationRuntime/c/util/CMakeFiles/OpenModelicaRuntimeCUtilMMC.dir/read_csv.c.gcda:Skip
profiling:/var/lib/jenkins1:Cannot create directory
profiling:/var/lib/jenkins1/ws/OpenModelica/build_cmake/OMCompiler/SimulationRuntime/c/util/CMakeFiles/OpenModelicaRuntimeCUtilMMC.dir/omc_numbers.c.gcda:Skip
profiling:/var/lib/jenkins1:Cannot create directory
profiling:/var/lib/jenkins1/ws/OpenModelica/build_cmake/OMCompiler/SimulationRuntime/c/util/CMakeFiles/OpenModelicaRuntimeCUtilMMC.dir/OldModelicaTables.c.gcda:Skip
profiling:/var/lib/jenkins1:Cannot create directory
profiling:/var/lib/jenkins1/ws/OpenModelica/build_cmake/OMCompiler/SimulationRuntime/c/util/CMakeFiles/OpenModelicaRuntimeCUtilMMC.dir/libcsv.c.gcda:Skip
profiling:/var/lib/jenkins1:Cannot create directory
profiling:/var/lib/jenkins1/ws/OpenModelica/build_cmake/OMCompiler/SimulationRuntime/c/meta/CMakeFiles/OpenModelicaRuntimeMMC.dir/meta_modelica_catch.c.gcda:Skip
[ 82%] Translating SBMultiInterval.mo for MSVC
profiling:/var/lib/jenkins1:Cannot create directory
profiling:/var/lib/jenkins1/ws/OpenModelica/build_cmake/OMCompiler/SimulationRuntime/c/util/CMakeFiles/OpenModelicaRuntimeCUtilMMC.dir/write_matlab4.c.gcda:Skip
profiling:/var/lib/jenkins1:Cannot create directory
profiling:/var/lib/jenkins1/ws/OpenModelica/build_cmake/OMCompiler/SimulationRuntime/c/util/CMakeFiles/OpenModelicaRuntimeCUtilMMC.dir/write_csv.c.gcda:Skip
profiling:/var/lib/jenkins1:Cannot create directory
profiling:/var/lib/jenkins1/ws/OpenModelica/build_cmake/OMCompiler/SimulationRuntime/c/util/CMakeFiles/OpenModelicaRuntimeCUtilMMC.dir/tinymt64.c.gcda:Skip
profiling:/var/lib/jenkins1:Cannot create directory
profiling:/var/lib/jenkins1/ws/OpenModelica/build_cmake/OMCompiler/SimulationRuntime/c/util/CMakeFiles/OpenModelicaRuntimeCUtilMMC.dir/read_matlab4.c.gcda:Skip
profiling:/var/lib/jenkins1:Cannot create directory
profiling:/var/lib/jenkins1/ws/OpenModelica/build_cmake/OMCompiler/SimulationRuntime/c/util/CMakeFiles/OpenModelicaRuntimeCUtilMMC.dir/read_csv.c.gcda:Skip
profiling:/var/lib/jenkins1:Cannot create directory
profiling:/var/lib/jenkins1/ws/OpenModelica/build_cmake/OMCompiler/SimulationRuntime/c/util/CMakeFiles/OpenModelicaRuntimeCUtilMMC.dir/omc_numbers.c.gcda:Skip
profiling:/var/lib/jenkins1:Cannot create directory
profiling:/var/lib/jenkins1/ws/OpenModelica/build_cmake/OMCompiler/SimulationRuntime/c/util/CMakeFiles/OpenModelicaRuntimeCUtilMMC.dir/OldModelicaTables.c.gcda:Skip
profiling:/var/lib/jenkins1:Cannot create directory
profiling:/var/lib/jenkins1/ws/OpenModelica/build_cmake/OMCompiler/SimulationRuntime/c/util/CMakeFiles/OpenModelicaRuntimeCUtilMMC.dir/libcsv.c.gcda:Skip
profiling:/var/lib/jenkins1:Cannot create directory
profiling:/var/lib/jenkins1/ws/OpenModelica/build_cmake/OMCompiler/SimulationRuntime/c/meta/CMakeFiles/OpenModelicaRuntimeMMC.dir/meta_modelica_catch.c.gcda:Skip
[ 82%] Translating SBPWAtomicLinearMap.mo for MSVC
profiling:/var/lib/jenkins1:Cannot create directory
profiling:/var/lib/jenkins1/ws/OpenModelica/build_cmake/OMCompiler/SimulationRuntime/c/util/CMakeFiles/OpenModelicaRuntimeCUtilMMC.dir/write_matlab4.c.gcda:Skip
profiling:/var/lib/jenkins1:Cannot create directory
profiling:/var/lib/jenkins1/ws/OpenModelica/build_cmake/OMCompiler/SimulationRuntime/c/util/CMakeFiles/OpenModelicaRuntimeCUtilMMC.dir/write_csv.c.gcda:Skip
profiling:/var/lib/jenkins1:Cannot create directory
profiling:/var/lib/jenkins1/ws/OpenModelica/build_cmake/OMCompiler/SimulationRuntime/c/util/CMakeFiles/OpenModelicaRuntimeCUtilMMC.dir/tinymt64.c.gcda:Skip
profiling:/var/lib/jenkins1:Cannot create directory
profiling:/var/lib/jenkins1/ws/OpenModelica/build_cmake/OMCompiler/SimulationRuntime/c/util/CMakeFiles/OpenModelicaRuntimeCUtilMMC.dir/read_matlab4.c.gcda:Skip
profiling:/var/lib/jenkins1:Cannot create directory
profiling:/var/lib/jenkins1/ws/OpenModelica/build_cmake/OMCompiler/SimulationRuntime/c/util/CMakeFiles/OpenModelicaRuntimeCUtilMMC.dir/read_csv.c.gcda:Skip
profiling:/var/lib/jenkins1:Cannot create directory
profiling:/var/lib/jenkins1/ws/OpenModelica/build_cmake/OMCompiler/SimulationRuntime/c/util/CMakeFiles/OpenModelicaRuntimeCUtilMMC.dir/omc_numbers.c.gcda:Skip
profiling:/var/lib/jenkins1:Cannot create directory
profiling:/var/lib/jenkins1/ws/OpenModelica/build_cmake/OMCompiler/SimulationRuntime/c/util/CMakeFiles/OpenModelicaRuntimeCUtilMMC.dir/OldModelicaTables.c.gcda:Skip
profiling:/var/lib/jenkins1:Cannot create directory
profiling:/var/lib/jenkins1/ws/OpenModelica/build_cmake/OMCompiler/SimulationRuntime/c/util/CMakeFiles/OpenModelicaRuntimeCUtilMMC.dir/libcsv.c.gcda:Skip
profiling:/var/lib/jenkins1:Cannot create directory
profiling:/var/lib/jenkins1/ws/OpenModelica/build_cmake/OMCompiler/SimulationRuntime/c/meta/CMakeFiles/OpenModelicaRuntimeMMC.dir/meta_modelica_catch.c.gcda:Skip
profiling:/var/lib/jenkins1:Cannot create directory
profiling:/var/lib/jenkins1/ws/OpenModelica/build_cmake/OMCompiler/SimulationRuntime/c/util/CMakeFiles/OpenModelicaRuntimeCUtilMMC.dir/write_matlab4.c.gcda:Skip
profiling:/var/lib/jenkins1:Cannot create directory
profiling:/var/lib/jenkins1/ws/OpenModelica/build_cmake/OMCompiler/SimulationRuntime/c/util/CMakeFiles/OpenModelicaRuntimeCUtilMMC.dir/write_csv.c.gcda:Skip
profiling:/var/lib/jenkins1:Cannot create directory
profiling:/var/lib/jenkins1/ws/OpenModelica/build_cmake/OMCompiler/SimulationRuntime/c/util/CMakeFiles/OpenModelicaRuntimeCUtilMMC.dir/tinymt64.c.gcda:Skip
profiling:/var/lib/jenkins1:Cannot create directory
profiling:/var/lib/jenkins1/ws/OpenModelica/build_cmake/OMCompiler/SimulationRuntime/c/util/CMakeFiles/OpenModelicaRuntimeCUtilMMC.dir/read_matlab4.c.gcda:Skip
profiling:/var/lib/jenkins1:Cannot create directory
profiling:/var/lib/jenkins1/ws/OpenModelica/build_cmake/OMCompiler/SimulationRuntime/c/util/CMakeFiles/OpenModelicaRuntimeCUtilMMC.dir/read_csv.c.gcda:Skip
profiling:/var/lib/jenkins1:Cannot create directory
profiling:/var/lib/jenkins1/ws/OpenModelica/build_cmake/OMCompiler/SimulationRuntime/c/util/CMakeFiles/OpenModelicaRuntimeCUtilMMC.dir/omc_numbers.c.gcda:Skip
profiling:/var/lib/jenkins1:Cannot create directory
profiling:/var/lib/jenkins1/ws/OpenModelica/build_cmake/OMCompiler/SimulationRuntime/c/util/CMakeFiles/OpenModelicaRuntimeCUtilMMC.dir/OldModelicaTables.c.gcda:Skip
profiling:/var/lib/jenkins1:Cannot create directory
profiling:/var/lib/jenkins1/ws/OpenModelica/build_cmake/OMCompiler/SimulationRuntime/c/util/CMakeFiles/OpenModelicaRuntimeCUtilMMC.dir/libcsv.c.gcda:Skip
profiling:/var/lib/jenkins1:Cannot create directory
profiling:/var/lib/jenkins1/ws/OpenModelica/build_cmake/OMCompiler/SimulationRuntime/c/meta/CMakeFiles/OpenModelicaRuntimeMMC.dir/meta_modelica_catch.c.gcda:Skip
[ 82%] Translating SBPWLinearMap.mo for MSVC
[ 82%] Translating SBSet.mo for MSVC
profiling:/var/lib/jenkins1:Cannot create directory
profiling:/var/lib/jenkins1/ws/OpenModelica/build_cmake/OMCompiler/SimulationRuntime/c/util/CMakeFiles/OpenModelicaRuntimeCUtilMMC.dir/write_matlab4.c.gcda:Skip
profiling:/var/lib/jenkins1:Cannot create directory
profiling:/var/lib/jenkins1/ws/OpenModelica/build_cmake/OMCompiler/SimulationRuntime/c/util/CMakeFiles/OpenModelicaRuntimeCUtilMMC.dir/write_csv.c.gcda:Skip
profiling:/var/lib/jenkins1:Cannot create directory
profiling:/var/lib/jenkins1/ws/OpenModelica/build_cmake/OMCompiler/SimulationRuntime/c/util/CMakeFiles/OpenModelicaRuntimeCUtilMMC.dir/tinymt64.c.gcda:Skip
profiling:/var/lib/jenkins1:Cannot create directory
profiling:/var/lib/jenkins1/ws/OpenModelica/build_cmake/OMCompiler/SimulationRuntime/c/util/CMakeFiles/OpenModelicaRuntimeCUtilMMC.dir/read_matlab4.c.gcda:Skip
profiling:/var/lib/jenkins1:Cannot create directory
profiling:/var/lib/jenkins1/ws/OpenModelica/build_cmake/OMCompiler/SimulationRuntime/c/util/CMakeFiles/OpenModelicaRuntimeCUtilMMC.dir/read_csv.c.gcda:Skip
profiling:/var/lib/jenkins1:Cannot create directory
profiling:/var/lib/jenkins1/ws/OpenModelica/build_cmake/OMCompiler/SimulationRuntime/c/util/CMakeFiles/OpenModelicaRuntimeCUtilMMC.dir/omc_numbers.c.gcda:Skip
profiling:/var/lib/jenkins1:Cannot create directory
profiling:/var/lib/jenkins1/ws/OpenModelica/build_cmake/OMCompiler/SimulationRuntime/c/util/CMakeFiles/OpenModelicaRuntimeCUtilMMC.dir/OldModelicaTables.c.gcda:Skip
profiling:/var/lib/jenkins1:Cannot create directory
profiling:/var/lib/jenkins1/ws/OpenModelica/build_cmake/OMCompiler/SimulationRuntime/c/util/CMakeFiles/OpenModelicaRuntimeCUtilMMC.dir/libcsv.c.gcda:Skip
profiling:/var/lib/jenkins1:Cannot create directory
profiling:/var/lib/jenkins1/ws/OpenModelica/build_cmake/OMCompiler/SimulationRuntime/c/meta/CMakeFiles/OpenModelicaRuntimeMMC.dir/meta_modelica_catch.c.gcda:Skip
[ 82%] Translating SimulationResults.mo for MSVC
profiling:/var/lib/jenkins1:Cannot create directory
profiling:/var/lib/jenkins1/ws/OpenModelica/build_cmake/OMCompiler/SimulationRuntime/c/util/CMakeFiles/OpenModelicaRuntimeCUtilMMC.dir/write_matlab4.c.gcda:Skip
profiling:/var/lib/jenkins1:Cannot create directory
profiling:/var/lib/jenkins1/ws/OpenModelica/build_cmake/OMCompiler/SimulationRuntime/c/util/CMakeFiles/OpenModelicaRuntimeCUtilMMC.dir/write_csv.c.gcda:Skip
profiling:/var/lib/jenkins1:Cannot create directory
profiling:/var/lib/jenkins1/ws/OpenModelica/build_cmake/OMCompiler/SimulationRuntime/c/util/CMakeFiles/OpenModelicaRuntimeCUtilMMC.dir/tinymt64.c.gcda:Skip
profiling:/var/lib/jenkins1:Cannot create directory
profiling:/var/lib/jenkins1/ws/OpenModelica/build_cmake/OMCompiler/SimulationRuntime/c/util/CMakeFiles/OpenModelicaRuntimeCUtilMMC.dir/read_matlab4.c.gcda:Skip
profiling:/var/lib/jenkins1:Cannot create directory
profiling:/var/lib/jenkins1/ws/OpenModelica/build_cmake/OMCompiler/SimulationRuntime/c/util/CMakeFiles/OpenModelicaRuntimeCUtilMMC.dir/read_csv.c.gcda:Skip
profiling:/var/lib/jenkins1:Cannot create directory
profiling:/var/lib/jenkins1/ws/OpenModelica/build_cmake/OMCompiler/SimulationRuntime/c/util/CMakeFiles/OpenModelicaRuntimeCUtilMMC.dir/omc_numbers.c.gcda:Skip
profiling:/var/lib/jenkins1:Cannot create directory
profiling:/var/lib/jenkins1/ws/OpenModelica/build_cmake/OMCompiler/SimulationRuntime/c/util/CMakeFiles/OpenModelicaRuntimeCUtilMMC.dir/OldModelicaTables.c.gcda:Skip
profiling:/var/lib/jenkins1:Cannot create directory
profiling:/var/lib/jenkins1/ws/OpenModelica/build_cmake/OMCompiler/SimulationRuntime/c/util/CMakeFiles/OpenModelicaRuntimeCUtilMMC.dir/libcsv.c.gcda:Skip
profiling:/var/lib/jenkins1:Cannot create directory
profiling:/var/lib/jenkins1/ws/OpenModelica/build_cmake/OMCompiler/SimulationRuntime/c/meta/CMakeFiles/OpenModelicaRuntimeMMC.dir/meta_modelica_catch.c.gcda:Skip
[ 82%] Translating TaskGraphResults.mo for MSVC
profiling:/var/lib/jenkins1:Cannot create directory
profiling:/var/lib/jenkins1/ws/OpenModelica/build_cmake/OMCompiler/SimulationRuntime/c/util/CMakeFiles/OpenModelicaRuntimeCUtilMMC.dir/write_matlab4.c.gcda:Skip
profiling:/var/lib/jenkins1:Cannot create directory
profiling:/var/lib/jenkins1/ws/OpenModelica/build_cmake/OMCompiler/SimulationRuntime/c/util/CMakeFiles/OpenModelicaRuntimeCUtilMMC.dir/write_csv.c.gcda:Skip
profiling:/var/lib/jenkins1:Cannot create directory
profiling:/var/lib/jenkins1/ws/OpenModelica/build_cmake/OMCompiler/SimulationRuntime/c/util/CMakeFiles/OpenModelicaRuntimeCUtilMMC.dir/tinymt64.c.gcda:Skip
profiling:/var/lib/jenkins1:Cannot create directory
profiling:/var/lib/jenkins1/ws/OpenModelica/build_cmake/OMCompiler/SimulationRuntime/c/util/CMakeFiles/OpenModelicaRuntimeCUtilMMC.dir/read_matlab4.c.gcda:Skip
profiling:/var/lib/jenkins1:Cannot create directory
profiling:/var/lib/jenkins1/ws/OpenModelica/build_cmake/OMCompiler/SimulationRuntime/c/util/CMakeFiles/OpenModelicaRuntimeCUtilMMC.dir/read_csv.c.gcda:Skip
profiling:/var/lib/jenkins1:Cannot create directory
profiling:/var/lib/jenkins1/ws/OpenModelica/build_cmake/OMCompiler/SimulationRuntime/c/util/CMakeFiles/OpenModelicaRuntimeCUtilMMC.dir/omc_numbers.c.gcda:Skip
profiling:/var/lib/jenkins1:Cannot create directory
profiling:/var/lib/jenkins1/ws/OpenModelica/build_cmake/OMCompiler/SimulationRuntime/c/util/CMakeFiles/OpenModelicaRuntimeCUtilMMC.dir/OldModelicaTables.c.gcda:Skip
profiling:/var/lib/jenkins1:Cannot create directory
profiling:/var/lib/jenkins1/ws/OpenModelica/build_cmake/OMCompiler/SimulationRuntime/c/util/CMakeFiles/OpenModelicaRuntimeCUtilMMC.dir/libcsv.c.gcda:Skip
profiling:/var/lib/jenkins1:Cannot create directory
profiling:/var/lib/jenkins1/ws/OpenModelica/build_cmake/OMCompiler/SimulationRuntime/c/meta/CMakeFiles/OpenModelicaRuntimeMMC.dir/meta_modelica_catch.c.gcda:Skip
profiling:/var/lib/jenkins1:Cannot create directory
profiling:/var/lib/jenkins1/ws/OpenModelica/build_cmake/OMCompiler/SimulationRuntime/c/util/CMakeFiles/OpenModelicaRuntimeCUtilMMC.dir/write_matlab4.c.gcda:Skip
profiling:/var/lib/jenkins1:Cannot create directory
profiling:/var/lib/jenkins1/ws/OpenModelica/build_cmake/OMCompiler/SimulationRuntime/c/util/CMakeFiles/OpenModelicaRuntimeCUtilMMC.dir/write_csv.c.gcda:Skip
profiling:/var/lib/jenkins1:Cannot create directory
profiling:/var/lib/jenkins1/ws/OpenModelica/build_cmake/OMCompiler/SimulationRuntime/c/util/CMakeFiles/OpenModelicaRuntimeCUtilMMC.dir/tinymt64.c.gcda:Skip
profiling:/var/lib/jenkins1:Cannot create directory
profiling:/var/lib/jenkins1/ws/OpenModelica/build_cmake/OMCompiler/SimulationRuntime/c/util/CMakeFiles/OpenModelicaRuntimeCUtilMMC.dir/read_matlab4.c.gcda:Skip
profiling:/var/lib/jenkins1:Cannot create directory
profiling:/var/lib/jenkins1/ws/OpenModelica/build_cmake/OMCompiler/SimulationRuntime/c/util/CMakeFiles/OpenModelicaRuntimeCUtilMMC.dir/read_csv.c.gcda:Skip
profiling:/var/lib/jenkins1:Cannot create directory
profiling:/var/lib/jenkins1/ws/OpenModelica/build_cmake/OMCompiler/SimulationRuntime/c/util/CMakeFiles/OpenModelicaRuntimeCUtilMMC.dir/omc_numbers.c.gcda:Skip
profiling:/var/lib/jenkins1:Cannot create directory
profiling:/var/lib/jenkins1/ws/OpenModelica/build_cmake/OMCompiler/SimulationRuntime/c/util/CMakeFiles/OpenModelicaRuntimeCUtilMMC.dir/OldModelicaTables.c.gcda:Skip
profiling:/var/lib/jenkins1:Cannot create directory
profiling:/var/lib/jenkins1/ws/OpenModelica/build_cmake/OMCompiler/SimulationRuntime/c/util/CMakeFiles/OpenModelicaRuntimeCUtilMMC.dir/libcsv.c.gcda:Skip
profiling:/var/lib/jenkins1:Cannot create directory
profiling:/var/lib/jenkins1/ws/OpenModelica/build_cmake/OMCompiler/SimulationRuntime/c/meta/CMakeFiles/OpenModelicaRuntimeMMC.dir/meta_modelica_catch.c.gcda:Skip
[ 82%] Translating UnorderedMap.mo for MSVC
[ 82%] Translating UnorderedSet.mo for MSVC
profiling:/var/lib/jenkins1:Cannot create directory
profiling:/var/lib/jenkins1/ws/OpenModelica/build_cmake/OMCompiler/SimulationRuntime/c/util/CMakeFiles/OpenModelicaRuntimeCUtilMMC.dir/write_matlab4.c.gcda:Skip
profiling:/var/lib/jenkins1:Cannot create directory
profiling:/var/lib/jenkins1/ws/OpenModelica/build_cmake/OMCompiler/SimulationRuntime/c/util/CMakeFiles/OpenModelicaRuntimeCUtilMMC.dir/write_csv.c.gcda:Skip
profiling:/var/lib/jenkins1:Cannot create directory
profiling:/var/lib/jenkins1/ws/OpenModelica/build_cmake/OMCompiler/SimulationRuntime/c/util/CMakeFiles/OpenModelicaRuntimeCUtilMMC.dir/tinymt64.c.gcda:Skip
profiling:/var/lib/jenkins1:Cannot create directory
profiling:/var/lib/jenkins1/ws/OpenModelica/build_cmake/OMCompiler/SimulationRuntime/c/util/CMakeFiles/OpenModelicaRuntimeCUtilMMC.dir/read_matlab4.c.gcda:Skip
profiling:/var/lib/jenkins1:Cannot create directory
profiling:/var/lib/jenkins1/ws/OpenModelica/build_cmake/OMCompiler/SimulationRuntime/c/util/CMakeFiles/OpenModelicaRuntimeCUtilMMC.dir/read_csv.c.gcda:Skip
profiling:/var/lib/jenkins1:Cannot create directory
profiling:/var/lib/jenkins1/ws/OpenModelica/build_cmake/OMCompiler/SimulationRuntime/c/util/CMakeFiles/OpenModelicaRuntimeCUtilMMC.dir/omc_numbers.c.gcda:Skip
profiling:/var/lib/jenkins1:Cannot create directory
profiling:/var/lib/jenkins1/ws/OpenModelica/build_cmake/OMCompiler/SimulationRuntime/c/util/CMakeFiles/OpenModelicaRuntimeCUtilMMC.dir/OldModelicaTables.c.gcda:Skip
profiling:/var/lib/jenkins1:Cannot create directory
profiling:/var/lib/jenkins1/ws/OpenModelica/build_cmake/OMCompiler/SimulationRuntime/c/util/CMakeFiles/OpenModelicaRuntimeCUtilMMC.dir/libcsv.c.gcda:Skip
profiling:/var/lib/jenkins1:Cannot create directory
profiling:/var/lib/jenkins1/ws/OpenModelica/build_cmake/OMCompiler/SimulationRuntime/c/meta/CMakeFiles/OpenModelicaRuntimeMMC.dir/meta_modelica_catch.c.gcda:Skip
[ 82%] Translating Unzip.mo for MSVC
profiling:/var/lib/jenkins1:Cannot create directory
profiling:/var/lib/jenkins1/ws/OpenModelica/build_cmake/OMCompiler/SimulationRuntime/c/util/CMakeFiles/OpenModelicaRuntimeCUtilMMC.dir/write_matlab4.c.gcda:Skip
profiling:/var/lib/jenkins1:Cannot create directory
profiling:/var/lib/jenkins1/ws/OpenModelica/build_cmake/OMCompiler/SimulationRuntime/c/util/CMakeFiles/OpenModelicaRuntimeCUtilMMC.dir/write_csv.c.gcda:Skip
profiling:/var/lib/jenkins1:Cannot create directory
profiling:/var/lib/jenkins1/ws/OpenModelica/build_cmake/OMCompiler/SimulationRuntime/c/util/CMakeFiles/OpenModelicaRuntimeCUtilMMC.dir/tinymt64.c.gcda:Skip
profiling:/var/lib/jenkins1:Cannot create directory
profiling:/var/lib/jenkins1/ws/OpenModelica/build_cmake/OMCompiler/SimulationRuntime/c/util/CMakeFiles/OpenModelicaRuntimeCUtilMMC.dir/read_matlab4.c.gcda:Skip
profiling:/var/lib/jenkins1:Cannot create directory
profiling:/var/lib/jenkins1/ws/OpenModelica/build_cmake/OMCompiler/SimulationRuntime/c/util/CMakeFiles/OpenModelicaRuntimeCUtilMMC.dir/read_csv.c.gcda:Skip
profiling:/var/lib/jenkins1:Cannot create directory
profiling:/var/lib/jenkins1/ws/OpenModelica/build_cmake/OMCompiler/SimulationRuntime/c/util/CMakeFiles/OpenModelicaRuntimeCUtilMMC.dir/omc_numbers.c.gcda:Skip
profiling:/var/lib/jenkins1:Cannot create directory
profiling:/var/lib/jenkins1/ws/OpenModelica/build_cmake/OMCompiler/SimulationRuntime/c/util/CMakeFiles/OpenModelicaRuntimeCUtilMMC.dir/OldModelicaTables.c.gcda:Skip
profiling:/var/lib/jenkins1:Cannot create directory
profiling:/var/lib/jenkins1/ws/OpenModelica/build_cmake/OMCompiler/SimulationRuntime/c/util/CMakeFiles/OpenModelicaRuntimeCUtilMMC.dir/libcsv.c.gcda:Skip
profiling:/var/lib/jenkins1:Cannot create directory
profiling:/var/lib/jenkins1/ws/OpenModelica/build_cmake/OMCompiler/SimulationRuntime/c/meta/CMakeFiles/OpenModelicaRuntimeMMC.dir/meta_modelica_catch.c.gcda:Skip
profiling:/var/lib/jenkins1:Cannot create directory
profiling:/var/lib/jenkins1/ws/OpenModelica/build_cmake/OMCompiler/SimulationRuntime/c/util/CMakeFiles/OpenModelicaRuntimeCUtilMMC.dir/write_matlab4.c.gcda:Skip
profiling:/var/lib/jenkins1:Cannot create directory
profiling:/var/lib/jenkins1/ws/OpenModelica/build_cmake/OMCompiler/SimulationRuntime/c/util/CMakeFiles/OpenModelicaRuntimeCUtilMMC.dir/write_csv.c.gcda:Skip
profiling:/var/lib/jenkins1:Cannot create directory
profiling:/var/lib/jenkins1/ws/OpenModelica/build_cmake/OMCompiler/SimulationRuntime/c/util/CMakeFiles/OpenModelicaRuntimeCUtilMMC.dir/tinymt64.c.gcda:Skip
profiling:/var/lib/jenkins1:Cannot create directory
profiling:/var/lib/jenkins1/ws/OpenModelica/build_cmake/OMCompiler/SimulationRuntime/c/util/CMakeFiles/OpenModelicaRuntimeCUtilMMC.dir/read_matlab4.c.gcda:Skip
profiling:/var/lib/jenkins1:Cannot create directory
profiling:/var/lib/jenkins1/ws/OpenModelica/build_cmake/OMCompiler/SimulationRuntime/c/util/CMakeFiles/OpenModelicaRuntimeCUtilMMC.dir/read_csv.c.gcda:Skip
profiling:/var/lib/jenkins1:Cannot create directory
profiling:/var/lib/jenkins1/ws/OpenModelica/build_cmake/OMCompiler/SimulationRuntime/c/util/CMakeFiles/OpenModelicaRuntimeCUtilMMC.dir/omc_numbers.c.gcda:Skip
profiling:/var/lib/jenkins1:Cannot create directory
profiling:/var/lib/jenkins1/ws/OpenModelica/build_cmake/OMCompiler/SimulationRuntime/c/util/CMakeFiles/OpenModelicaRuntimeCUtilMMC.dir/OldModelicaTables.c.gcda:Skip
profiling:/var/lib/jenkins1:Cannot create directory
profiling:/var/lib/jenkins1/ws/OpenModelica/build_cmake/OMCompiler/SimulationRuntime/c/util/CMakeFiles/OpenModelicaRuntimeCUtilMMC.dir/libcsv.c.gcda:Skip
profiling:/var/lib/jenkins1:Cannot create directory
profiling:/var/lib/jenkins1/ws/OpenModelica/build_cmake/OMCompiler/SimulationRuntime/c/meta/CMakeFiles/OpenModelicaRuntimeMMC.dir/meta_modelica_catch.c.gcda:Skip
[ 82%] Translating Vector.mo for MSVC
[ 82%] Translating RuntimeSources.mo for MSVC
profiling:/var/lib/jenkins1:Cannot create directory
profiling:/var/lib/jenkins1/ws/OpenModelica/build_cmake/OMCompiler/SimulationRuntime/c/util/CMakeFiles/OpenModelicaRuntimeCUtilMMC.dir/write_matlab4.c.gcda:Skip
profiling:/var/lib/jenkins1:Cannot create directory
profiling:/var/lib/jenkins1/ws/OpenModelica/build_cmake/OMCompiler/SimulationRuntime/c/util/CMakeFiles/OpenModelicaRuntimeCUtilMMC.dir/write_csv.c.gcda:Skip
profiling:/var/lib/jenkins1:Cannot create directory
profiling:/var/lib/jenkins1/ws/OpenModelica/build_cmake/OMCompiler/SimulationRuntime/c/util/CMakeFiles/OpenModelicaRuntimeCUtilMMC.dir/tinymt64.c.gcda:Skip
profiling:/var/lib/jenkins1:Cannot create directory
profiling:/var/lib/jenkins1/ws/OpenModelica/build_cmake/OMCompiler/SimulationRuntime/c/util/CMakeFiles/OpenModelicaRuntimeCUtilMMC.dir/read_matlab4.c.gcda:Skip
profiling:/var/lib/jenkins1:Cannot create directory
profiling:/var/lib/jenkins1/ws/OpenModelica/build_cmake/OMCompiler/SimulationRuntime/c/util/CMakeFiles/OpenModelicaRuntimeCUtilMMC.dir/read_csv.c.gcda:Skip
profiling:/var/lib/jenkins1:Cannot create directory
profiling:/var/lib/jenkins1/ws/OpenModelica/build_cmake/OMCompiler/SimulationRuntime/c/util/CMakeFiles/OpenModelicaRuntimeCUtilMMC.dir/omc_numbers.c.gcda:Skip
profiling:/var/lib/jenkins1:Cannot create directory
profiling:/var/lib/jenkins1/ws/OpenModelica/build_cmake/OMCompiler/SimulationRuntime/c/util/CMakeFiles/OpenModelicaRuntimeCUtilMMC.dir/OldModelicaTables.c.gcda:Skip
profiling:/var/lib/jenkins1:Cannot create directory
profiling:/var/lib/jenkins1/ws/OpenModelica/build_cmake/OMCompiler/SimulationRuntime/c/util/CMakeFiles/OpenModelicaRuntimeCUtilMMC.dir/libcsv.c.gcda:Skip
profiling:/var/lib/jenkins1:Cannot create directory
profiling:/var/lib/jenkins1/ws/OpenModelica/build_cmake/OMCompiler/SimulationRuntime/c/meta/CMakeFiles/OpenModelicaRuntimeMMC.dir/meta_modelica_catch.c.gcda:Skip
profiling:/var/lib/jenkins1:Cannot create directory
profiling:/var/lib/jenkins1/ws/OpenModelica/build_cmake/OMCompiler/SimulationRuntime/c/util/CMakeFiles/OpenModelicaRuntimeCUtilMMC.dir/write_matlab4.c.gcda:Skip
profiling:/var/lib/jenkins1:Cannot create directory
profiling:/var/lib/jenkins1/ws/OpenModelica/build_cmake/OMCompiler/SimulationRuntime/c/util/CMakeFiles/OpenModelicaRuntimeCUtilMMC.dir/write_csv.c.gcda:Skip
profiling:/var/lib/jenkins1:Cannot create directory
profiling:/var/lib/jenkins1/ws/OpenModelica/build_cmake/OMCompiler/SimulationRuntime/c/util/CMakeFiles/OpenModelicaRuntimeCUtilMMC.dir/tinymt64.c.gcda:Skip
profiling:/var/lib/jenkins1:Cannot create directory
profiling:/var/lib/jenkins1/ws/OpenModelica/build_cmake/OMCompiler/SimulationRuntime/c/util/CMakeFiles/OpenModelicaRuntimeCUtilMMC.dir/read_matlab4.c.gcda:Skip
profiling:/var/lib/jenkins1:Cannot create directory
profiling:/var/lib/jenkins1/ws/OpenModelica/build_cmake/OMCompiler/SimulationRuntime/c/util/CMakeFiles/OpenModelicaRuntimeCUtilMMC.dir/read_csv.c.gcda:Skip
profiling:/var/lib/jenkins1:Cannot create directory
profiling:/var/lib/jenkins1/ws/OpenModelica/build_cmake/OMCompiler/SimulationRuntime/c/util/CMakeFiles/OpenModelicaRuntimeCUtilMMC.dir/omc_numbers.c.gcda:Skip
profiling:/var/lib/jenkins1:Cannot create directory
profiling:/var/lib/jenkins1/ws/OpenModelica/build_cmake/OMCompiler/SimulationRuntime/c/util/CMakeFiles/OpenModelicaRuntimeCUtilMMC.dir/OldModelicaTables.c.gcda:Skip
profiling:/var/lib/jenkins1:Cannot create directory
profiling:/var/lib/jenkins1/ws/OpenModelica/build_cmake/OMCompiler/SimulationRuntime/c/util/CMakeFiles/OpenModelicaRuntimeCUtilMMC.dir/libcsv.c.gcda:Skip
profiling:/var/lib/jenkins1:Cannot create directory
profiling:/var/lib/jenkins1/ws/OpenModelica/build_cmake/OMCompiler/SimulationRuntime/c/meta/CMakeFiles/OpenModelicaRuntimeMMC.dir/meta_modelica_catch.c.gcda:Skip
profiling:/var/lib/jenkins1:Cannot create directory
profiling:/var/lib/jenkins1/ws/OpenModelica/build_cmake/OMCompiler/SimulationRuntime/c/util/CMakeFiles/OpenModelicaRuntimeCUtilMMC.dir/write_matlab4.c.gcda:Skip
profiling:/var/lib/jenkins1:Cannot create directory
profiling:/var/lib/jenkins1/ws/OpenModelica/build_cmake/OMCompiler/SimulationRuntime/c/util/CMakeFiles/OpenModelicaRuntimeCUtilMMC.dir/write_csv.c.gcda:Skip
profiling:/var/lib/jenkins1:Cannot create directory
profiling:/var/lib/jenkins1/ws/OpenModelica/build_cmake/OMCompiler/SimulationRuntime/c/util/CMakeFiles/OpenModelicaRuntimeCUtilMMC.dir/tinymt64.c.gcda:Skip
profiling:/var/lib/jenkins1:Cannot create directory
profiling:/var/lib/jenkins1/ws/OpenModelica/build_cmake/OMCompiler/SimulationRuntime/c/util/CMakeFiles/OpenModelicaRuntimeCUtilMMC.dir/read_matlab4.c.gcda:Skip
profiling:/var/lib/jenkins1:Cannot create directory
profiling:/var/lib/jenkins1/ws/OpenModelica/build_cmake/OMCompiler/SimulationRuntime/c/util/CMakeFiles/OpenModelicaRuntimeCUtilMMC.dir/read_csv.c.gcda:Skip
profiling:/var/lib/jenkins1:Cannot create directory
profiling:/var/lib/jenkins1/ws/OpenModelica/build_cmake/OMCompiler/SimulationRuntime/c/util/CMakeFiles/OpenModelicaRuntimeCUtilMMC.dir/omc_numbers.c.gcda:Skip
profiling:/var/lib/jenkins1:Cannot create directory
profiling:/var/lib/jenkins1/ws/OpenModelica/build_cmake/OMCompiler/SimulationRuntime/c/util/CMakeFiles/OpenModelicaRuntimeCUtilMMC.dir/OldModelicaTables.c.gcda:Skip
profiling:/var/lib/jenkins1:Cannot create directory
profiling:/var/lib/jenkins1/ws/OpenModelica/build_cmake/OMCompiler/SimulationRuntime/c/util/CMakeFiles/OpenModelicaRuntimeCUtilMMC.dir/libcsv.c.gcda:Skip
profiling:/var/lib/jenkins1:Cannot create directory
profiling:/var/lib/jenkins1/ws/OpenModelica/build_cmake/OMCompiler/SimulationRuntime/c/meta/CMakeFiles/OpenModelicaRuntimeMMC.dir/meta_modelica_catch.c.gcda:Skip
profiling:/var/lib/jenkins1:Cannot create directory
profiling:/var/lib/jenkins1/ws/OpenModelica/build_cmake/OMCompiler/SimulationRuntime/c/util/CMakeFiles/OpenModelicaRuntimeCUtilMMC.dir/write_matlab4.c.gcda:Skip
profiling:/var/lib/jenkins1:Cannot create directory
profiling:/var/lib/jenkins1/ws/OpenModelica/build_cmake/OMCompiler/SimulationRuntime/c/util/CMakeFiles/OpenModelicaRuntimeCUtilMMC.dir/write_csv.c.gcda:Skip
profiling:/var/lib/jenkins1:Cannot create directory
profiling:/var/lib/jenkins1/ws/OpenModelica/build_cmake/OMCompiler/SimulationRuntime/c/util/CMakeFiles/OpenModelicaRuntimeCUtilMMC.dir/tinymt64.c.gcda:Skip
profiling:/var/lib/jenkins1:Cannot create directory
profiling:/var/lib/jenkins1/ws/OpenModelica/build_cmake/OMCompiler/SimulationRuntime/c/util/CMakeFiles/OpenModelicaRuntimeCUtilMMC.dir/read_matlab4.c.gcda:Skip
profiling:/var/lib/jenkins1:Cannot create directory
profiling:/var/lib/jenkins1/ws/OpenModelica/build_cmake/OMCompiler/SimulationRuntime/c/util/CMakeFiles/OpenModelicaRuntimeCUtilMMC.dir/read_csv.c.gcda:Skip
profiling:/var/lib/jenkins1:Cannot create directory
profiling:/var/lib/jenkins1/ws/OpenModelica/build_cmake/OMCompiler/SimulationRuntime/c/util/CMakeFiles/OpenModelicaRuntimeCUtilMMC.dir/omc_numbers.c.gcda:Skip
profiling:/var/lib/jenkins1:Cannot create directory
profiling:/var/lib/jenkins1/ws/OpenModelica/build_cmake/OMCompiler/SimulationRuntime/c/util/CMakeFiles/OpenModelicaRuntimeCUtilMMC.dir/OldModelicaTables.c.gcda:Skip
profiling:/var/lib/jenkins1:Cannot create directory
profiling:/var/lib/jenkins1/ws/OpenModelica/build_cmake/OMCompiler/SimulationRuntime/c/util/CMakeFiles/OpenModelicaRuntimeCUtilMMC.dir/libcsv.c.gcda:Skip
profiling:/var/lib/jenkins1:Cannot create directory
profiling:/var/lib/jenkins1/ws/OpenModelica/build_cmake/OMCompiler/SimulationRuntime/c/meta/CMakeFiles/OpenModelicaRuntimeMMC.dir/meta_modelica_catch.c.gcda:Skip
profiling:/var/lib/jenkins1:Cannot create directory
profiling:/var/lib/jenkins1/ws/OpenModelica/build_cmake/OMCompiler/SimulationRuntime/c/util/CMakeFiles/OpenModelicaRuntimeCUtilMMC.dir/write_matlab4.c.gcda:Skip
profiling:/var/lib/jenkins1:Cannot create directory
profiling:/var/lib/jenkins1/ws/OpenModelica/build_cmake/OMCompiler/SimulationRuntime/c/util/CMakeFiles/OpenModelicaRuntimeCUtilMMC.dir/write_csv.c.gcda:Skip
profiling:/var/lib/jenkins1:Cannot create directory
profiling:/var/lib/jenkins1/ws/OpenModelica/build_cmake/OMCompiler/SimulationRuntime/c/util/CMakeFiles/OpenModelicaRuntimeCUtilMMC.dir/tinymt64.c.gcda:Skip
profiling:/var/lib/jenkins1:Cannot create directory
profiling:/var/lib/jenkins1/ws/OpenModelica/build_cmake/OMCompiler/SimulationRuntime/c/util/CMakeFiles/OpenModelicaRuntimeCUtilMMC.dir/read_matlab4.c.gcda:Skip
profiling:/var/lib/jenkins1:Cannot create directory
profiling:/var/lib/jenkins1/ws/OpenModelica/build_cmake/OMCompiler/SimulationRuntime/c/util/CMakeFiles/OpenModelicaRuntimeCUtilMMC.dir/read_csv.c.gcda:Skip
profiling:/var/lib/jenkins1:Cannot create directory
profiling:/var/lib/jenkins1/ws/OpenModelica/build_cmake/OMCompiler/SimulationRuntime/c/util/CMakeFiles/OpenModelicaRuntimeCUtilMMC.dir/omc_numbers.c.gcda:Skip
profiling:/var/lib/jenkins1:Cannot create directory
profiling:/var/lib/jenkins1/ws/OpenModelica/build_cmake/OMCompiler/SimulationRuntime/c/util/CMakeFiles/OpenModelicaRuntimeCUtilMMC.dir/OldModelicaTables.c.gcda:Skip
profiling:/var/lib/jenkins1:Cannot create directory
profiling:/var/lib/jenkins1/ws/OpenModelica/build_cmake/OMCompiler/SimulationRuntime/c/util/CMakeFiles/OpenModelicaRuntimeCUtilMMC.dir/libcsv.c.gcda:Skip
profiling:/var/lib/jenkins1:Cannot create directory
profiling:/var/lib/jenkins1/ws/OpenModelica/build_cmake/OMCompiler/SimulationRuntime/c/meta/CMakeFiles/OpenModelicaRuntimeMMC.dir/meta_modelica_catch.c.gcda:Skip
profiling:/var/lib/jenkins1:Cannot create directory
profiling:/var/lib/jenkins1/ws/OpenModelica/build_cmake/OMCompiler/SimulationRuntime/c/util/CMakeFiles/OpenModelicaRuntimeCUtilMMC.dir/write_matlab4.c.gcda:Skip
profiling:/var/lib/jenkins1:Cannot create directory
profiling:/var/lib/jenkins1/ws/OpenModelica/build_cmake/OMCompiler/SimulationRuntime/c/util/CMakeFiles/OpenModelicaRuntimeCUtilMMC.dir/write_csv.c.gcda:Skip
profiling:/var/lib/jenkins1:Cannot create directory
profiling:/var/lib/jenkins1/ws/OpenModelica/build_cmake/OMCompiler/SimulationRuntime/c/util/CMakeFiles/OpenModelicaRuntimeCUtilMMC.dir/tinymt64.c.gcda:Skip
profiling:/var/lib/jenkins1:Cannot create directory
profiling:/var/lib/jenkins1/ws/OpenModelica/build_cmake/OMCompiler/SimulationRuntime/c/util/CMakeFiles/OpenModelicaRuntimeCUtilMMC.dir/read_matlab4.c.gcda:Skip
profiling:/var/lib/jenkins1:Cannot create directory
profiling:/var/lib/jenkins1/ws/OpenModelica/build_cmake/OMCompiler/SimulationRuntime/c/util/CMakeFiles/OpenModelicaRuntimeCUtilMMC.dir/read_csv.c.gcda:Skip
profiling:/var/lib/jenkins1:Cannot create directory
profiling:/var/lib/jenkins1/ws/OpenModelica/build_cmake/OMCompiler/SimulationRuntime/c/util/CMakeFiles/OpenModelicaRuntimeCUtilMMC.dir/omc_numbers.c.gcda:Skip
profiling:/var/lib/jenkins1:Cannot create directory
profiling:/var/lib/jenkins1/ws/OpenModelica/build_cmake/OMCompiler/SimulationRuntime/c/util/CMakeFiles/OpenModelicaRuntimeCUtilMMC.dir/OldModelicaTables.c.gcda:Skip
profiling:/var/lib/jenkins1:Cannot create directory
profiling:/var/lib/jenkins1/ws/OpenModelica/build_cmake/OMCompiler/SimulationRuntime/c/util/CMakeFiles/OpenModelicaRuntimeCUtilMMC.dir/libcsv.c.gcda:Skip
profiling:/var/lib/jenkins1:Cannot create directory
profiling:/var/lib/jenkins1/ws/OpenModelica/build_cmake/OMCompiler/SimulationRuntime/c/meta/CMakeFiles/OpenModelicaRuntimeMMC.dir/meta_modelica_catch.c.gcda:Skip
profiling:/var/lib/jenkins1:Cannot create directory
profiling:/var/lib/jenkins1/ws/OpenModelica/build_cmake/OMCompiler/SimulationRuntime/c/util/CMakeFiles/OpenModelicaRuntimeCUtilMMC.dir/write_matlab4.c.gcda:Skip
profiling:/var/lib/jenkins1:Cannot create directory
profiling:/var/lib/jenkins1/ws/OpenModelica/build_cmake/OMCompiler/SimulationRuntime/c/util/CMakeFiles/OpenModelicaRuntimeCUtilMMC.dir/write_csv.c.gcda:Skip
profiling:/var/lib/jenkins1:Cannot create directory
profiling:/var/lib/jenkins1/ws/OpenModelica/build_cmake/OMCompiler/SimulationRuntime/c/util/CMakeFiles/OpenModelicaRuntimeCUtilMMC.dir/tinymt64.c.gcda:Skip
profiling:/var/lib/jenkins1:Cannot create directory
profiling:/var/lib/jenkins1/ws/OpenModelica/build_cmake/OMCompiler/SimulationRuntime/c/util/CMakeFiles/OpenModelicaRuntimeCUtilMMC.dir/read_matlab4.c.gcda:Skip
profiling:/var/lib/jenkins1:Cannot create directory
profiling:/var/lib/jenkins1/ws/OpenModelica/build_cmake/OMCompiler/SimulationRuntime/c/util/CMakeFiles/OpenModelicaRuntimeCUtilMMC.dir/read_csv.c.gcda:Skip
profiling:/var/lib/jenkins1:Cannot create directory
profiling:/var/lib/jenkins1/ws/OpenModelica/build_cmake/OMCompiler/SimulationRuntime/c/util/CMakeFiles/OpenModelicaRuntimeCUtilMMC.dir/omc_numbers.c.gcda:Skip
profiling:/var/lib/jenkins1:Cannot create directory
profiling:/var/lib/jenkins1/ws/OpenModelica/build_cmake/OMCompiler/SimulationRuntime/c/util/CMakeFiles/OpenModelicaRuntimeCUtilMMC.dir/OldModelicaTables.c.gcda:Skip
profiling:/var/lib/jenkins1:Cannot create directory
profiling:/var/lib/jenkins1/ws/OpenModelica/build_cmake/OMCompiler/SimulationRuntime/c/util/CMakeFiles/OpenModelicaRuntimeCUtilMMC.dir/libcsv.c.gcda:Skip
profiling:/var/lib/jenkins1:Cannot create directory
profiling:/var/lib/jenkins1/ws/OpenModelica/build_cmake/OMCompiler/SimulationRuntime/c/meta/CMakeFiles/OpenModelicaRuntimeMMC.dir/meta_modelica_catch.c.gcda:Skip
profiling:/var/lib/jenkins1:Cannot create directory
profiling:/var/lib/jenkins1/ws/OpenModelica/build_cmake/OMCompiler/SimulationRuntime/c/util/CMakeFiles/OpenModelicaRuntimeCUtilMMC.dir/write_matlab4.c.gcda:Skip
profiling:/var/lib/jenkins1:Cannot create directory
profiling:/var/lib/jenkins1/ws/OpenModelica/build_cmake/OMCompiler/SimulationRuntime/c/util/CMakeFiles/OpenModelicaRuntimeCUtilMMC.dir/write_csv.c.gcda:Skip
profiling:/var/lib/jenkins1:Cannot create directory
profiling:/var/lib/jenkins1/ws/OpenModelica/build_cmake/OMCompiler/SimulationRuntime/c/util/CMakeFiles/OpenModelicaRuntimeCUtilMMC.dir/tinymt64.c.gcda:Skip
profiling:/var/lib/jenkins1:Cannot create directory
profiling:/var/lib/jenkins1/ws/OpenModelica/build_cmake/OMCompiler/SimulationRuntime/c/util/CMakeFiles/OpenModelicaRuntimeCUtilMMC.dir/read_matlab4.c.gcda:Skip
profiling:/var/lib/jenkins1:Cannot create directory
profiling:/var/lib/jenkins1/ws/OpenModelica/build_cmake/OMCompiler/SimulationRuntime/c/util/CMakeFiles/OpenModelicaRuntimeCUtilMMC.dir/read_csv.c.gcda:Skip
profiling:/var/lib/jenkins1:Cannot create directory
profiling:/var/lib/jenkins1/ws/OpenModelica/build_cmake/OMCompiler/SimulationRuntime/c/util/CMakeFiles/OpenModelicaRuntimeCUtilMMC.dir/omc_numbers.c.gcda:Skip
profiling:/var/lib/jenkins1:Cannot create directory
profiling:/var/lib/jenkins1/ws/OpenModelica/build_cmake/OMCompiler/SimulationRuntime/c/util/CMakeFiles/OpenModelicaRuntimeCUtilMMC.dir/OldModelicaTables.c.gcda:Skip
profiling:/var/lib/jenkins1:Cannot create directory
profiling:/var/lib/jenkins1/ws/OpenModelica/build_cmake/OMCompiler/SimulationRuntime/c/util/CMakeFiles/OpenModelicaRuntimeCUtilMMC.dir/libcsv.c.gcda:Skip
profiling:/var/lib/jenkins1:Cannot create directory
profiling:/var/lib/jenkins1/ws/OpenModelica/build_cmake/OMCompiler/SimulationRuntime/c/meta/CMakeFiles/OpenModelicaRuntimeMMC.dir/meta_modelica_catch.c.gcda:Skip
[ 82%] Generated the MSVC sources in /var/lib/jenkins/ws/OpenModelica/build_cmake/OMCompiler/Compiler/msvc-c-sources.
[100%] Built target generate-msvc-c-sources
[Pipeline] stash
Stashed 1878 file(s)
[Pipeline] stash
Stashed 1510 file(s)
[Pipeline] writeFile
[Pipeline] stash
Stashed 1 file(s)
[Pipeline] stash
Stashed 1274 file(s)
[Pipeline] stash
Stashed 37 file(s)
[Pipeline] }
[Pipeline] // script
[Pipeline] }
$ docker stop --time=1 41272f34dfabb9e2fa533db17cfef51fd712dc922049687709b3406298aa92db
$ docker rm -f --volumes 41272f34dfabb9e2fa533db17cfef51fd712dc922049687709b3406298aa92db
[Pipeline] // withDockerContainer
[Pipeline] }
[Pipeline] // ws
[Pipeline] }
[Pipeline] // node
[Pipeline] }
[Pipeline] // retry
[Pipeline] }
[Pipeline] // stage
[Pipeline] }
      Timing report saved to /var/lib/jenkins1/ws/OpenModelica/build_cmake/OMCompiler/Compiler/rust-target/cargo-timings/cargo-timing-20261007T120435053Z-129c9f2a2d67eaa3.html
gmake[2]: *** [OMCompiler/Compiler/CMakeFiles/rust_libopenmodelica.dir/build.make:71: OMCompiler/Compiler/CMakeFiles/rust_libopenmodelica] Error 101
gmake[1]: *** [CMakeFiles/Makefile2:14520: OMCompiler/Compiler/CMakeFiles/rust_libopenmodelica.dir/all] Error 2
gmake: *** [Makefile:166: all] Error 2
[Pipeline] sh
+ sccache --show-stats
Compile requests                   5320
Compile requests executed          4398
Cache hits                         4388
Cache hits (C/C++)                 2386
Cache hits (Rust)                  2002
Cache misses                          9
Cache misses (C/C++)                  4
Cache misses (Rust)                   5
Cache hits rate                   99.80 %
Cache hits rate (C/C++)           99.83 %
Cache hits rate (Rust)            99.75 %
Cache timeouts                        0
Cache read errors                     0
Forced recaches                       0
Cache write errors                    0
Cache errors                          0
Compilations                          9
Compilation failures                  1
Non-cacheable compilations            0
Non-cacheable calls                 875
Non-compilation calls                47
Unsupported compiler calls            0
Average cache write               0.028 s
Average compiler                  4.485 s
Average cache read hit            0.013 s
Failed distributed compilations       0

Non-cacheable reasons:
crate-type                          676
missing input                        76
-                                    69
-o                                   53
-E                                    1

Cache location                  s3, name: omc-sccache, prefix: /
Base directories                /var/lib/jenkins1/ws/OpenModelica/
Version (client)                0.18.0
[Pipeline] }
[Pipeline] // withEnv
[Pipeline] }
[Pipeline] // withCredentials
[Pipeline] }
[Pipeline] // script
[Pipeline] }
$ docker stop --time=1 9386bd686601a1c5e28be964765c7fd1043a53e3d98d64fbffa1b1603331cf16
$ docker rm -f --volumes 9386bd686601a1c5e28be964765c7fd1043a53e3d98d64fbffa1b1603331cf16
[Pipeline] // withDockerContainer
[Pipeline] }
[Pipeline] // ws
[Pipeline] }
[Pipeline] // node
[Pipeline] }
[Pipeline] // stage
[Pipeline] }
Failed in branch rust-cmake
[Pipeline] // parallel
[Pipeline] }
[Pipeline] // stage
[Pipeline] stage
[Pipeline] { (tests + extras)
Stage "tests + extras" skipped due to earlier failure(s)
[Pipeline] getContext
[Pipeline] parallel
[Pipeline] { (Branch: 04 testsuite-gcc 1/2)
[Pipeline] { (Branch: 05 testsuite-clang 2/2)
[Pipeline] { (Branch: 10 web target)
[Pipeline] { (Branch: 10b qt-web target)
[Pipeline] { (Branch: 11 build-gui-rust)
[Pipeline] { (Branch: 12 unit-tests-rust)
[Pipeline] { (Branch: 13 cross-build-fmu)
[Pipeline] { (Branch: 14 testsuite-compliance)
[Pipeline] { (Branch: 15 build-usersguide)
[Pipeline] { (Branch: 17 build-gui-clang + omedit-testsuite)
[Pipeline] { (Branch: 18 testsuite-misc)
[Pipeline] { (Branch: 19 testsuite-wasm-jit)
[Pipeline] { (Branch: 20 testsuite-windows)
[Pipeline] { (Branch: 21 cross-build-omc-msvc)
[Pipeline] stage
[Pipeline] { (04 testsuite-gcc 1/2)
[Pipeline] stage
[Pipeline] { (05 testsuite-clang 2/2)
[Pipeline] stage
[Pipeline] { (10 web target)
[Pipeline] stage
[Pipeline] { (10b qt-web target)
[Pipeline] stage
[Pipeline] { (11 build-gui-rust)
[Pipeline] stage
[Pipeline] { (12 unit-tests-rust)
[Pipeline] stage
[Pipeline] { (13 cross-build-fmu)
[Pipeline] stage
[Pipeline] { (14 testsuite-compliance)
[Pipeline] stage
[Pipeline] { (15 build-usersguide)
[Pipeline] stage
[Pipeline] { (17 build-gui-clang + omedit-testsuite)
[Pipeline] stage
[Pipeline] { (18 testsuite-misc)
[Pipeline] stage
[Pipeline] { (19 testsuite-wasm-jit)
[Pipeline] stage
[Pipeline] { (20 testsuite-windows)
[Pipeline] stage
[Pipeline] { (21 cross-build-omc-msvc)
Stage "04 testsuite-gcc 1/2" skipped due to earlier failure(s)
[Pipeline] getContext
[Pipeline] }
Stage "05 testsuite-clang 2/2" skipped due to earlier failure(s)
[Pipeline] getContext
[Pipeline] }
Stage "10 web target" skipped due to earlier failure(s)
[Pipeline] getContext
[Pipeline] }
Stage "10b qt-web target" skipped due to earlier failure(s)
[Pipeline] getContext
[Pipeline] }
Stage "11 build-gui-rust" skipped due to earlier failure(s)
[Pipeline] getContext
[Pipeline] }
Stage "12 unit-tests-rust" skipped due to earlier failure(s)
[Pipeline] getContext
[Pipeline] }
Stage "13 cross-build-fmu" skipped due to earlier failure(s)
[Pipeline] getContext
[Pipeline] }
Stage "14 testsuite-compliance" skipped due to earlier failure(s)
[Pipeline] getContext
[Pipeline] }
Stage "15 build-usersguide" skipped due to earlier failure(s)
[Pipeline] getContext
[Pipeline] }
Stage "17 build-gui-clang + omedit-testsuite" skipped due to earlier failure(s)
[Pipeline] getContext
[Pipeline] }
Stage "18 testsuite-misc" skipped due to earlier failure(s)
[Pipeline] getContext
[Pipeline] }
Stage "19 testsuite-wasm-jit" skipped due to earlier failure(s)
[Pipeline] getContext
[Pipeline] }
Stage "20 testsuite-windows" skipped due to earlier failure(s)
[Pipeline] getContext
[Pipeline] }
Stage "21 cross-build-omc-msvc" skipped due to earlier failure(s)
[Pipeline] getContext
[Pipeline] }
[Pipeline] // stage
[Pipeline] // stage
[Pipeline] // stage
[Pipeline] // stage
[Pipeline] // stage
[Pipeline] // stage
[Pipeline] // stage
[Pipeline] // stage
[Pipeline] // stage
[Pipeline] // stage
[Pipeline] // stage
[Pipeline] // stage
[Pipeline] // stage
[Pipeline] // stage
[Pipeline] }
Failed in branch 04 testsuite-gcc 1/2
[Pipeline] }
Failed in branch 05 testsuite-clang 2/2
[Pipeline] }
Failed in branch 10 web target
[Pipeline] }
Failed in branch 10b qt-web target
[Pipeline] }
Failed in branch 11 build-gui-rust
[Pipeline] }
Failed in branch 12 unit-tests-rust
[Pipeline] }
Failed in branch 13 cross-build-fmu
[Pipeline] }
Failed in branch 14 testsuite-compliance
[Pipeline] }
Failed in branch 15 build-usersguide
[Pipeline] }
Failed in branch 17 build-gui-clang + omedit-testsuite
[Pipeline] }
Failed in branch 18 testsuite-misc
[Pipeline] }
Failed in branch 19 testsuite-wasm-jit
[Pipeline] }
Failed in branch 20 testsuite-windows
[Pipeline] }
Failed in branch 21 cross-build-omc-msvc
[Pipeline] // parallel
[Pipeline] }
[Pipeline] // stage
[Pipeline] stage
[Pipeline] { (check-and-upload)
Stage "check-and-upload" skipped due to earlier failure(s)
[Pipeline] getContext
[Pipeline] parallel
[Pipeline] { (Branch: linux-FMPy)
[Pipeline] { (Branch: coverage-report)
[Pipeline] { (Branch: upload-compliance)
[Pipeline] { (Branch: upload-doc)
[Pipeline] { (Branch: upload-web)
[Pipeline] stage
[Pipeline] { (linux-FMPy)
[Pipeline] stage
[Pipeline] { (coverage-report)
[Pipeline] stage
[Pipeline] { (upload-compliance)
[Pipeline] stage
[Pipeline] { (upload-doc)
[Pipeline] stage
[Pipeline] { (upload-web)
Stage "linux-FMPy" skipped due to earlier failure(s)
[Pipeline] getContext
[Pipeline] }
Stage "coverage-report" skipped due to earlier failure(s)
[Pipeline] getContext
[Pipeline] }
Stage "upload-compliance" skipped due to earlier failure(s)
[Pipeline] getContext
[Pipeline] }
Stage "upload-doc" skipped due to earlier failure(s)
[Pipeline] getContext
[Pipeline] }
Stage "upload-web" skipped due to earlier failure(s)
[Pipeline] getContext
[Pipeline] }
[Pipeline] // stage
[Pipeline] // stage
[Pipeline] // stage
[Pipeline] // stage
[Pipeline] // stage
[Pipeline] }
Failed in branch linux-FMPy
[Pipeline] }
Failed in branch coverage-report
[Pipeline] }
Failed in branch upload-compliance
[Pipeline] }
Failed in branch upload-doc
[Pipeline] }
Failed in branch upload-web
[Pipeline] // parallel
[Pipeline] }
[Pipeline] // stage
[Pipeline] stage
[Pipeline] { (publish)
Stage "publish" skipped due to earlier failure(s)
[Pipeline] getContext
[Pipeline] parallel
[Pipeline] { (Branch: push-to-master)
[Pipeline] { (Branch: push-bibliography)
[Pipeline] stage
[Pipeline] { (push-to-master)
[Pipeline] stage
[Pipeline] { (push-bibliography)
Stage "push-to-master" skipped due to earlier failure(s)
[Pipeline] getContext
[Pipeline] }
Stage "push-bibliography" skipped due to earlier failure(s)
[Pipeline] getContext
[Pipeline] }
[Pipeline] // stage
[Pipeline] // stage
[Pipeline] }
Failed in branch push-to-master
[Pipeline] }
Failed in branch push-bibliography
[Pipeline] // parallel
[Pipeline] }
[Pipeline] // stage
[Pipeline] stage
[Pipeline] { (Declarative: Post Actions)
[Pipeline] script
[Pipeline] {
[Pipeline] emailext
Sending email to: $DEFAULT_TO
Could not be sent to the following addresses: $DEFAULT_TO
[Pipeline] }
[Pipeline] // script
[Pipeline] }
[Pipeline] // stage
[Pipeline] }
[Pipeline] // withEnv
[Pipeline] End of Pipeline
ERROR: script returned exit code 2

GitHub has been notified of this commit’s build result

Finished: FAILURE