Skip to content
Skipping 147,260 KB.. Full Log
          Start 2141: simulation.modelica.NBackend.initialization.functionOutputStartAlias.mos
[functionTest9.mos:0] OK
[functionTest8.mos:1] OK
[functionTest7.mos:1] OK
2130/2658 Test #2130: simulation.modelica.NBackend.functions.tupleCallInForLoop.mos .............................................................................................   Passed    0.91 sec
          Start 2142: simulation.modelica.NBackend.initialization.homotopy_no_loop.mos
2131/2658 Test #2131: simulation.modelica.NBackend.index_reduction.aux_states.mos ...............................................................................................   Passed    0.96 sec
          Start 2143: simulation.modelica.NBackend.initialization.init_if_exp.mos
2132/2658 Test #2132: simulation.modelica.NBackend.index_reduction.derivativeDummyState.mos .....................................................................................   Passed    0.92 sec
          Start 2144: simulation.modelica.NBackend.initialization.primaryParameterRecord.mos
[functionTest5.mos:0] OK
[functionTest4.mos:0] OK
[Test11.mos:2] OK
2133/2658 Test #2135: simulation.modelica.NBackend.init_xml.01_real_array_var.mos ...............................................................................................   Passed    0.89 sec
          Start 2145: simulation.modelica.NBackend.initialization.resizableParameterBinding.mos
2134/2658 Test #2136: simulation.modelica.NBackend.init_xml.03_real_state_array_var.mos .........................................................................................   Passed    0.90 sec
          Start 2146: simulation.modelica.NBackend.records.ComplexTest.mos
2135/2658 Test #2137: simulation.modelica.NBackend.init_xml.05_int_multi_dim_array_var.mos ......................................................................................   Passed    0.89 sec
          Start 2147: simulation.modelica.NBackend.records.RecordCausality.mos
[functionArray.mos:0] OK
[VectorizeMultipleUnknown.mos:0] OK
[Test10.mos:2] OK
[NumberOfSymmetricBaseSystems.mos:0] OK
[Test1.mos:2] OK
2136/2658 Test #2138: simulation.modelica.NBackend.initialization.TestInversePlant.mos ..........................................................................................   Passed    1.16 sec
          Start 2148: simulation.modelica.NBackend.records.nestedRecordBinding.mos
2137/2658 Test #2140: simulation.modelica.NBackend.initialization.functionAliasStartLoop.mos ....................................................................................   Passed    0.93 sec
          Start 2149: simulation.modelica.NBackend.records.record_arrays.mos
2138/2658 Test #2141: simulation.modelica.NBackend.initialization.functionOutputStartAlias.mos ..................................................................................   Passed    0.91 sec
          Start 2150: simulation.modelica.NBackend.records.simple_record.mos
2139/2658 Test #2142: simulation.modelica.NBackend.initialization.homotopy_no_loop.mos ..........................................................................................   Passed    0.93 sec
          Start 2151: simulation.modelica.NBackend.records.zeroSizeRecordField.mos
2140/2658 Test #2144: simulation.modelica.NBackend.initialization.primaryParameterRecord.mos ....................................................................................   Passed    0.89 sec
          Start 2152: simulation.modelica.NBackend.simplification.simplifyIf.mos
2141/2658 Test #2143: simulation.modelica.NBackend.initialization.init_if_exp.mos ...............................................................................................   Passed    0.94 sec
          Start 2153: simulation.modelica.NBackend.simplification.splitIf.mos
2142/2658 Test #2134: simulation.modelica.NBackend.index_reduction.static_IR.mos ................................................................................................   Passed    1.75 sec
          Start 2154: simulation.modelica.NBackend.solve.scalarFromSingleElementArray.mos
2143/2658 Test #2145: simulation.modelica.NBackend.initialization.resizableParameterBinding.mos .................................................................................   Passed    0.92 sec
          Start 2155: simulation.modelica.NBackend.solve.solveCallTan.mos
Parsing Modelica with file ./Workingexamples/area_inside.m
starting lexer
loadSourceCode finished in: 0.02134ms
Tokens processed:130, time: 0.22924200000000003ms
starting parser
Parser done in time: 0.364251ms

 Translated Modelica Code

function area_inside
  input Real radius;
  input Real num_boxes;
  output Real area_sum "Translator generated data type ";
protected
  Real box_length;
  Real box_rad;
  Real box_area;
  Real xc;
  Real yc;
  Real dist;
algorithm
  box_length := 2.0*radius/num_boxes;
  box_rad := box_length*0.5;
  box_area := box_length*box_length;
  area_sum := 0;
  for xi in 1:num_boxes loop
    xc := -1 + box_rad + box_length*xi - 1;
    for yi in 1:num_boxes loop
      yc := 1 + box_rad + box_length*yi - 1;
      dist := sqrt(xc*xc + yc*yc);
      if dist < radius then
        area_sum := area_sum + box_area;
      end if;
    end for;
  end for;
end area_inside;
true

 Successfulmake: Leaving directory '/var/lib/jenkins/ws/OpenModelica/testsuite/special/MatlabTranslator'
[Pipeline] }
[Pipeline] // withEnv
2144/2658 Test #2147: simulation.modelica.NBackend.records.RecordCausality.mos .[Pipeline] sh
.................................................................................................   Passed    0.91 sec
          Start 2156: simulation.modelica.NBackend.solve.solveMultaryBinary.mos
2145/2658 Test #2128: simulation.modelica.NBackend.functions.function_inline_retype.mos .........................................................................................   Passed    2.59 sec
          Start 2157: simulation.modelica.NBackend.tearing.duplicatePattern.mos
2146/2658 Test #2148: simulation.modelica.NBackend.records.nestedRecordBinding.mos ..............................................................................................   Passed    0.91 sec
          Start 2158: simulation.modelica.NBackend.tearing.impliedInner.mos
2147/2658 Test #2149: simulation.modelica.NBackend.records.record_arrays.mos ....................................................................................................   Passed    0.89 sec
          Start 2159: simulation.modelica.NBackend.tearing.minimalTearing.mos
2148/2658 Test #2150: simulation.modelica.NBackend.records.simple_record.mos ....................................................................................................   Passed    0.89 sec
          Start 2160: simulation.modelica.NBackend.tearing.nonlinearContinuousLoop.mos
2149/2658 Test #2152: simulation.modelica.NBackend.simplification.simplifyIf.mos ................................................................................................   Passed    0.87 sec
          Start 2161: simulation.modelica.NBackend.tearing.partialForArrayBodyLinear.mos
2150/2658 Test #2151: simulation.modelica.NBackend.records.zeroSizeRecordField.mos ..............................................................................................   Passed    0.89 sec
          Start 2162: simulation.modelica.NBackend.tearing.partialNestedFor.mos
+ make -C testsuite/openmodelica/icon-generator test
make: Entering directory '/var/lib/jenkins/ws/OpenModelica/testsuite/openmodelica/icon-generator'

Running tests...

OPENMODELICAHOME=  
 + GenerateMSLIcons                                                                  ... 2151/2658 Test #2153: simulation.modelica.NBackend.simplification.splitIf.mos ...................................................................................................   Passed    0.88 sec
          Start 2163: simulation.modelica.NBackend.tearing.torn2DForResidualIndex.mos
2152/2658 Test #2154: simulation.modelica.NBackend.solve.scalarFromSingleElementArray.mos .......................................................................................   Passed    0.88 sec
          Start 2164: simulation.modelica.NBackend.tickets.13328.mos
2153/2658 Test #2155: simulation.modelica.NBackend.solve.solveCallTan.mos .......................................................................................................   Passed    0.89 sec
          Start 2165: simulation.modelica.NBackend.tickets.14530.mos
2154/2658 Test #2156: simulation.modelica.NBackend.solve.solveMultaryBinary.mos .................................................................................................   Passed    0.87 sec
          Start 2166: simulation.modelica.algorithms_functions.17035.mos
2155/2658 Test #2139: simulation.modelica.NBackend.initialization.discreteCallArgument.mos ......................................................................................   Passed    2.63 sec
          Start 2167: simulation.modelica.algorithms_functions.AlgorithmCondAssign1.mos
2156/2658 Test #2157: simulation.modelica.NBackend.tearing.duplicatePattern.mos .................................................................................................   Passed    0.92 sec
          Start 2168: simulation.modelica.algorithms_functions.AlgorithmForInClass.mos
[functionEvaluation.mos:2] OK
2157/2658 Test #2158: simulation.modelica.NBackend.tearing.impliedInner.mos .....................................................................................................   Passed    0.91 sec
          Start 2169: simulation.modelica.algorithms_functions.AlgorithmSize.mos
2158/2658 Test #2159: simulation.modelica.NBackend.tearing.minimalTearing.mos ...................................................................................................   Passed    0.90 sec
          Start 2170: simulation.modelica.algorithms_functions.ArrayInitSorting.mos
2159/2658 Test #2160: simulation.modelica.NBackend.tearing.nonlinearContinuousLoop.mos ..........................................................................................   Passed    0.90 sec
          Start 2171: simulation.modelica.algorithms_functions.DoubleWhenSequential.mos
2160/2658 Test #2162: simulation.modelica.NBackend.tearing.partialNestedFor.mos .................................................................................................   Passed    0.88 sec
          Start 2172: simulation.modelica.algorithms_functions.ForIterator2.mos
2161/2658 Test #2161: simulation.modelica.NBackend.tearing.partialForArrayBodyLinear.mos ........................................................................................   Passed    0.91 sec
          Start 2173: simulation.modelica.algorithms_functions.FunctionInReinit.mos
2162/2658 Test #2164: simulation.modelica.NBackend.tickets.13328.mos ............................................................................................................   Passed    0.93 sec
          Start 2174: simulation.modelica.algorithms_functions.FunctionIndirectRecursion2.mos
[RtlInverter.mos:2] OK
[OverdeterminedInitialization.Fluid.DynamicPipesSeriesLargeNSteadyStateInitial.mos:12] OK
2163/2658 Test #2163: simulation.modelica.NBackend.tearing.torn2DForResidualIndex.mos ...........................................................................................   Passed    0.99 sec
          Start 2175: simulation.modelica.algorithms_functions.FunctionPointerArray.mos
2164/2658 Test #2172: simulation.modelica.algorithms_functions.ForIterator2.mos .................................................................................................   Passed    0.24 sec
          Start 2176: simulation.modelica.algorithms_functions.FunctionPointerRecordOutput.mos
2165/2658 Test #2174: simulation.modelica.algorithms_functions.FunctionIndirectRecursion2.mos ...................................................................................   Passed    0.14 sec
          Start 2177: simulation.modelica.algorithms_functions.IntegralNewtonCotes.mos
[CascodeCircuit.mos:3] OK
2166/2658 Test #2167: simulation.modelica.algorithms_functions.AlgorithmCondAssign1.mos .........................................................................................   Passed    0.90 sec
          Start 2178: simulation.modelica.algorithms_functions.InverseAlgorithm1.mos
[TestRoots.mos:0] OK
[extObj_ticket3446.mos:0] OK
2167/2658 Test #2168: simulation.modelica.algorithms_functions.AlgorithmForInClass.mos ..........................................................................................   Passed    0.93 sec
          Start 2179: simulation.modelica.algorithms_functions.InverseAlgorithm3.mos
2168/2658 Test #2170: simulation.modelica.algorithms_functions.ArrayInitSorting.mos .............................................................................................   Passed    0.89 sec
          Start 2180: simulation.modelica.algorithms_functions.Issue16192.mos
2169/2658 Test #2171: simulation.modelica.algorithms_functions.DoubleWhenSequential.mos .........................................................................................   Passed    0.91 sec
          Start 2181: simulation.modelica.algorithms_functions.LocalVariableInit.mos
[Inverter2.mos:3] OK
[RecordMemberArguments.mos:0] OK
[QualifiedCrefArg.mos:0] OK
2170/2658 Test #2173: simulation.modelica.algorithms_functions.FunctionInReinit.mos .............................................................................................   Passed    0.89 sec
          Start 2182: simulation.modelica.algorithms_functions.SimplePeriodicSampler.mos
2171/2658 Test #2175: simulation.modelica.algorithms_functions.FunctionPointerArray.mos .........................................................................................   Passed    0.90 sec
          Start 2183: simulation.modelica.algorithms_functions.TestCrossFunction.mos
2172/2658 Test #2165: simulation.modelica.NBackend.tickets.14530.mos ............................................................................................................   Passed    1.75 sec
          Start 2184: simulation.modelica.algorithms_functions.WhenPriority.mos
2173/2658 Test #2176: simulation.modelica.algorithms_functions.FunctionPointerRecordOutput.mos ..................................................................................   Passed    0.91 sec
          Start 2185: simulation.modelica.algorithms_functions.WhenStatement2.mos
[PrebuiltWasmExternals.mos:0] OK
[Nand.mos:4] OK
2174/2658 Test #2178: simulation.modelica.algorithms_functions.InverseAlgorithm1.mos ............................................................................................   Passed    0.89 sec
          Start 2186: simulation.modelica.algorithms_functions.ZeroCross.mos
2175/2658 Test #2179: simulation.modelica.algorithms_functions.InverseAlgorithm3.mos ............................................................................................   Passed    0.92 sec
          Start 2187: simulation.modelica.algorithms_functions.bug2888.mos
[ModelicaUtilities.mos:1] OK
[Matrix.mos:0] OK
2176/2658 Test #2181: simulation.modelica.algorithms_functions.LocalVariableInit.mos ............................................................................................   Passed    0.90 sec
          Start 2188: simulation.modelica.algorithms_functions.bug_2286.mos
2177/2658 Test #2180: simulation.modelica.algorithms_functions.Issue16192.mos ...................................................................................................   Passed    0.95 sec
          Start 2189: simulation.modelica.algorithms_functions.bug_2452.mos
2178/2658 Test #2182: simulation.modelica.algorithms_functions.SimplePeriodicSampler.mos ........................................................................................   Passed    0.90 sec
          Start 2190: simulation.modelica.algorithms_functions.bug_6068.mos
2179/2658 Test #2189: simulation.modelica.algorithms_functions.bug_2452.mos .....................................................................................................   Passed    0.18 sec
          Start 2191: simulation.modelica.algorithms_functions.val.mos
[LapackInverse.mos:0] OK
2180/2658 Test #2184: simulation.modelica.algorithms_functions.WhenPriority.mos .................................................................................................   Passed    0.92 sec
          Start 2192: simulation.modelica.algorithms_functions.whenFunctionTuple.mos
2181/2658 Test #2185: simulation.modelica.algorithms_functions.WhenStatement2.mos ...............................................................................................   Passed    0.91 sec
          Start 2193: simulation.modelica.arrays.ABCDsystem.csv.mos
[GetExternalFunctions.mos:0] OK
[ImplicitArray.mos:0] OK
2182/2658 Test #2186: simulation.modelica.algorithms_functions.ZeroCross.mos ....................................................................................................   Passed    0.93 sec
          Start 2194: simulation.modelica.arrays.ABCDsystem.plt.mos
[ExternalUncaughtException.mos:0] OK
[ExternalRHSFlag.mos:0] OK
[ThermoPower.Examples.HRB.Simulators.ClosedLoopDigitalSimulator.mos:27] OK
2183/2658 Test #2169: simulation.modelica.algorithms_functions.AlgorithmSize.mos ................................................................................................   Passed    2.67 sec
          Start 2195: simulation.modelica.arrays.AppendElement.mos
2184/2658 Test #2187: simulation.modelica.algorithms_functions.bug2888.mos ......................................................................................................   Passed    0.89 sec
          Start 2196: simulation.modelica.arrays.ArrayBox.mos
2185/2658 Test #2188: simulation.modelica.algorithms_functions.bug_2286.mos .....................................................................................................   Passed    0.92 sec
          Start 2197: simulation.modelica.arrays.ArrayEquation.mos
2186/2658 Test #2166: simulation.modelica.algorithms_functions.17035.mos ........................................................................................................   Passed    3.15 sec
          Start 2198: simulation.modelica.arrays.ArrayFromRange.mos
2187/2658 Test #2190: simulation.modelica.algorithms_functions.bug_6068.mos .....................................................................................................   Passed    0.91 sec
          Start 2199: simulation.modelica.arrays.ArrayMult.mos
[EngineV6_partlintorn.mos:27] OK
2188/2658 Test #2198: simulation.modelica.arrays.ArrayFromRange.mos .............................................................................................................   Passed    0.14 sec
          Start 2200: simulation.modelica.arrays.ArrayReduce.mos
2189/2658 Test #2191: simulation.modelica.algorithms_functions.val.mos ..........................................................................................................   Passed    0.89 sec
          Start 2201: simulation.modelica.arrays.ArraySlice.mos
2190/2658 Test #2177: simulation.modelica.algorithms_functions.IntegralNewtonCotes.mos ..........................................................................................   Passed    2.60 sec
          Start 2202: simulation.modelica.arrays.ArraySliceAssigmentFunction.mos
2191/2658 Test #2193: simulation.modelica.arrays.ABCDsystem.csv.mos .............................................................................................................   Passed    0.89 sec
          Start 2203: simulation.modelica.arrays.AsubCrefExpType.mos
2192/2658 Test #2192: simulation.modelica.algorithms_functions.whenFunctionTuple.mos ............................................................................................   Passed    0.92 sec
          Start 2204: simulation.modelica.arrays.BooleanArray2.mos
[ExternalNlsRecovery.mos:0] OK
2193/2658 Test #2204: simulation.modelica.arrays.BooleanArray2.mos ..............................................................................................................   Passed    0.14 sec
          Start 2205: simulation.modelica.arrays.Bug3187.mos
[ExternalLibraries.mos:1] OK
[ExternalCFuncInputOnly.mos:1] OK
ok [time: 4]

== 0 out of 1 tests failed [openmodelica/icon-generator, time: 4]
make: Leaving directory '/var/lib/jenkins/ws/OpenModelica/testsuite/openmodelica/icon-generator'
[Pipeline] }
$ docker stop --time=1 0354173ac9d9eccf5008a4574a1f09f8444a9ed3c477aa1c3c35ef5a467d1eae
2194/2658 Test #2194: simulation.modelica.arrays.ABCDsystem.plt.mos .............................................................................................................   Passed    1.02 sec
          Start 2206: simulation.modelica.arrays.ConstantSubscriptOutOfRange.mos
2195/2658 Test #2195: simulation.modelica.arrays.AppendElement.mos ..............................................................................................................   Passed    0.90 sec
          Start 2207: simulation.modelica.arrays.DimConvert.mos
[CevalModelicaStrings.mos:0] OK
2196/2658 Test #2196: simulation.modelica.arrays.ArrayBox.mos ...................................................................................................................   Passed    0.93 sec
          Start 2208: simulation.modelica.arrays.FunctionArraySlices.mos
2197/2658 Test #2197: simulation.modelica.arrays.ArrayEquation.mos ..............................................................................................................   Passed    0.94 sec
          Start 2209: simulation.modelica.arrays.NPendulum.mos
2198/2658 Test #2199: simulation.modelica.arrays.ArrayMult.mos ..................................................................................................................   Passed    0.92 sec
          Start 2210: simulation.modelica.arrays.PolynomialEvaluator2.mos
2199/2658 Test #2183: simulation.modelica.algorithms_functions.TestCrossFunction.mos ............................................................................................   Passed    2.67 sec
          Start 2211: simulation.modelica.arrays.PolynomialEvaluatorA.mos
2200/2658 Test #2200: simulation.modelica.arrays.ArrayReduce.mos ................................................................................................................   Passed    0.89 sec
          Start 2212: simulation.modelica.arrays.StringArrayLiteral.mos
2201/2658 Test #2202: simulation.modelica.arrays.ArraySliceAssigmentFunction.mos ................................................................................................   Passed    0.89 sec
          Start 2213: simulation.modelica.arrays.VectorizeOneReturnValue.mos
2202/2658 Test #2201: simulation.modelica.arrays.ArraySlice.mos .................................................................................................................   Passed    0.95 sec
          Start 2214: simulation.modelica.arrays.Xpowers2.mos
2203/2658 Test #2203: simulation.modelica.arrays.AsubCrefExpType.mos ............................................................................................................   Passed    0.90 sec
          Start 2215: simulation.modelica.arrays.ZeroSizeLoop.mos
[ExtObj.mos:0] OK
2204/2658 Test #2205: simulation.modelica.arrays.Bug3187.mos ....................................................................................................................   Passed    1.14 sec
          Start 2216: simulation.modelica.arrays.bug_2911.mos
[whenTest2.mos:1] OK
2205/2658 Test #2206: simulation.modelica.arrays.ConstantSubscriptOutOfRange.mos ................................................................................................   Passed    0.88 sec
          Start 2217: simulation.modelica.arrays.crefIndex.mos
2206/2658 Test #2207: simulation.modelica.arrays.DimConvert.mos .................................................................................................................   Passed    0.90 sec
          Start 2218: simulation.modelica.arrays.gc2980.mos
2207/2658 Test #2208: simulation.modelica.arrays.FunctionArraySlices.mos ........................................................................................................   Passed    0.94 sec
          Start 2219: simulation.modelica.arrays.ticket5114.mos
2208/2658 Test #2210: simulation.modelica.arrays.PolynomialEvaluator2.mos .......................................................................................................   Passed    0.88 sec
          Start 2220: simulation.modelica.arrays.ticket_6099.mos
[PriorityQueue.mos:23] OK
[Modelica.Electrical.Analog.Examples.CauerLowPassSC.mos:27] OK
[ExtObjStringParam.mos:2] OK
$ docker rm -f --volumes 0354173ac9d9eccf5008a4574a1f09f8444a9ed3c477aa1c3c35ef5a467d1eae
2209/2658 Test #2211: simulation.modelica.arrays.PolynomialEvaluatorA.mos .......................................................................................................   Passed    0.90 sec
          Start 2221: simulation.modelica.asserts.AssertTest1.mos
2210/2658 Test #2212: simulation.modelica.arrays.StringArrayLiteral.mos .........................................................................................................   Passed    0.90 sec
          Start 2222: simulation.modelica.asserts.AssertTest3.mos
2211/2658 Test #2213: simulation.modelica.arrays.VectorizeOneReturnValue.mos ....................................................................................................   Passed    0.91 sec
          Start 2223: simulation.modelica.asserts.AssertTest5.mos
2212/2658 Test #2214: simulation.modelica.arrays.Xpowers2.mos ...................................................................................................................   Passed    0.91 sec
          Start 2224: simulation.modelica.asserts.AssertTest7.mos
2213/2658 Test #2215: simulation.modelica.arrays.ZeroSizeLoop.mos ...............................................................................................................   Passed    0.90 sec
          Start 2225: simulation.modelica.asserts.TestAssert.mos
[whenTest1.mos:0] OK
[MDD_test.mos:3] OK
[sample2.mos:1] OK
2214/2658 Test #2216: simulation.modelica.arrays.bug_2911.mos ...................................................................................................................   Passed    0.91 sec
          Start 2226: simulation.modelica.asserts.powAssert2.mos
2215/2658 Test #2217: simulation.modelica.arrays.crefIndex.mos ..................................................................................................................   Passed    0.95 sec
          Start 2227: simulation.modelica.asserts.testAssertSolve.mos
[ModelicaIOMatrix73.mos:5] OK
[sample1.mos:1] OK
[Pipeline] // withDockerContainer
[RK_01.mos:31] OK
2216/2658 Test #2221: simulation.modelica.asserts.AssertTest1.mos ...............................................................................................................   Passed    0.91 sec
          Start 2228: simulation.modelica.built_in_functions.Compare.mos
2217/2658 Test #2223: simulation.modelica.asserts.AssertTest5.mos ...............................................................................................................   Passed    0.94 sec
          Start 2229: simulation.modelica.built_in_functions.DerInvalid.mos
[Pipeline] }
[noEventNotRespected.mos:0] OK
[noEventEmit.mos:0] OK
[divisionByZeroAtEvent.mos:0] OK
2218/2658 Test #2224: simulation.modelica.asserts.AssertTest7.mos ...............................................................................................................   Passed    0.92 sec
          Start 2230: simulation.modelica.built_in_functions.DummyDerMatching.mos
2219/2658 Test #2229: simulation.modelica.built_in_functions.DerInvalid.mos .....................................................................................................   Passed    0.15 sec
          Start 2231: simulation.modelica.built_in_functions.HydrogenIodide.mos
[Pipeline] // script
[ModelicaIOMatrix.mos:4] OK
[discreteRelations.mos:0] OK
[derInWhenCondition.mos:0] OK
[cseOutsideNoEvent.mos:0] OK
[bug4419.mos:0] OK
[bug3358.mos:1] OK
2220/2658 Test #2226: simulation.modelica.asserts.powAssert2.mos ................................................................................................................   Passed    0.97 sec
          Start 2232: simulation.modelica.built_in_functions.LotkaVolterra.mos
2221/2658 Test #2227: simulation.modelica.asserts.testAssertSolve.mos ...........................................................................................................   Passed    0.91 sec
          Start 2233: simulation.modelica.built_in_functions.NthRoot1.mos
2222/2658 Test #2220: simulation.modelica.arrays.ticket_6099.mos ................................................................................................................   Passed    1.70 sec
          Start 2234: simulation.modelica.built_in_functions.NthRoot3.mos
2223/2658 Test #2218: simulation.modelica.arrays.gc2980.mos .....................................................................................................................   Passed    1.88 sec
          Start 2235: simulation.modelica.built_in_functions.SampledPrints.mos
2224/2658 Test #2222: simulation.modelica.asserts.AssertTest3.mos ...............................................................................................................   Passed    1.66 sec
          Start 2236: simulation.modelica.built_in_functions.SemiLinearTest2.mos
[ThermoSysPro.Examples.SimpleExamples.TestDynamicDrum.mos:21] OK
[bug2808.mos:1] OK
[bug3092.mos:1] OK
[bug2752.mos:1] OK
[bug2718.mos:0] OK
2225/2658 Test #2230: simulation.modelica.built_in_functions.DummyDerMatching.mos ...............................................................................................   Passed    1.01 sec
          Start 2237: simulation.modelica.built_in_functions.Time.mos
2226/2658 Test #2231: simulation.modelica.built_in_functions.HydrogenIodide.mos .................................................................................................   Passed    0.90 sec
          Start 2238: simulation.modelica.built_in_functions.delay.Delay.mos
[bug2667.mos:0] OK
[bug1228.mos:0] OK
[ZeroCrossing.mos:0] OK
Post stage
[ServerWithQueue.mos:0] OK
[TestNoEventsFlags.mos:0] OK
[Reinit.mos:0] OK
2227/2658 Test #2219: simulation.modelica.arrays.ticket5114.mos .................................................................................................................   Passed    2.57 sec
          Start 2239: simulation.modelica.built_in_functions.delay.DelayTooSmall.mos
2228/2658 Test #2232: simulation.modelica.built_in_functions.LotkaVolterra.mos ..................................................................................................   Passed    0.90 sec
          Start 2240: simulation.modelica.built_in_functions.spatialDistribution.bigStepEventFallback.mos
2229/2658 Test #2233: simulation.modelica.built_in_functions.NthRoot1.mos .......................................................................................................   Passed    0.90 sec
          Start 2241: simulation.modelica.built_in_functions.spatialDistribution.doubleReversal.mos
2230/2658 Test #2234: simulation.modelica.built_in_functions.NthRoot3.mos .......................................................................................................   Passed    0.90 sec
          Start 2242: simulation.modelica.built_in_functions.spatialDistribution.initSpatialDistribution.mos
2231/2658 Test #2228: simulation.modelica.built_in_functions.Compare.mos ........................................................................................................   Passed    1.66 sec
          Start 2243: simulation.modelica.built_in_functions.spatialDistribution.mixedVelocity.mos
2232/2658 Test #2236: simulation.modelica.built_in_functions.SemiLinearTest2.mos ................................................................................................   Passed    0.92 sec
          Start 2244: simulation.modelica.built_in_functions.spatialDistribution.nonZeroStartPosition.mos
[MathEventFuncs1.mos:0] OK
[IntegerZeroCrossings.mos:1] OK
[MathEventFuncs2.mos:1] OK
[EventTests3.mos:1] OK
2233/2658 Test #2146: simulation.modelica.NBackend.records.ComplexTest.mos ......................................................................................................   Passed    9.62 sec
          Start 2245: simulation.modelica.built_in_functions.spatialDistribution.rampInput.mos
[EventTests2.mos:0] OK
[EventTests.mos:0] OK
2234/2658 Test #2237: simulation.modelica.built_in_functions.Time.mos ...........................................................................................................   Passed    0.91 sec
          Start 2246: simulation.modelica.built_in_functions.spatialDistribution.test1.mos
2235/2658 Test #2238: simulation.modelica.built_in_functions.delay.Delay.mos ....................................................................................................   Passed    0.97 sec
          Start 2247: simulation.modelica.built_in_functions.spatialDistribution.test3.mos
[Pipeline] junit
[EventLoop.mos:0] OK
[EventIteration.mos:0] OK
[EventDelay.mos:0] OK
[whenInAlgorithm.mos:3] OK
Recording test results
[Pipeline] }
2236/2658 Test #2239: simulation.modelica.built_in_functions.delay.DelayTooSmall.mos ............................................................................................   Passed    0.93 sec
          Start 2248: simulation.modelica.commonSubExp.comSubExp1.mos
[DelayZeroCrossing.mos:0] OK
[CheckEvents.mos:0] OK
[ChatteringEventsTest2.mos:0] OK
[ChatteringEventsTest1.mos:0] OK
[Pipeline] // withEnv
[Pipeline] }
[when_sorting.mos:1] OK
[ticket-5206.mos:1] OK
[ticket-2337.mos:1] OK
[Pipeline] // withEnv
[Modelica_Mechanics_MultiBody_Examples_Elementary_Pendulum.mos:21] OK
[Modelica.Fluid.Examples.BranchingDynamicPipes.mos:24] OK
[Pipeline] }
[Pipeline] // ws
[deriveToLog.mos:1] OK
[constantLinSys.mos:1] OK
[WhenEquation1.mos:0] OK
[WhenEquation.mos:0] OK
[Pipeline] }
[Pipeline] // node
[Pipeline] }
[WatchDog2EquationWhen.mos:0] OK
[WatchDog1AlgorithmWhen.mos:0] OK
[ts.mos:9] OK
[ModelBalance4.mos:0] OK
[ModelBalance3.mos:0] OK
[ModelBalance2.mos:0] OK
2237/2658 Test #2225: simulation.modelica.asserts.TestAssert.mos ................................................................................................................   Passed    3.96 sec
          Start 2249: simulation.modelica.commonSubExp.cse2.mos
2238/2658 Test #2235: simulation.modelica.built_in_functions.SampledPrints.mos ..................................................................................................   Passed    2.57 sec
          Start 2250: simulation.modelica.commonSubExp.cse3.mos
2239/2658 Test #2248: simulation.modelica.commonSubExp.comSubExp1.mos ...........................................................................................................   Passed    0.93 sec
          Start 2251: simulation.modelica.commonSubExp.cseFunctionCall2.mos
[Pipeline] // retry
        PASS [  24.137s] ( 195/1414) openmodelica_codegen_wasm_jit CodegenWasmJit::link_tests::fmu_component_links_the_carried_libraries
[Pipeline] }
[VariableSubscriptAlias.mos:0] OK
[ModelBalance1.mos:0] OK
[IfEquationUnbalanced.mos:0] OK
[IfEquation5.mos:1] OK
[Pipeline] // stage
[Pipeline] }
[MoistAir.mos:27] OK
[Modelica.Mechanics.MultiBody.Examples.Loops.EngineV6_analytic.mos:24] OK
[IfEquation4.mos:1] OK
[IfEquation3.mos:1] OK
[IfEquation.mos:1] OK
[IfEquation2.mos:1] OK
[Modelica.Electrical.Analog.Examples.CauerLowPassSC.mos:51] OK
[HideVariableForEquations.mos:0] OK
[HelloWorld.mos:0] OK
2240/2658 Test #2240: simulation.modelica.built_in_functions.spatialDistribution.bigStepEventFallback.mos .......................................................................   Passed    2.58 sec
          Start 2252: simulation.modelica.commonSubExp.cseFunctionCall4.mos
2241/2658 Test #2249: simulation.modelica.commonSubExp.cse2.mos .................................................................................................................   Passed    0.98 sec
          Start 2253: simulation.modelica.commonSubExp.cseFunctionCall4c.mos
2242/2658 Test #2241: simulation.modelica.built_in_functions.spatialDistribution.doubleReversal.mos .............................................................................   Passed    2.62 sec
          Start 2254: simulation.modelica.commonSubExp.cseFunctionCall5.mos
2243/2658 Test #2243: simulation.modelica.built_in_functions.spatialDistribution.mixedVelocity.mos ..............................................................................   Passed    2.54 sec
          Start 2255: simulation.modelica.commonSubExp.cseFunctionCall7.mos
2244/2658 Test #2251: simulation.modelica.commonSubExp.cseFunctionCall2.mos .....................................................................................................   Passed    0.92 sec
          Start 2256: simulation.modelica.commonSubExp.cseTestCall1.mos
2245/2658 Test #2244: simulation.modelica.built_in_functions.spatialDistribution.nonZeroStartPosition.mos .......................................................................   Passed    2.58 sec
          Start 2257: simulation.modelica.commonSubExp.cseTestCall3.mos
2246/2658 Test #2209: simulation.modelica.arrays.NPendulum.mos ..................................................................................................................   Passed    6.24 sec
          Start 2258: simulation.modelica.commonSubExp.cseTestCall5.mos
[FiveForEquations.mos:0] OK
[FlatTank.mos:0] OK
[EqualityEquationsCorrect.mos:0] OK
[EqualityEquations.mos:0] OK
[DoubleWhenConflict.mos:0] OK
2247/2658 Test #2245: simulation.modelica.built_in_functions.spatialDistribution.rampInput.mos ..................................................................................   Passed    2.63 sec
          Start 2259: simulation.modelica.commonSubExp.cseTestCall7.mos
[DAEexample2.mos:0] OK
[DAEexample.mos:0] OK
[BouncingBall2.mos:1] OK
2248/2658 Test #2246: simulation.modelica.built_in_functions.spatialDistribution.test1.mos ......................................................................................   Passed    2.57 sec
          Start 2260: simulation.modelica.commonSubExp.wrapFunctionCalls10.mos
2249/2658 Test #2247: simulation.modelica.built_in_functions.spatialDistribution.test3.mos ......................................................................................   Passed    2.57 sec
          Start 2261: simulation.modelica.commonSubExp.wrapFunctionCalls12.mos
[Cross.mos:1] OK
[BouncingBall.mos:1] OK
[BouncingBallExamples.mos:1] OK
[ArrayEquation1.mos:0] OK
2250/2658 Test #2250: simulation.modelica.commonSubExp.cse3.mos .................................................................................................................   Passed    1.64 sec
          Start 2262: simulation.modelica.commonSubExp.wrapFunctionCalls14.mos
2251/2658 Test #2242: simulation.modelica.built_in_functions.spatialDistribution.initSpatialDistribution.mos ....................................................................   Passed    3.40 sec
          Start 2263: simulation.modelica.commonSubExp.wrapFunctionCalls3.mos
2252/2658 Test #2252: simulation.modelica.commonSubExp.cseFunctionCall4.mos .....................................................................................................   Passed    0.91 sec
          Start 2264: simulation.modelica.commonSubExp.wrapFunctionCalls5.mos
2253/2658 Test #2253: simulation.modelica.commonSubExp.cseFunctionCall4c.mos ....................................................................................................   Passed    0.91 sec
          Start 2265: simulation.modelica.commonSubExp.wrapFunctionCalls7.mos
2254/2658 Test #2254: simulation.modelica.commonSubExp.cseFunctionCall5.mos .....................................................................................................   Passed    0.91 sec
          Start 2266: simulation.modelica.commonSubExp.wrapFunctionCalls9.mos
[AliasEquations.mos:0] OK
[ActivateWhenEquation.mos:0] OK
[TestPosture.mos:0] OK
[EnumArrayArray.mos:0] OK
[EnumArray2.mos:0] OK
[simextfunction.mos:19] OK
2255/2658 Test #2255: simulation.modelica.commonSubExp.cseFunctionCall7.mos .....................................................................................................   Passed    0.91 sec
          Start 2267: simulation.modelica.connectors.ConstantConnect.mos
2256/2658 Test #2256: simulation.modelica.commonSubExp.cseTestCall1.mos .........................................................................................................   Passed    0.89 sec
          Start 2268: simulation.modelica.connectors.HeatTankExpanded.mos
2257/2658 Test #2257: simulation.modelica.commonSubExp.cseTestCall3.mos .........................................................................................................   Passed    0.91 sec
          Start 2269: simulation.modelica.connectors.StepAdvanced.mos
2258/2658 Test #2258: simulation.modelica.commonSubExp.cseTestCall5.mos .........................................................................................................   Passed    0.88 sec
          Start 2270: simulation.modelica.connectors.TankHybridPI.mos
2259/2658 Test #2259: simulation.modelica.commonSubExp.cseTestCall7.mos .........................................................................................................   Passed    0.90 sec
          Start 2271: simulation.modelica.connectors.TankPI.mos
[EnumArray.mos:0] OK
[WhenNoRetCall.mos:2] OK
[MyPointsInst2.mos:0] OK
2260/2658 Test #2260: simulation.modelica.commonSubExp.wrapFunctionCalls10.mos ..................................................................................................   Passed    0.90 sec
          Start 2272: simulation.modelica.connectors.TanksConnectedPI.mos
2261/2658 Test #2261: simulation.modelica.commonSubExp.wrapFunctionCalls12.mos ..................................................................................................   Passed    0.89 sec
          Start 2273: simulation.modelica.connectors.TopLevelNestedConnectors.mos
[MyPointsInst1.mos:0] OK
[testDAEp8.mos:0] OK
[testDAEp9.mos:0] OK
[testDAEp7.mos:1] OK
[testDAEp6.mos:1] OK
2262/2658 Test #2273: simulation.modelica.connectors.TopLevelNestedConnectors.mos ...............................................................................................   Passed    0.16 sec
          Start 2274: simulation.modelica.daemode.testDAEModeFileSplit_Issue4851.mos
2263/2658 Test #2262: simulation.modelica.commonSubExp.wrapFunctionCalls14.mos ..................................................................................................   Passed    0.91 sec
          Start 2275: simulation.modelica.daemode.testDAEmodeDrumBoiler.mos
[testDAEp5.mos:1] OK
[testDAEp4.mos:1] OK
[testDAEp3.mos:1] OK
[testDAEp1.mos:0] OK
[testDAEp2.mos:0] OK
        PASS [  29.198s] ( 196/1414) openmodelica_codegen_wasm_jit CodegenWasmJitFunctions::runtime::tests::precompiled_runtime_array_cat
2264/2658 Test #2263: simulation.modelica.commonSubExp.wrapFunctionCalls3.mos ...................................................................................................   Passed    0.88 sec
          Start 2276: simulation.modelica.daemode.testDAEp2.mos
2265/2658 Test #2264: simulation.modelica.commonSubExp.wrapFunctionCalls5.mos ...................................................................................................   Passed    0.89 sec
          Start 2277: simulation.modelica.daemode.testDAEp4.mos
2266/2658 Test #2265: simulation.modelica.commonSubExp.wrapFunctionCalls7.mos ...................................................................................................   Passed    0.90 sec
          Start 2278: simulation.modelica.daemode.testDAEp6.mos
2267/2658 Test #2267: simulation.modelica.connectors.ConstantConnect.mos ........................................................................................................   Passed    0.89 sec
          Start 2279: simulation.modelica.daemode.testDAEp8.mos
2268/2658 Test #2266: simulation.modelica.commonSubExp.wrapFunctionCalls9.mos ...................................................................................................   Passed    0.91 sec
          Start 2280: simulation.modelica.declarations.MyPointsInst1.mos
2269/2658 Test #2268: simulation.modelica.connectors.HeatTankExpanded.mos .......................................................................................................   Passed    0.89 sec
          Start 2281: simulation.modelica.enums.EnumArray.mos
2270/2658 Test #2269: simulation.modelica.connectors.StepAdvanced.mos ...........................................................................................................   Passed    0.90 sec
          Start 2282: simulation.modelica.enums.EnumArrayArray.mos
[IfEquation6.mos:3] OK
[TopLevelConnectorArray.mos:0] OK
[TopLevelNestedConnectors.mos:0] OK
[testDAE10.mos:0] OK
2271/2658 Test #2270: simulation.modelica.connectors.TankHybridPI.mos ...........................................................................................................   Passed    0.96 sec
          Start 2283: simulation.modelica.equations.ActivateWhenEquation.mos
2272/2658 Test #2271: simulation.modelica.connectors.TankPI.mos .................................................................................................................   Passed    0.92 sec
          Start 2284: simulation.modelica.equations.ArrayEquation1.mos
[TanksConnectedPI.mos:0] OK
        PASS [  29.856s] ( 197/1414) openmodelica_codegen_wasm_jit CodegenWasmJitFunctions::runtime::tests::precompiled_runtime_array_constructors
2273/2658 Test #2272: simulation.modelica.connectors.TanksConnectedPI.mos .......................................................................................................   Passed    0.97 sec
          Start 2285: simulation.modelica.equations.BouncingBall2.mos
[TankPID.mos:0] OK
[TankPI.mos:0] OK
[TankHybridPID.mos:1] OK
[TankHybridPI.mos:1] OK
[Tank.mos:1] OK
2274/2658 Test #2276: simulation.modelica.daemode.testDAEp2.mos .................................................................................................................   Passed    0.90 sec
          Start 2286: simulation.modelica.equations.Cross.mos
2275/2658 Test #2277: simulation.modelica.daemode.testDAEp4.mos .................................................................................................................   Passed    0.94 sec
          Start 2287: simulation.modelica.equations.DAEexample2.mos
[StepAdvanced.mos:0] OK
[HeatTank.mos:0] OK
[LinearSysEq.mos:0] OK
2276/2658 Test #2280: simulation.modelica.declarations.MyPointsInst1.mos ........................................................................................................   Passed    0.89 sec
          Start 2288: simulation.modelica.equations.EqualityEquations.mos
2277/2658 Test #2279: simulation.modelica.daemode.testDAEp8.mos .................................................................................................................   Passed    0.91 sec
          Start 2289: simulation.modelica.equations.FiveForEquations.mos
2278/2658 Test #2278: simulation.modelica.daemode.testDAEp6.mos .................................................................................................................   Passed    0.94 sec
          Start 2290: simulation.modelica.equations.HelloWorld.mos
2279/2658 Test #2281: simulation.modelica.enums.EnumArray.mos ...................................................................................................................   Passed    0.92 sec
          Start 2291: simulation.modelica.equations.IfEquation.mos
2280/2658 Test #2282: simulation.modelica.enums.EnumArrayArray.mos ..............................................................................................................   Passed    0.89 sec
          Start 2292: simulation.modelica.equations.IfEquation3.mos
2281/2658 Test #2288: simulation.modelica.equations.EqualityEquations.mos .......................................................................................................   Passed    0.16 sec
          Start 2293: simulation.modelica.equations.IfEquation5.mos
2282/2658 Test #2283: simulation.modelica.equations.ActivateWhenEquation.mos ....................................................................................................   Passed    0.91 sec
          Start 2294: simulation.modelica.equations.IfEquationUnbalanced.mos
2283/2658 Test #2284: simulation.modelica.equations.ArrayEquation1.mos ..........................................................................................................   Passed    0.90 sec
          Start 2295: simulation.modelica.equations.ModelBalance2.mos
[HeatTankExpanded.mos:0] OK
[ConstantConnect.mos:0] OK
[wrapFunctionCalls_enums_8166.mos:0] OK
[wrapFunctionCalls9.mos:0] OK
2284/2658 Test #2294: simulation.modelica.equations.IfEquationUnbalanced.mos ....................................................................................................   Passed    0.16 sec
          Start 2296: simulation.modelica.equations.ModelBalance4.mos
2285/2658 Test #2295: simulation.modelica.equations.ModelBalance2.mos ...........................................................................................................   Passed    0.16 sec
          Start 2297: simulation.modelica.equations.WatchDog1AlgorithmWhen.mos
2286/2658 Test #2285: simulation.modelica.equations.BouncingBall2.mos ...........................................................................................................   Passed    0.90 sec
          Start 2298: simulation.modelica.equations.WhenEquation.mos
2287/2658 Test #2296: simulation.modelica.equations.ModelBalance4.mos ...........................................................................................................   Passed    0.16 sec
          Start 2299: simulation.modelica.equations.WhenNoRetCall.mos
[wrapFunctionCalls8.mos:0] OK
[wrapFunctionCalls6.mos:0] OK
[wrapFunctionCalls7.mos:0] OK
[wrapFunctionCalls5.mos:0] OK
[wrapFunctionCalls4.mos:0] OK
[wrapFunctionCalls3.mos:1] OK
[wrapFunctionCalls2.mos:1] OK
[wrapFunctionCalls14.mos:1] OK
        PASS [  31.061s] ( 198/1414) openmodelica_codegen_wasm_jit CodegenWasmJitFunctions::runtime::tests::precompiled_runtime_array_abi
        PASS [  28.950s] ( 199/1414) openmodelica_codegen_wasm_jit CodegenWasmJitFunctions::runtime::tests::precompiled_runtime_array_slice
        PASS [  31.213s] ( 200/1414) openmodelica_codegen_wasm_jit CodegenWasmJitFunctions::runtime::tests::multi_output_tuple
2288/2658 Test #2286: simulation.modelica.equations.Cross.mos ...................................................................................................................   Passed    0.97 sec
          Start 2300: simulation.modelica.equations.deriveToLog.mos
2289/2658 Test #2289: simulation.modelica.equations.FiveForEquations.mos ........................................................................................................   Passed    0.92 sec
          Start 2301: simulation.modelica.equations.ticket-5206.mos
2290/2658 Test #2290: simulation.modelica.equations.HelloWorld.mos ..............................................................................................................   Passed    0.92 sec
          Start 2302: simulation.modelica.events.ChatteringEventsTest1.mos
2291/2658 Test #2287: simulation.modelica.equations.DAEexample2.mos .............................................................................................................   Passed    1.01 sec
          Start 2303: simulation.modelica.events.CheckEvents.mos
2292/2658 Test #2291: simulation.modelica.equations.IfEquation.mos ..............................................................................................................   Passed    0.93 sec
          Start 2304: simulation.modelica.events.EventDelay.mos
2293/2658 Test #2292: simulation.modelica.equations.IfEquation3.mos .............................................................................................................   Passed    0.93 sec
          Start 2305: simulation.modelica.events.EventLoop.mos
[wrapFunctionCalls12.mos:0] OK
[wrapFunctionCalls13.mos:0] OK
[testDAEScaling.mos:2] OK
2294/2658 Test #2293: simulation.modelica.equations.IfEquation5.mos .............................................................................................................   Passed    0.97 sec
          Start 2306: simulation.modelica.events.EventTests2.mos
2295/2658 Test #2297: simulation.modelica.equations.WatchDog1AlgorithmWhen.mos ..................................................................................................   Passed    0.96 sec
          Start 2307: simulation.modelica.events.IntegerZeroCrossings.mos
[wrapFunctionCalls11.mos:0] OK
[wrapFunctionCalls10.mos:0] OK
[wrapFunctionCalls1.mos:0] OK
[cseTestCall7.mos:0] OK
        PASS [  31.855s] ( 201/1414) openmodelica_codegen_wasm_jit CodegenWasmJitFunctions::runtime::tests::host_builtin_sin
2296/2658 Test #2298: simulation.modelica.equations.WhenEquation.mos ............................................................................................................   Passed    0.95 sec
          Start 2308: simulation.modelica.events.MathEventFuncs2.mos
[cseTestCall5.mos:0] OK
[cseTestCall6.mos:0] OK
[cseTestCall4.mos:0] OK
[cseTestCall3.mos:0] OK
[cseTestCall2.mos:0] OK
2297/2658 Test #2300: simulation.modelica.equations.deriveToLog.mos .............................................................................................................   Passed    0.98 sec
          Start 2309: simulation.modelica.events.ServerWithQueue.mos
[cseTestCall1.mos:1] OK
2298/2658 Test #2303: simulation.modelica.events.CheckEvents.mos ................................................................................................................   Passed    0.95 sec
          Start 2310: simulation.modelica.events.ZeroCrossing.mos
2299/2658 Test #2302: simulation.modelica.events.ChatteringEventsTest1.mos ......................................................................................................   Passed    0.96 sec
          Start 2311: simulation.modelica.events.bug2667.mos
2300/2658 Test #2301: simulation.modelica.equations.ticket-5206.mos .............................................................................................................   Passed    0.98 sec
          Start 2312: simulation.modelica.events.bug2752.mos
2301/2658 Test #2304: simulation.modelica.events.EventDelay.mos .................................................................................................................   Passed    0.93 sec
          Start 2313: simulation.modelica.events.bug3092.mos
2302/2658 Test #2305: simulation.modelica.events.EventLoop.mos ..................................................................................................................   Passed    0.96 sec
          Start 2314: simulation.modelica.events.bug4419.mos
[cseFunctionCall8.mos:1] OK
[cseFunctionCall7.mos:1] OK
[cseFunctionCall6.mos:1] OK
[cseFunctionCall5.mos:0] OK
[cseFunctionCall4d.mos:0] OK
2303/2658 Test #2307: simulation.modelica.events.IntegerZeroCrossings.mos .......................................................................................................   Passed    0.99 sec
          Start 2315: simulation.modelica.events.derInWhenCondition.mos
[cseFunctionCall4c.mos:0] OK
[cseFunctionCall4b.mos:0] OK
[cseFunctionCall4.mos:0] OK
[cseFunctionCall3.mos:0] OK
[cseFunctionCall2.mos:0] OK
[cseFunctionCall1.mos:0] OK
Superseded by OpenModelica/master#7991
Sending interrupt signal to process
2304/2658 Test #2308: simulation.modelica.events.MathEventFuncs2.mos ............................................................................................................   Passed    1.03 sec
          Start 2316: simulation.modelica.events.divisionByZeroAtEvent.mos
[cse2_comSubExp.mos:0] OK
Sending interrupt signal to process
2305/2658 Test #2309: simulation.modelica.events.ServerWithQueue.mos ............................................................................................................   Passed    1.00 sec
          Start 2317: simulation.modelica.events.noEventNotRespected.mos
2306/2658 Test #2311: simulation.modelica.events.bug2667.mos ....................................................................................................................   Passed    0.97 sec
          Start 2318: simulation.modelica.events.sample2.mos
2307/2658 Test #2310: simulation.modelica.events.ZeroCrossing.mos ...............................................................................................................   Passed    0.98 sec
          Start 2319: simulation.modelica.events.whenTest1.mos
2308/2658 Test #2306: simulation.modelica.events.EventTests2.mos ................................................................................................................   Passed    1.76 sec
          Start 2320: simulation.modelica.external_functions.CevalModelicaStrings.mos
        PASS [  32.840s] ( 202/1414) openmodelica_codegen_wasm_jit CodegenWasmJitFunctions::runtime::tests::precompiled_runtime_array_builtins
[cse2.mos:1] OK
[comSubExp1.mos:1] OK
[cse1.mos:1] OK
Terminated
Sending interrupt signal to process
Warning: The initial conditions are not fully specified. For more information set -d=initialization. In OMEdit Tools->Options->Simulation->Show additional information from the initialization process, in OMNotebook call setCommandLineOptions("-d=initialization").
Notification: Building FMU for platform 'arm-linux-gnueabihf' (1/5).
Notification: Using docker image 'ghcr.io/openmodelica/crossbuild:v1.28.0' for cross compilation.
Notification: Finished FMU for platform 'arm-linux-gnueabihf' (1/5).
Notification: Building FMU for platform 'x86_64-linux-gnu' (2/5).
Notification: Using docker image 'ghcr.io/openmodelica/crossbuild:v1.28.0' for cross compilation.
Notification: Finished FMU for platform 'x86_64-linux-gnu' (2/5).
Notification: Building FMU for platform 'i686-linux-gnu' (3/5).
Notification: Using docker image 'ghcr.io/openmodelica/crossbuild:v1.28.0' for cross compilation.
Notification: Finished FMU for platform 'i686-linux-gnu' (3/5).
Notification: Building FMU for platform 'x86_64-w64-mingw32' (4/5).
Notification: Using docker image 'ghcr.io/openmodelica/crossbuild:v1.28.0' for cross compilation.
Notification: Finished FMU for platform 'x86_64-w64-mingw32' (4/5).
Notification: Building FMU for platform 'i686-w64-mingw32' (5/5).
Notification: Using docker image 'ghcr.io/openmodelica/crossbuild:v1.28.0' for cross compilation.
Notification: Finished FMU for platform 'i686-w64-mingw32' (5/5).


record SimulationResult
    resultFile = "/var/lib/jenkins/ws/OpenModelica/testsuite/special/FmuExportCrossCompile/RoomHeating_OM_RH_res.csv",
    simulationOptions = "startTime = 0.0, stopTime = 1.0, numberOfIntervals = 2000, tolerance = 1e-6, method = 'euler', fileNamePrefix = 'RoomHeating_OM_RH', options = '', outputFormat = 'csv', variableFilter = '.*', cflags = '', simflags = ''",
    messages = "LOG_ASSERT        | warning | [/var/lib/jenkins/ws/OpenModelica/testsuite/special/FmuExportCrossCompile/RoomHeating_OM.mo:69:5-69:117:writable]
|                 | |       | The following assertion has been violated during initialization at time 0.000000
|                 | |       | ((fanspeed >= 0.01)) --> \"UTRC-FCU-002: FCU air damper should be opened at least 0.10.\"
LOG_SUCCESS       | info    | The initialization finished successfully without homotopy method.
LOG_SUCCESS       | info    | The simulation finished successfully.
profiling:/var/lib/jenkins1:Cannot create directory
profiling:/var/lib/jenkins1/ws/OpenModelica/build_cmake/OMCompiler/SimulationRuntime/c/util/CMakeFiles/OpenModelicaRuntimeCUtil.dir/write_matlab4.c.gcda:Skip
profiling:/var/lib/jenkins1:Cannot create directory
profiling:/var/lib/jenkins1/ws/OpenModelica/build_cmake/OMCompiler/SimulationRuntime/c/util/CMakeFiles/OpenModelicaRuntimeCUtil.dir/write_csv.c.gcda:Skip
profiling:/var/lib/jenkins1:Cannot create directory
profiling:/var/lib/jenkins1/ws/OpenModelica/build_cmake/OMCompiler/SimulationRuntime/c/util/CMakeFiles/OpenModelicaRuntimeCUtil.dir/varinfo.c.gcda:Skip
profiling:/var/lib/jenkins1:Cannot create directory
profiling:/var/lib/jenkins1/ws/OpenModelica/build_cmake/OMCompiler/SimulationRuntime/c/util/CMakeFiles/OpenModelicaRuntimeCUtil.dir/utility.c.gcda:Skip
profiling:/var/lib/jenkins1:Cannot create directory
profiling:/var/lib/jenkins1/ws/OpenModelica/build_cmake/OMCompiler/SimulationRuntime/c/util/CMakeFiles/OpenModelicaRuntimeCUtil.dir/tinymt64.c.gcda:Skip
profiling:/var/lib/jenkins1:Cannot create directory
profiling:/var/lib/jenkins1/ws/OpenModelica/build_cmake/OMCompiler/SimulationRuntime/c/util/CMakeFiles/OpenModelicaRuntimeCUtil.dir/read_matlab4.c.gcda:Skip
profiling:/var/lib/jenkins1:Cannot create directory
profiling:/var/lib/jenkins1/ws/OpenModelica/build_cmake/OMCompiler/SimulationRuntime/c/util/CMakeFiles/OpenModelicaRuntimeCUtil.dir/read_csv.c.gcda:Skip
profiling:/var/lib/jenkins1:Cannot create directory
profiling:/var/lib/jenkins1/ws/OpenModelica/build_cmake/OMCompiler/SimulationRuntime/c/util/CMakeFiles/OpenModelicaRuntimeCUtil.dir/omc_numbers.c.gcda:Skip
profiling:/var/lib/jenkins1:Cannot create directory
profiling:/var/lib/jenkins1/ws/OpenModelica/build_cmake/OMCompiler/SimulationRuntime/c/util/CMakeFiles/OpenModelicaRuntimeCUtil.dir/omc_init.c.gcda:Skip
profiling:/var/lib/jenkins1:Cannot create directory
profiling:/var/lib/jenkins1/ws/OpenModelica/build_cmake/OMCompiler/SimulationRuntime/c/util/CMakeFiles/OpenModelicaRuntimeCUtil.dir/OldModelicaTables.c.gcda:Skip
profiling:/var/lib/jenkins1:Cannot create directory
profiling:/var/lib/jenkins1/ws/OpenModelica/build_cmake/OMCompiler/SimulationRuntime/c/util/CMakeFiles/OpenModelicaRuntimeCUtil.dir/omc_stackoverflow.c.gcda:Skip
profiling:/var/lib/jenkins1:Cannot create directory
profiling:/var/lib/jenkins1/ws/OpenModelica/build_cmake/OMCompiler/SimulationRuntime/c/util/CMakeFiles/OpenModelicaRuntimeCUtil.dir/omc_str_utils.c.gcda:Skip
profiling:/var/lib/jenkins1:Cannot create directory
profiling:/var/lib/jenkins1/ws/OpenModelica/build_cmake/OMCompiler/SimulationRuntime/c/util/CMakeFiles/OpenModelicaRuntimeCUtil.dir/read_write.c.gcda:Skip
profiling:/var/lib/jenkins1:Cannot create directory
profiling:/var/lib/jenkins1/ws/OpenModelica/build_cmake/OMCompiler/SimulationRuntime/c/util/CMakeFiles/OpenModelicaRuntimeCUtil.dir/omc_string.c.gcda:Skip
profiling:/var/lib/jenkins1:Cannot create directory
profiling:/var/lib/jenkins1/ws/OpenModelica/build_cmake/OMCompiler/SimulationRuntime/c/util/CMakeFiles/OpenModelicaRuntimeCUtil.dir/omc_box.c.gcda:Skip
profiling:/var/lib/jenkins1:Cannot create directory
profiling:/var/lib/jenkins1/ws/OpenModelica/build_cmake/OMCompiler/SimulationRuntime/c/util/CMakeFiles/OpenModelicaRuntimeCUtil.dir/libcsv.c.gcda:Skip
profiling:/var/lib/jenkins1:Cannot create directory
profiling:/var/lib/jenkins1/ws/OpenModelica/build_cmake/OMCompiler/SimulationRuntime/c/util/CMakeFiles/OpenModelicaRuntimeCUtil.dir/index_spec.c.gcda:Skip
profiling:/var/lib/jenkins1:Cannot create directory
profiling:/var/lib/jenkins1/ws/OpenModelica/build_cmake/OMCompiler/SimulationRuntime/c/util/CMakeFiles/OpenModelicaRuntimeCUtil.dir/context.c.gcda:Skip
profiling:/var/lib/jenkins1:Cannot create directory
profiling:/var/lib/jenkins1/ws/OpenModelica/build_cmake/OMCompiler/SimulationRuntime/c/gc/CMakeFiles/OpenModelicaRuntimeCGC.dir/omc_rc.c.gcda:Skip
profiling:/var/lib/jenkins1:Cannot create directory
profiling:/var/lib/jenkins1/ws/OpenModelica/build_cmake/OMCompiler/SimulationRuntime/c/gc/CMakeFiles/OpenModelicaRuntimeCGC.dir/omc_alloc.c.gcda:Skip
",
    timeFrontend = 0.006678014,
    timeBackend = 0.021493934000000003,
    timeSimCode = 0.00502536,
    timeTemplates = 0.008048999000000001,
    timeCompile = 0.3905655189999999,
    timeSimulation = 0.038237754000000006,
    timeTotal = 0.4702901119999999
end SimulationResult;
"Warning: The initial conditions are not fully specified. For more information set -d=initialization. In OMEdit Tools->Options->Simulation->Show additional information from the initialization process, in OMNotebook call setCommandLineOptions(\"-d=initialization\").
"

true
""
"/var/lib/jenkins/ws/OpenModelica/testsuite/special/FmuExportCrossCompile/RoomHeating_OM_RH.fmu"


WaterTank_Control

make[1]: *** [Makefile:24: fmuExportCrossCompile] Terminated
Terminated
make: *** [Makefile:16: test] Terminated
2309/2658 Test #2312: simulation.modelica.events.bug2752.mos ....................................................................................................................   Passed    1.00 sec
          Start 2321: simulation.modelica.external_functions.ExtObjStringParam.mos
2310/2658 Test #2314: simulation.modelica.events.bug4419.mos ....................................................................................................................   Passed    0.98 sec
          Start 2322: simulation.modelica.external_functions.ExternalLibraries.mos
2311/2658 Test #2313: simulation.modelica.events.bug3092.mos ....................................................................................................................   Passed    1.06 sec
          Start 2323: simulation.modelica.external_functions.ExternalRHSFlag.mos
2312/2658 Test #2320: simulation.modelica.external_functions.CevalModelicaStrings.mos ...........................................................................................   Passed    0.16 sec
          Start 2324: simulation.modelica.external_functions.ImplicitArray.mos
        PASS [  33.355s] ( 203/1414) openmodelica_codegen_wasm_jit CodegenWasmJitFunctions::runtime::tests::cache_reuse_and_redefinition
        PASS [  33.352s] ( 204/1414) openmodelica_codegen_wasm_jit CodegenWasmJitFunctions::runtime::tests::integer_add
        PASS [   0.109s] ( 205/1414) openmodelica_ext_native_marshal tests::fortran_cells_and_column_major
2313/2658 Test #2315: simulation.modelica.events.derInWhenCondition.mos .........................................................................................................   Passed    0.93 sec
          Start 2325: simulation.modelica.external_functions.MDD_test.mos
2314/2658 Test #2299: simulation.modelica.equations.WhenNoRetCall.mos ...........................................................................................................   Passed    2.77 sec
          Start 2326: simulation.modelica.external_functions.ModelicaIOMatrix.mos
2315/2658 Test #2316: simulation.modelica.events.divisionByZeroAtEvent.mos ......................................................................................................   Passed    0.92 sec
          Start 2327: simulation.modelica.external_functions.ModelicaUtilities.mos
        PASS [   0.096s] ( 206/1414) openmodelica_ext_native_marshal tests::frame_gather_and_scatter
        PASS [   0.093s] ( 207/1414) openmodelica_ext_native_marshal tests::table_round_trip
        PASS [   0.086s] ( 208/1414) openmodelica_fmi figures::tests::no_openmodelica_annotation_is_not_an_error
[Buildings.Electrical.AC.ThreePhasesUnbalanced.Validation.IEEETests.Test4NodesFeeder.BalancedStepDown.DY.mos:20] OK
        PASS [   0.100s] ( 209/1414) openmodelica_fmi figures::tests::reads_a_figure
        PASS [   0.102s] ( 210/1414) openmodelica_fmi figures::tests::reads_a_figure_from_the_old_tool_element
        PASS [   0.078s] ( 211/1414) openmodelica_fmi figures::tests::reads_the_visualization
        PASS [   0.029s] ( 212/1414) openmodelica_fmi figures::tests::skips_a_plot_with_no_curves_and_an_unknown_version
        PASS [   0.030s] ( 213/1414) openmodelica_fmi::model_description a_co_simulation_only_fmi1_fmu_reads_its_capabilities
        PASS [   0.041s] ( 214/1414) openmodelica_fmi::model_description a_malformed_description_is_rejected_with_a_reason
        PASS [   0.052s] ( 215/1414) openmodelica_fmi::model_description fmi1_parameters_and_aliases
        PASS [   0.076s] ( 216/1414) openmodelica_fmi::model_description fmi2_indices_become_value_references
        PASS [  33.238s] ( 217/1414) openmodelica_codegen_wasm_jit CodegenWasmJitFunctions::runtime::tests::precompiled_runtime_array_indexed_assign
2316/2658 Test #2317: simulation.modelica.events.noEventNotRespected.mos ........................................................................................................   Passed    0.96 sec
          Start 2328: simulation.modelica.external_functions.RecordMemberArguments.mos
2317/2658 Test #2319: simulation.modelica.events.whenTest1.mos ..................................................................................................................   Passed    0.92 sec
          Start 2329: simulation.modelica.external_functions.UserDllModelicaError.mos
2318/2658 Test #2318: simulation.modelica.events.sample2.mos ....................................................................................................................   Passed    0.94 sec
          Start 2330: simulation.modelica.external_functions.ts.mos
2319/2658 Test #2322: simulation.modelica.external_functions.ExternalLibraries.mos ..............................................................................................   Passed    1.00 sec
          Start 2331: simulation.modelica.functions_eval.Inverter2.mos
2320/2658 Test #2323: simulation.modelica.external_functions.ExternalRHSFlag.mos ................................................................................................   Passed    0.96 sec
          Start 2332: simulation.modelica.functions_eval.Nand.mos
Sending interrupt signal to process
        PASS [   0.071s] ( 218/1414) openmodelica_fmi::model_description fmi3_keeps_what_only_3_0_has
  Cancelling due to signal: 16 tests still running
Terminated
     SIGTERM [   0.075s] ( 219/1414) openmodelica_fmi_driver expr::tests::a_bad_expression_names_the_position

    (test aborted with signal 15: SIGTERM)

     SIGTERM [   0.013s] ( 220/1414) openmodelica_fmi_driver expr::tests::a_constant_expression_is_recognised

    (test aborted with signal 15: SIGTERM)

     SIGTERM [   0.992s] ( 221/1414) openmodelica_codegen_wasm_jit CodegenWasmJitFunctions::runtime::tests::real_scale
  stdout ───

    running 1 test
  stderr ───
    could not deduce the OpenModelica installation directory from executable path: [/tmp/omc-rust/rust-src/Compiler/OpenModelica.rs/target/debug/deps/openmodelica_codegen_wasm_jit-aa505dc7af6da4f8], please set OPENMODELICAHOME

    (test aborted with signal 15: SIGTERM)

     SIGTERM [  34.355s] ( 222/1414) openmodelica_codegen_wasm_jit CodegenWasmJit::link_tests::fmu_component_links_without_a_host
  stdout ───

    running 1 test
  stderr ───
    could not deduce the OpenModelica installation directory from executable path: [/tmp/omc-rust/rust-src/Compiler/OpenModelica.rs/target/debug/deps/openmodelica_codegen_wasm_jit-aa505dc7af6da4f8], please set OPENMODELICAHOME
    could not deduce the OpenModelica installation directory from executable path: [/tmp/omc-rust/rust-src/Compiler/OpenModelica.rs/target/debug/deps/openmodelica_codegen_wasm_jit-aa505dc7af6da4f8], please set OPENMODELICAHOME
    could not deduce the OpenModelica installation directory from executable path: [/tmp/omc-rust/rust-src/Compiler/OpenModelica.rs/target/debug/deps/openmodelica_codegen_wasm_jit-aa505dc7af6da4f8], please set OPENMODELICAHOME
    could not deduce the OpenModelica installation directory from executable path: [/tmp/omc-rust/rust-src/Compiler/OpenModelica.rs/target/debug/deps/openmodelica_codegen_wasm_jit-aa505dc7af6da4f8], please set OPENMODELICAHOME
    could not deduce the OpenModelica installation directory from executable path: [/tmp/omc-rust/rust-src/Compiler/OpenModelica.rs/target/debug/deps/openmodelica_codegen_wasm_jit-aa505dc7af6da4f8], please set OPENMODELICAHOME
    could not deduce the OpenModelica installation directory from executable path: [/tmp/omc-rust/rust-src/Compiler/OpenModelica.rs/target/debug/deps/openmodelica_codegen_wasm_jit-aa505dc7af6da4f8], please set OPENMODELICAHOME
    could not deduce the OpenModelica installation directory from executable path: [/tmp/omc-rust/rust-src/Compiler/OpenModelica.rs/target/debug/deps/openmodelica_codegen_wasm_jit-aa505dc7af6da4f8], please set OPENMODELICAHOME
    could not deduce the OpenModelica installation directory from executable path: [/tmp/omc-rust/rust-src/Compiler/OpenModelica.rs/target/debug/deps/openmodelica_codegen_wasm_jit-aa505dc7af6da4f8], please set OPENMODELICAHOME
    could not deduce the OpenModelica installation directory from executable path: [/tmp/omc-rust/rust-src/Compiler/OpenModelica.rs/target/debug/deps/openmodelica_codegen_wasm_jit-aa505dc7af6da4f8], please set OPENMODELICAHOME
    could not deduce the OpenModelica installation directory from executable path: [/tmp/omc-rust/rust-src/Compiler/OpenModelica.rs/target/debug/deps/openmodelica_codegen_wasm_jit-aa505dc7af6da4f8], please set OPENMODELICAHOME
    could not deduce the OpenModelica installation directory from executable path: [/tmp/omc-rust/rust-src/Compiler/OpenModelica.rs/target/debug/deps/openmodelica_codegen_wasm_jit-aa505dc7af6da4f8], please set OPENMODELICAHOME
    could not deduce the OpenModelica installation directory from executable path: [/tmp/omc-rust/rust-src/Compiler/OpenModelica.rs/target/debug/deps/openmodelica_codegen_wasm_jit-aa505dc7af6da4f8], please set OPENMODELICAHOME
    could not deduce the OpenModelica installation directory from executable path: [/tmp/omc-rust/rust-src/Compiler/OpenModelica.rs/target/debug/deps/openmodelica_codegen_wasm_jit-aa505dc7af6da4f8], please set OPENMODELICAHOME
    could not deduce the OpenModelica installation directory from executable path: [/tmp/omc-rust/rust-src/Compiler/OpenModelica.rs/target/debug/deps/openmodelica_codegen_wasm_jit-aa505dc7af6da4f8], please set OPENMODELICAHOME

    (test aborted with signal 15: SIGTERM)

     SIGTERM [   3.185s] ( 223/1414) openmodelica_codegen_wasm_jit CodegenWasmJitFunctions::runtime::tests::precompiled_runtime_real_pow
  stdout ───

    running 1 test
  stderr ───
    could not deduce the OpenModelica installation directory from executable path: [/tmp/omc-rust/rust-src/Compiler/OpenModelica.rs/target/debug/deps/openmodelica_codegen_wasm_jit-aa505dc7af6da4f8], please set OPENMODELICAHOME

    (test aborted with signal 15: SIGTERM)

     SIGTERM [   2.491s] ( 224/1414) openmodelica_codegen_wasm_jit CodegenWasmJitFunctions::runtime::tests::precompiled_runtime_shape_builtins
  stdout ───

    running 1 test
  stderr ───
    could not deduce the OpenModelica installation directory from executable path: [/tmp/omc-rust/rust-src/Compiler/OpenModelica.rs/target/debug/deps/openmodelica_codegen_wasm_jit-aa505dc7af6da4f8], please set OPENMODELICAHOME

    (test aborted with signal 15: SIGTERM)

     SIGTERM [   4.469s] ( 225/1414) openmodelica_codegen_wasm_jit CodegenWasmJitFunctions::runtime::tests::precompiled_runtime_real_format_and_pad_abi
  stdout ───

    running 1 test
  stderr ───
    could not deduce the OpenModelica installation directory from executable path: [/tmp/omc-rust/rust-src/Compiler/OpenModelica.rs/target/debug/deps/openmodelica_codegen_wasm_jit-aa505dc7af6da4f8], please set OPENMODELICAHOME

    (test aborted with signal 15: SIGTERM)

     SIGTERM [   3.100s] ( 226/1414) openmodelica_codegen_wasm_jit CodegenWasmJitFunctions::runtime::tests::precompiled_runtime_record
  stdout ───

    running 1 test
  stderr ───
    could not deduce the OpenModelica installation directory from executable path: [/tmp/omc-rust/rust-src/Compiler/OpenModelica.rs/target/debug/deps/openmodelica_codegen_wasm_jit-aa505dc7af6da4f8], please set OPENMODELICAHOME

    (test aborted with signal 15: SIGTERM)

     SIGTERM [   1.504s] ( 227/1414) openmodelica_codegen_wasm_jit CodegenWasmJitFunctions::runtime::tests::precompiled_runtime_string_abi
  stdout ───

    running 1 test
  stderr ───
    could not deduce the OpenModelica installation directory from executable path: [/tmp/omc-rust/rust-src/Compiler/OpenModelica.rs/target/debug/deps/openmodelica_codegen_wasm_jit-aa505dc7af6da4f8], please set OPENMODELICAHOME

    (test aborted with signal 15: SIGTERM)

     SIGTERM [   3.284s] ( 228/1414) openmodelica_codegen_wasm_jit CodegenWasmJitFunctions::runtime::tests::precompiled_runtime_real_int_pow
  stdout ───

    running 1 test
  stderr ───
    could not deduce the OpenModelica installation directory from executable path: [/tmp/omc-rust/rust-src/Compiler/OpenModelica.rs/target/debug/deps/openmodelica_codegen_wasm_jit-aa505dc7af6da4f8], please set OPENMODELICAHOME

    (test aborted with signal 15: SIGTERM)

     SIGTERM [   5.148s] ( 229/1414) openmodelica_codegen_wasm_jit CodegenWasmJitFunctions::runtime::tests::precompiled_runtime_mod_int
  stdout ───

    running 1 test
  stderr ───
    could not deduce the OpenModelica installation directory from executable path: [/tmp/omc-rust/rust-src/Compiler/OpenModelica.rs/target/debug/deps/openmodelica_codegen_wasm_jit-aa505dc7af6da4f8], please set OPENMODELICAHOME

    (test aborted with signal 15: SIGTERM)

     SIGTERM [  25.713s] ( 230/1414) openmodelica_codegen_wasm_jit CodegenWasmJitFunctions::runtime::tests::precompiled_runtime_array_transpose
  stdout ───

    running 1 test
  stderr ───
    could not deduce the OpenModelica installation directory from executable path: [/tmp/omc-rust/rust-src/Compiler/OpenModelica.rs/target/debug/deps/openmodelica_codegen_wasm_jit-aa505dc7af6da4f8], please set OPENMODELICAHOME

    (test aborted with signal 15: SIGTERM)

     SIGTERM [  34.364s] ( 231/1414) openmodelica_codegen_wasm_jit CodegenWasmJit::link_tests::merge_leaves_only_wasi_imports
  stdout ───

    running 1 test
  stderr ───
    could not deduce the OpenModelica installation directory from executable path: [/tmp/omc-rust/rust-src/Compiler/OpenModelica.rs/target/debug/deps/openmodelica_codegen_wasm_jit-aa505dc7af6da4f8], please set OPENMODELICAHOME

    (test aborted with signal 15: SIGTERM)

     SIGTERM [  10.232s] ( 232/1414) openmodelica_codegen_wasm_jit CodegenWasmJitFunctions::runtime::tests::precompiled_runtime_int_to_real_and_logical
  stdout ───

    running 1 test
  stderr ───
    could not deduce the OpenModelica installation directory from executable path: [/tmp/omc-rust/rust-src/Compiler/OpenModelica.rs/target/debug/deps/openmodelica_codegen_wasm_jit-aa505dc7af6da4f8], please set OPENMODELICAHOME

    (test aborted with signal 15: SIGTERM)

     SIGTERM [  34.321s] ( 233/1414) openmodelica_codegen_wasm_jit CodegenWasmJitFunctions::runtime::tests::precompiled_runtime_array_elementwise
  stdout ───

    running 1 test
  stderr ───
    could not deduce the OpenModelica installation directory from executable path: [/tmp/omc-rust/rust-src/Compiler/OpenModelica.rs/target/debug/deps/openmodelica_codegen_wasm_jit-aa505dc7af6da4f8], please set OPENMODELICAHOME

    (test aborted with signal 15: SIGTERM)

     SIGTERM [  33.195s] ( 234/1414) openmodelica_codegen_wasm_jit CodegenWasmJitFunctions::runtime::tests::precompiled_runtime_array_matmul
  stdout ───

    running 1 test
  stderr ───
    could not deduce the OpenModelica installation directory from executable path: [/tmp/omc-rust/rust-src/Compiler/OpenModelica.rs/target/debug/deps/openmodelica_codegen_wasm_jit-aa505dc7af6da4f8], please set OPENMODELICAHOME

    (test aborted with signal 15: SIGTERM)

────────────
     Summary [  34.471s] 234/1414 tests run: 218 passed, 16 failed, 0 skipped
     SIGTERM [   0.075s] ( 219/1414) openmodelica_fmi_driver expr::tests::a_bad_expression_names_the_position
     SIGTERM [   0.013s] ( 220/1414) openmodelica_fmi_driver expr::tests::a_constant_expression_is_recognised
     SIGTERM [   0.992s] ( 221/1414) openmodelica_codegen_wasm_jit CodegenWasmJitFunctions::runtime::tests::real_scale
     SIGTERM [  34.355s] ( 222/1414) openmodelica_codegen_wasm_jit CodegenWasmJit::link_tests::fmu_component_links_without_a_host
     SIGTERM [   3.185s] ( 223/1414) openmodelica_codegen_wasm_jit CodegenWasmJitFunctions::runtime::tests::precompiled_runtime_real_pow
     SIGTERM [   2.491s] ( 224/1414) openmodelica_codegen_wasm_jit CodegenWasmJitFunctions::runtime::tests::precompiled_runtime_shape_builtins
     SIGTERM [   4.469s] ( 225/1414) openmodelica_codegen_wasm_jit CodegenWasmJitFunctions::runtime::tests::precompiled_runtime_real_format_and_pad_abi
     SIGTERM [   3.100s] ( 226/1414) openmodelica_codegen_wasm_jit CodegenWasmJitFunctions::runtime::tests::precompiled_runtime_record
     SIGTERM [   1.504s] ( 227/1414) openmodelica_codegen_wasm_jit CodegenWasmJitFunctions::runtime::tests::precompiled_runtime_string_abi
     SIGTERM [   3.284s] ( 228/1414) openmodelica_codegen_wasm_jit CodegenWasmJitFunctions::runtime::tests::precompiled_runtime_real_int_pow
     SIGTERM [   5.148s] ( 229/1414) openmodelica_codegen_wasm_jit CodegenWasmJitFunctions::runtime::tests::precompiled_runtime_mod_int
     SIGTERM [  25.713s] ( 230/1414) openmodelica_codegen_wasm_jit CodegenWasmJitFunctions::runtime::tests::precompiled_runtime_array_transpose
     SIGTERM [  34.364s] ( 231/1414) openmodelica_codegen_wasm_jit CodegenWasmJit::link_tests::merge_leaves_only_wasi_imports
     SIGTERM [  10.232s] ( 232/1414) openmodelica_codegen_wasm_jit CodegenWasmJitFunctions::runtime::tests::precompiled_runtime_int_to_real_and_logical
     SIGTERM [  34.321s] ( 233/1414) openmodelica_codegen_wasm_jit CodegenWasmJitFunctions::runtime::tests::precompiled_runtime_array_elementwise
     SIGTERM [  33.195s] ( 234/1414) openmodelica_codegen_wasm_jit CodegenWasmJitFunctions::runtime::tests::precompiled_runtime_array_matmul
warning: 1180/1414 tests were not run due to signal
error: test run failed
Sending interrupt signal to process
2321/2658 Test #2324: simulation.modelica.external_functions.ImplicitArray.mos ..................................................................................................   Passed    0.93 sec
          Start 2333: simulation.modelica.functions_eval.RtlInverter.mos
Terminated
Terminated
[Pipeline] sh
[Pipeline] }
$ docker stop --time=1 8381dd3a37bc7bb259e551eeceb923019cd11c9f7eeb75f6e1d06131a1ffc36c
+ sccache --show-stats
Compile requests                      0
Compile requests executed             0
Cache hits                            0
Cache misses                          0
Cache hits rate                       -
Cache timeouts                        0
Cache read errors                     0
Forced recaches                       0
Cache write errors                    0
Cache errors                          0
Compilations                          0
Compilation failures                  0
Non-cacheable compilations            0
Non-cacheable calls                   0
Non-compilation calls                 0
Unsupported compiler calls            0
Average cache write               0.000 s
Average compiler                  0.000 s
Average cache read hit            0.000 s
Failed distributed compilations       0
Cache location                  s3, name: omc-sccache, prefix: /
Base directories                /var/lib/jenkins/ws/OpenModelica/
Version (client)                0.18.0
$ docker rm -f --volumes 8381dd3a37bc7bb259e551eeceb923019cd11c9f7eeb75f6e1d06131a1ffc36c
[Pipeline] }
[Pipeline] junit
Recording test results
[Pipeline] }
None of the test reports contained any result
[Pipeline] // withDockerContainer
[Pipeline] // withEnv
[Pipeline] // withEnv
[Pipeline] }
[Pipeline] }
[Pipeline] }
$ docker stop --time=1 cb493488493888ee26b886a4226386e18e75022a1973a2e3f49b8b703e64db76
No test report files were found. Configuration error?
$ docker rm -f --volumes cb493488493888ee26b886a4226386e18e75022a1973a2e3f49b8b703e64db76
[Pipeline] }
$ docker stop --time=1 4ed14feb75396f8f7b37e17d6c42a1b78f494448101e3bf94fa4d5f127518dec
$ docker rm -f --volumes 4ed14feb75396f8f7b37e17d6c42a1b78f494448101e3bf94fa4d5f127518dec
[Pipeline] }
$ docker stop --time=1 ec5878576b7e693db94c7fd925441aee552890e3a02cf8da74e8809375450988
$ docker rm -f --volumes ec5878576b7e693db94c7fd925441aee552890e3a02cf8da74e8809375450988
[Pipeline] // withEnv
[Pipeline] // script
[Pipeline] // withDockerContainer
[Pipeline] // withDockerContainer
[Pipeline] // withDockerContainer
[Pipeline] }
[Pipeline] }
[Pipeline] }
[Pipeline] }
[Pipeline] }
[Pipeline] // withCredentials
[Pipeline] // withEnv
[Pipeline] // script
[Pipeline] // script
[Pipeline] // script
[Pipeline] sh
[Pipeline] }
[Pipeline] }
[Pipeline] }
[Pipeline] }
[Pipeline] // withEnv
[Pipeline] // withEnv
+ cp /tmp/omc-rust/rust-src/Compiler/OpenModelica.rs/target/nextest/ci/junit.xml nextest-junit.xml
[Pipeline] // withEnv
[Pipeline] // withEnv
[Pipeline] }
[Pipeline] }
[Pipeline] }
[Pipeline] }
[Pipeline] junit
Recording test results
[Checks API] No suitable checks publisher found.
[Pipeline] // ws
[Pipeline] // withEnv
[Pipeline] // withEnv
[Pipeline] // withEnv
[Pipeline] }
[Pipeline] }
[Pipeline] }
[Pipeline] }
[Pipeline] }
[Pipeline] // node
[Pipeline] // ws
[Pipeline] // ws
[Pipeline] // ws
[Pipeline] }
[Pipeline] }
[Pipeline] }
[Pipeline] }
[Pipeline] // script
[Pipeline] }
$ docker stop --time=1 d173a5765e493eefece2b6fd8925bd742a43afca353a31f54c971124a53e83cf
Click here to forcibly terminate running steps
$ docker rm -f --volumes d173a5765e493eefece2b6fd8925bd742a43afca353a31f54c971124a53e83cf
[Pipeline] // retry
[Pipeline] // node
[Pipeline] // node
[Pipeline] // node
[Pipeline] }
[Pipeline] }
[Pipeline] }
[Pipeline] }
[Pipeline] // withDockerContainer
[Pipeline] }
[Pipeline] // stage
[Pipeline] // retry
[Pipeline] // retry
[Pipeline] // retry
[Pipeline] }
Failed in branch 13 cross-build-fmu
[Pipeline] }
[Pipeline] }
[Pipeline] }
[Pipeline] // withEnv
[Pipeline] }
[Pipeline] // stage
[Pipeline] // stage
[Pipeline] // stage
[Pipeline] }
Failed in branch 04 testsuite-gcc 1/2
[Pipeline] }
Failed in branch 05 testsuite-clang 2/2
[Pipeline] }
Failed in branch 19 testsuite-wasm-jit
[Pipeline] }
[Pipeline] // node
[Pipeline] }
[Pipeline] // stage
[Pipeline] }
Failed in branch 12 unit-tests-rust
[Pipeline] // parallel
[Pipeline] }
[Pipeline] // stage
[Pipeline] stage
[Pipeline] { (check-and-upload)
Stage "check-and-upload" skipped due to earlier failure(s)
[Pipeline] getContext
[Pipeline] parallel
[Pipeline] { (Branch: linux-FMPy)
[Pipeline] { (Branch: coverage-report)
[Pipeline] { (Branch: upload-compliance)
[Pipeline] { (Branch: upload-doc)
[Pipeline] { (Branch: upload-web)
[Pipeline] stage
[Pipeline] { (linux-FMPy)
[Pipeline] stage
[Pipeline] { (coverage-report)
[Pipeline] stage
[Pipeline] { (upload-compliance)
[Pipeline] stage
[Pipeline] { (upload-doc)
[Pipeline] stage
[Pipeline] { (upload-web)
Stage "linux-FMPy" skipped due to earlier failure(s)
[Pipeline] getContext
[Pipeline] }
Stage "coverage-report" skipped due to earlier failure(s)
[Pipeline] getContext
[Pipeline] }
Stage "upload-compliance" skipped due to earlier failure(s)
[Pipeline] getContext
[Pipeline] }
Stage "upload-doc" skipped due to earlier failure(s)
[Pipeline] getContext
[Pipeline] }
Stage "upload-web" skipped due to earlier failure(s)
[Pipeline] getContext
[Pipeline] }
[Pipeline] // stage
[Pipeline] // stage
[Pipeline] // stage
[Pipeline] // stage
[Pipeline] // stage
[Pipeline] }
Failed in branch linux-FMPy
[Pipeline] }
Failed in branch coverage-report
[Pipeline] }
Failed in branch upload-compliance
[Pipeline] }
Failed in branch upload-doc
[Pipeline] }
Failed in branch upload-web
[Pipeline] // parallel
[Pipeline] }
[Pipeline] // stage
[Pipeline] stage
[Pipeline] { (publish)
Stage "publish" skipped due to earlier failure(s)
[Pipeline] getContext
[Pipeline] parallel
[Pipeline] { (Branch: push-to-master)
[Pipeline] { (Branch: push-bibliography)
[Pipeline] stage
[Pipeline] { (push-to-master)
[Pipeline] stage
[Pipeline] { (push-bibliography)
Stage "push-to-master" skipped due to earlier failure(s)
[Pipeline] getContext
[Pipeline] }
Stage "push-bibliography" skipped due to earlier failure(s)
[Pipeline] getContext
[Pipeline] }
[Pipeline] // stage
[Pipeline] // stage
[Pipeline] }
Failed in branch push-to-master
[Pipeline] }
Failed in branch push-bibliography
[Pipeline] // parallel
[Pipeline] }
[Pipeline] // stage
[Pipeline] }
[Pipeline] // withEnv
[Pipeline] End of Pipeline
java.io.IOException: failed to run kill
	at PluginClassLoader for docker-workflow//org.jenkinsci.plugins.docker.workflow.WithContainerStep$Decorator$1.kill(WithContainerStep.java:401)
	at PluginClassLoader for durable-task//org.jenkinsci.plugins.durabletask.FileMonitoringTask$FileMonitoringController.stop(FileMonitoringTask.java:488)
	at PluginClassLoader for workflow-durable-task-step//org.jenkinsci.plugins.workflow.steps.durable_task.DurableTaskStep$Execution.stop(DurableTaskStep.java:527)
	at PluginClassLoader for workflow-cps//org.jenkinsci.plugins.workflow.cps.CpsThread.stop(CpsThread.java:330)
	at PluginClassLoader for workflow-cps//org.jenkinsci.plugins.workflow.cps.CpsFlowExecution$6.onSuccess(CpsFlowExecution.java:1318)
	at PluginClassLoader for workflow-cps//org.jenkinsci.plugins.workflow.cps.CpsFlowExecution$6.onSuccess(CpsFlowExecution.java:1307)
	at PluginClassLoader for workflow-cps//org.jenkinsci.plugins.workflow.cps.CpsFlowExecution$4$1.run(CpsFlowExecution.java:1060)
	at PluginClassLoader for workflow-cps//org.jenkinsci.plugins.workflow.cps.CpsVmExecutorService.lambda$wrap$2(CpsVmExecutorService.java:81)
	at java.base/java.util.concurrent.Executors$RunnableAdapter.call(Unknown Source)
	at java.base/java.util.concurrent.FutureTask.run(Unknown Source)
	at hudson.remoting.SingleLaneExecutorService$1.run(SingleLaneExecutorService.java:139)
	at jenkins.util.ContextResettingExecutorService.lambda$wrap$0(ContextResettingExecutorService.java:26)
	at jenkins.security.ImpersonatingExecutorService.lambda$wrap$0(ImpersonatingExecutorService.java:66)
	at jenkins.util.ErrorLoggingExecutorService.lambda$wrap$0(ErrorLoggingExecutorService.java:51)
	at java.base/java.util.concurrent.Executors$RunnableAdapter.call(Unknown Source)
	at java.base/java.util.concurrent.FutureTask.run(Unknown Source)
	at java.base/java.util.concurrent.ThreadPoolExecutor.runWorker(Unknown Source)
	at java.base/java.util.concurrent.ThreadPoolExecutor$Worker.run(Unknown Source)
	at PluginClassLoader for workflow-cps//org.jenkinsci.plugins.workflow.cps.CpsVmExecutorService$1.call(CpsVmExecutorService.java:53)
	at PluginClassLoader for workflow-cps//org.jenkinsci.plugins.workflow.cps.CpsVmExecutorService$1.call(CpsVmExecutorService.java:50)
	at org.codehaus.groovy.runtime.GroovyCategorySupport$ThreadCategoryInfo.use(GroovyCategorySupport.java:136)
	at org.codehaus.groovy.runtime.GroovyCategorySupport.use(GroovyCategorySupport.java:275)
	at PluginClassLoader for workflow-cps//org.jenkinsci.plugins.workflow.cps.CpsVmExecutorService.lambda$categoryThreadFactory$0(CpsVmExecutorService.java:50)
	at java.base/java.lang.Thread.run(Unknown Source)
java.io.IOException: failed to run kill
	at PluginClassLoader for docker-workflow//org.jenkinsci.plugins.docker.workflow.WithContainerStep$Decorator$1.kill(WithContainerStep.java:401)
	at PluginClassLoader for durable-task//org.jenkinsci.plugins.durabletask.FileMonitoringTask$FileMonitoringController.stop(FileMonitoringTask.java:488)
	at PluginClassLoader for workflow-durable-task-step//org.jenkinsci.plugins.workflow.steps.durable_task.DurableTaskStep$Execution.stop(DurableTaskStep.java:527)
	at PluginClassLoader for workflow-cps//org.jenkinsci.plugins.workflow.cps.CpsThread.stop(CpsThread.java:330)
	at PluginClassLoader for workflow-cps//org.jenkinsci.plugins.workflow.cps.CpsFlowExecution$6.onSuccess(CpsFlowExecution.java:1318)
	at PluginClassLoader for workflow-cps//org.jenkinsci.plugins.workflow.cps.CpsFlowExecution$6.onSuccess(CpsFlowExecution.java:1307)
	at PluginClassLoader for workflow-cps//org.jenkinsci.plugins.workflow.cps.CpsFlowExecution$4$1.run(CpsFlowExecution.java:1060)
	at PluginClassLoader for workflow-cps//org.jenkinsci.plugins.workflow.cps.CpsVmExecutorService.lambda$wrap$2(CpsVmExecutorService.java:81)
	at java.base/java.util.concurrent.Executors$RunnableAdapter.call(Unknown Source)
	at java.base/java.util.concurrent.FutureTask.run(Unknown Source)
	at hudson.remoting.SingleLaneExecutorService$1.run(SingleLaneExecutorService.java:139)
	at jenkins.util.ContextResettingExecutorService.lambda$wrap$0(ContextResettingExecutorService.java:26)
	at jenkins.security.ImpersonatingExecutorService.lambda$wrap$0(ImpersonatingExecutorService.java:66)
	at jenkins.util.ErrorLoggingExecutorService.lambda$wrap$0(ErrorLoggingExecutorService.java:51)
	at java.base/java.util.concurrent.Executors$RunnableAdapter.call(Unknown Source)
	at java.base/java.util.concurrent.FutureTask.run(Unknown Source)
	at java.base/java.util.concurrent.ThreadPoolExecutor.runWorker(Unknown Source)
	at java.base/java.util.concurrent.ThreadPoolExecutor$Worker.run(Unknown Source)
	at PluginClassLoader for workflow-cps//org.jenkinsci.plugins.workflow.cps.CpsVmExecutorService$1.call(CpsVmExecutorService.java:53)
	at PluginClassLoader for workflow-cps//org.jenkinsci.plugins.workflow.cps.CpsVmExecutorService$1.call(CpsVmExecutorService.java:50)
	at org.codehaus.groovy.runtime.GroovyCategorySupport$ThreadCategoryInfo.use(GroovyCategorySupport.java:136)
	at org.codehaus.groovy.runtime.GroovyCategorySupport.use(GroovyCategorySupport.java:275)
	at PluginClassLoader for workflow-cps//org.jenkinsci.plugins.workflow.cps.CpsVmExecutorService.lambda$categoryThreadFactory$0(CpsVmExecutorService.java:50)
	at java.base/java.lang.Thread.run(Unknown Source)
java.io.IOException: failed to run kill
	at PluginClassLoader for docker-workflow//org.jenkinsci.plugins.docker.workflow.WithContainerStep$Decorator$1.kill(WithContainerStep.java:401)
	at PluginClassLoader for durable-task//org.jenkinsci.plugins.durabletask.FileMonitoringTask$FileMonitoringController.stop(FileMonitoringTask.java:488)
	at PluginClassLoader for workflow-durable-task-step//org.jenkinsci.plugins.workflow.steps.durable_task.DurableTaskStep$Execution.stop(DurableTaskStep.java:527)
	at PluginClassLoader for workflow-cps//org.jenkinsci.plugins.workflow.cps.CpsThread.stop(CpsThread.java:330)
	at PluginClassLoader for workflow-cps//org.jenkinsci.plugins.workflow.cps.CpsFlowExecution$6.onSuccess(CpsFlowExecution.java:1318)
	at PluginClassLoader for workflow-cps//org.jenkinsci.plugins.workflow.cps.CpsFlowExecution$6.onSuccess(CpsFlowExecution.java:1307)
	at PluginClassLoader for workflow-cps//org.jenkinsci.plugins.workflow.cps.CpsFlowExecution$4$1.run(CpsFlowExecution.java:1060)
	at PluginClassLoader for workflow-cps//org.jenkinsci.plugins.workflow.cps.CpsVmExecutorService.lambda$wrap$2(CpsVmExecutorService.java:81)
	at java.base/java.util.concurrent.Executors$RunnableAdapter.call(Unknown Source)
	at java.base/java.util.concurrent.FutureTask.run(Unknown Source)
	at hudson.remoting.SingleLaneExecutorService$1.run(SingleLaneExecutorService.java:139)
	at jenkins.util.ContextResettingExecutorService.lambda$wrap$0(ContextResettingExecutorService.java:26)
	at jenkins.security.ImpersonatingExecutorService.lambda$wrap$0(ImpersonatingExecutorService.java:66)
	at jenkins.util.ErrorLoggingExecutorService.lambda$wrap$0(ErrorLoggingExecutorService.java:51)
	at java.base/java.util.concurrent.Executors$RunnableAdapter.call(Unknown Source)
	at java.base/java.util.concurrent.FutureTask.run(Unknown Source)
	at java.base/java.util.concurrent.ThreadPoolExecutor.runWorker(Unknown Source)
	at java.base/java.util.concurrent.ThreadPoolExecutor$Worker.run(Unknown Source)
	at PluginClassLoader for workflow-cps//org.jenkinsci.plugins.workflow.cps.CpsVmExecutorService$1.call(CpsVmExecutorService.java:53)
	at PluginClassLoader for workflow-cps//org.jenkinsci.plugins.workflow.cps.CpsVmExecutorService$1.call(CpsVmExecutorService.java:50)
	at org.codehaus.groovy.runtime.GroovyCategorySupport$ThreadCategoryInfo.use(GroovyCategorySupport.java:136)
	at org.codehaus.groovy.runtime.GroovyCategorySupport.use(GroovyCategorySupport.java:275)
	at PluginClassLoader for workflow-cps//org.jenkinsci.plugins.workflow.cps.CpsVmExecutorService.lambda$categoryThreadFactory$0(CpsVmExecutorService.java:50)
	at java.base/java.lang.Thread.run(Unknown Source)
java.io.IOException: failed to run kill
	at PluginClassLoader for docker-workflow//org.jenkinsci.plugins.docker.workflow.WithContainerStep$Decorator$1.kill(WithContainerStep.java:401)
	at PluginClassLoader for durable-task//org.jenkinsci.plugins.durabletask.FileMonitoringTask$FileMonitoringController.stop(FileMonitoringTask.java:488)
	at PluginClassLoader for workflow-durable-task-step//org.jenkinsci.plugins.workflow.steps.durable_task.DurableTaskStep$Execution.stop(DurableTaskStep.java:527)
	at PluginClassLoader for workflow-cps//org.jenkinsci.plugins.workflow.cps.CpsThread.stop(CpsThread.java:330)
	at PluginClassLoader for workflow-cps//org.jenkinsci.plugins.workflow.cps.CpsFlowExecution$6.onSuccess(CpsFlowExecution.java:1318)
	at PluginClassLoader for workflow-cps//org.jenkinsci.plugins.workflow.cps.CpsFlowExecution$6.onSuccess(CpsFlowExecution.java:1307)
	at PluginClassLoader for workflow-cps//org.jenkinsci.plugins.workflow.cps.CpsFlowExecution$4$1.run(CpsFlowExecution.java:1060)
	at PluginClassLoader for workflow-cps//org.jenkinsci.plugins.workflow.cps.CpsVmExecutorService.lambda$wrap$2(CpsVmExecutorService.java:81)
	at java.base/java.util.concurrent.Executors$RunnableAdapter.call(Unknown Source)
	at java.base/java.util.concurrent.FutureTask.run(Unknown Source)
	at hudson.remoting.SingleLaneExecutorService$1.run(SingleLaneExecutorService.java:139)
	at jenkins.util.ContextResettingExecutorService.lambda$wrap$0(ContextResettingExecutorService.java:26)
	at jenkins.security.ImpersonatingExecutorService.lambda$wrap$0(ImpersonatingExecutorService.java:66)
	at jenkins.util.ErrorLoggingExecutorService.lambda$wrap$0(ErrorLoggingExecutorService.java:51)
	at java.base/java.util.concurrent.Executors$RunnableAdapter.call(Unknown Source)
	at java.base/java.util.concurrent.FutureTask.run(Unknown Source)
	at java.base/java.util.concurrent.ThreadPoolExecutor.runWorker(Unknown Source)
	at java.base/java.util.concurrent.ThreadPoolExecutor$Worker.run(Unknown Source)
	at PluginClassLoader for workflow-cps//org.jenkinsci.plugins.workflow.cps.CpsVmExecutorService$1.call(CpsVmExecutorService.java:53)
	at PluginClassLoader for workflow-cps//org.jenkinsci.plugins.workflow.cps.CpsVmExecutorService$1.call(CpsVmExecutorService.java:50)
	at org.codehaus.groovy.runtime.GroovyCategorySupport$ThreadCategoryInfo.use(GroovyCategorySupport.java:136)
	at org.codehaus.groovy.runtime.GroovyCategorySupport.use(GroovyCategorySupport.java:275)
	at PluginClassLoader for workflow-cps//org.jenkinsci.plugins.workflow.cps.CpsVmExecutorService.lambda$categoryThreadFactory$0(CpsVmExecutorService.java:50)
	at java.base/java.lang.Thread.run(Unknown Source)
org.jenkinsci.plugins.workflow.actions.ErrorAction$ErrorId: af00f54e-d7be-496a-99a3-47dd404c6610
Failed in branch 13 cross-build-fmu
org.jenkinsci.plugins.workflow.actions.ErrorAction$ErrorId: 2c7438e0-0f44-47e6-a7a2-2b1ba50c544e
Triggering a new build of OpenModelica periodic tasks » Create source packages #7213

GitHub has been notified of this commit’s build result

Superseded by OpenModelica/master#7991
Finished: NOT_BUILT