Skipping 147,342 KB..
Full LogTestTestTestTestTestTestTestTestTestTestTestTestTestTestTestTestTestTestTestTestTestTestTestTestTestTestTestTestTestTestTestTestTestTestTestTestTestTestTestTestTestTestTestTestTestTestTestTestTestTestTestTestTestTestTestTestTestTestTestTestTestTestTestTestTestTestTestTestTestTestTestTestTestTestTestTestTestTestTestTestTestTestTestTestTestTestTestTestTestTestTestTestTestTestTestTestTestTestTestTestTestTestTestTestTestTestTestTestTestTestTestTestTestTestTestTestTestTestTestTestTestTestTestTestTestTestTestTestTestTestTestTestTestTestTestTestTestTestTestTestTestTestTestTestTestTestTestTestTestTestTestTestTestTestTestTestTestTestTestTestTestTestTestTestTestTestTestTestTestTestTestTestTestTestTestTestTestTestTestTestTestTestTestTestTestTestTestTestTestTestTestTestTestTestTestTestTestTestTestTestTestTestTestTestTestTestTestTestTestTestTestTestTestTestTestTestTestTestTestTestTestTestTestTestTestTestTestTestTestTestTestTestTestTestTestTestTestTestTestTestTestTestTestTestTestTestTestTestTestTestTestTestTestTestTestTestTestTestTestTestTestTestTestTestTestTestTestTestTestTestTestTestTestTestTestTestTestTestTestTestTestTestTestTestTestTestTestTestTestTestTestTestTestTestTestTestTestTestTestTestTestTestTestTestTestTestTestTestTestTestTestTestTestTestTestTestTestTestTestTestTestTestTestTestTestTestTestTestTestTestTestTestTestTestTestTestTestTestTestTestTestTestTestTestTestTestTestTestTestTestTestTestTestTestTestTestTestTestTestTestTestTestTestTestTestTestTestTestTestTestTestTestTestTestTestTestTestTestTestTestTestTestTestTestTestTestTestTestTestTestTestTestTestTestTestTestTestTestTestTestTestTestTestTestTestTestTestTestTestTestTestTestTestTestTestTestTestTestTestTestTestTestTestTestTestTestTestTestTestTestTestTestTestTestTestTestTestTestTestTestTestTestTestTestTestTestTestTestTestTestTestTestTestTestTestTestTestTestTestTestTestTestTestTestTestTestTestTestTestTestTestTestTestTestTestTestTestTestTestTestTestTestTestTestTestTestTestTestTestTestTestTestTestTestTestTestTestTestTestTestTestTestTestTestTestTestTestTestTestTestTestTestTestTestTestTestTestTestTestTestTestTestTestTestTestTestTestTestTestTestTestTestTestTestTestTestTestTestTestTestTestTestTestTestTestTestTestTestTestTestTestTestTestTestTestTestTestTestTestTestTestTestTestTestTestTestTestTestTestTestTestTestTestTestTestTestTestTestTestTestTestTestTestTestTestTestTestTestTestTestTestTestTestTestTestTestTestTestTestTestTestTestTestTestTestTestTestTestTestTestTestTestTestTestTestTestTestTestTestTestTestTestTestTestTestTestTestTestTestTestTestTestTestTestTestTestTestTestTestTestTestTestTestTestTestTestTestTestTestTestTestTestTestTestTestTestTestTestTestTestTestTestTestTestTestTestTestTestTestTestTestTestTestTestTestTestTestTestTestTestTestTestTestTestTestTestTestTestTestTestTestTestTestTestTestTestTestTestTestTestTestTestTestTestTestTestTestTestTestTestTestTestTestTestTestTestTestTestTestTestTestTestTestTestTestTestTestTestTestTestTestTestTestTestTestTestTestTestTestTestTestTestTestTestTestTestTestTestTestTestTestTestTestTestTestTestTestTestTestTestTestTestTestTestTestTestTestTestTestTestTestTestTestTestTestTestTestTestTestTestTestTestTestTestTestTestTestTestTestTestTestTestTestTestTestTestTestTestTestTestTestTestTestTestTestTestTestTestTestTestTestTestTestTestTestTestTestTestTestTestTestTestTestTestTestTestTestTestTestTestTestTestTestTestTestTestTestTestTestTestTestTestTestTestTestTestTestTestTestTestTestTestTestTestTestTestTestTestTestTestTestTestTestTestTestTestTestTestTestTestTestTestTestTestTestTestTestTestTestTestTestTestTestTestTestTestTestTestTestTestTestTestTestTestTestTestTestTestTestTestTestTestTestTestTestTestTestTestTestTestTestTestTestTestTestTestTestTestTestTestTestTestTestTestTestTestTestTestTestTestTestTestTestTestTestTestTestTestTestTestTestTestTestTestTestTestTestTestTestTestTestTestTestTestTestTestTestTestTestTestTestTestTestTestTestTestTestTestTestTestTestTestTestTestTestTestTestTestTestTestTestTestTestTestTestTestTestTestTestTestTestTestTestTestTestTestTestTestTestTestTestTestTestTestTestTestTestTestTestTestTestTestTestTestTestTestTestTestTestTestTestTestTestTestTestTestTestTestTestTestTestTestTestTestTestTestTestTestTestTestTestTestTestTestTestTestTestTestTestTestTestTestTestTestTestTestTestTestTestTestTestTestTestTestTestTestTestTestTestTestTestTestTestTestTestTestTestTestTestTestTestTestTestTestTestTestTestTestTestTestTestTestTestTestTestTestTestTestTestTestTestTestTestTestTestTestTestTestTestTestTestTestTestTestTestTestTestTestTestTestTestTestTestTestTestTestTestTestTestTestTestTestTestTestTestTestTestTestTestTestTestTestTestTestTestTestTestTestTestTestTestTestTestTestTestTestTestTestTestTestTestTestTestTestTestTestTestTestTestTestTestTestTestTestTestTestTestTestTestTestTestTestTestTestTestTestTestTestTestTestTestTestTestTestTestTestTestTestTestTestTestTestTestTestTestTestTestTestTestTestTestTestTestTestTestTestTestTestTestTestTestTestTestTestTestTestTestTestTestTestTestTestTestTestTestTestTestTestTestTestTestTestTestTestTestTestTestTestTestTestTestTestTestTestTestTestTestTestTestTestTestTestTestTestTestTestTestTestTestTestTestTestTestTestTestTestTestTestTestTestTestTestTestTestTestTestTestTestTestTestTestTestTestTestTestTestTestTestTestTestTestTestTestTestTestTestTestTestTestTestTestTestTestTestTestTestTestTestTestTestTestTestTestTestTestTest
Start 2051: simulation.modelica.NBackend.alias.AliasCyclic8.mos
2040/2647 Test #2038: simulation.modelica.NBackend.ScalableTestsuite.ManyEvents.mos .............................................................................................. Passed 4.35 sec
Start 2052: simulation.modelica.NBackend.alias.Alias_pre.mos
Stashed 1 file(s)
PASS [ 48.936s] (1393/1413) openmodelica_codegen_wasm_jit CodegenWasmJitFunctions::runtime::tests::precompiled_runtime_record
PASS [ 49.248s] (1394/1413) openmodelica_codegen_wasm_jit CodegenWasmJitFunctions::runtime::tests::precompiled_runtime_int_to_real_and_logical
[whenFunctionTuple.mos:0] OK
[ticket-3477.mos:0] OK
[bug_2452.mos:0] OK
[bug_2286_literal.mos:0] OK
[Modelica.Mechanics.MultiBody.Examples.Elementary.Pendulum.mos:3] OK
2041/2647 Test #2051: simulation.modelica.NBackend.alias.AliasCyclic8.mos ........................................................................................................ Passed 0.18 sec
Start 2053: simulation.modelica.NBackend.alias.Alias_test3.mos
PASS [ 49.466s] (1395/1413) openmodelica_codegen_wasm_jit CodegenWasmJitFunctions::runtime::tests::multi_output_tuple
[bug_6068.mos:0] OK
[bug_2271.mos:0] OK
[whenDiscreteForLoop.mos:1] OK
[bug_2286.mos:1] OK
[Pipeline] isUnix
[Pipeline] sh
2042/2647 Test #2053: simulation.modelica.NBackend.alias.Alias_test3.mos ......................................................................................................... Passed 0.19 sec
Start 2054: simulation.modelica.NBackend.alias.Alias_test5.mos
2043/2647 Test #2040: simulation.modelica.NBackend.ScalableTestsuite.OneDHeatTransferTT_FD.mos ................................................................................... Passed 4.22 sec
Start 2055: simulation.modelica.NBackend.alias.ArrayAlias1.mos
PASS [ 49.748s] (1396/1413) openmodelica_codegen_wasm_jit CodegenWasmJitFunctions::runtime::tests::precompiled_runtime_array_matmul
[bug2888.mos:1] OK
+ build/bin/omc --version
+ grep -o v[0-9]\+[.][0-9]\+[.][0-9]\+[^ ]*
2044/2647 Test #2046: simulation.modelica.NBackend.alias.Alias2.mos .............................................................................................................. Passed 1.15 sec
Start 2056: simulation.modelica.NBackend.alias.ArrayAliasSizeOne.mos
2045/2647 Test #2047: simulation.modelica.NBackend.alias.AliasCyclic.mos ......................................................................................................... Passed 1.11 sec
Start 2057: simulation.modelica.NBackend.array_handling.BenchmarksForResizeableArrays.ArrayEquations.CascadedFirstOrder1.mos
[Pipeline] archiveArtifacts
PASS [ 49.848s] (1397/1413) openmodelica_codegen_wasm_jit CodegenWasmJitFunctions::runtime::tests::precompiled_runtime_mod_int
Archiving artifacts
[WhenStatement3.mos:0] OK
[WhenStatement1.mos:0] OK
[WhenStatement2.mos:0] OK
[WhenPriority.mos:0] OK
2046/2647 Test #2041: simulation.modelica.NBackend.ScalableTestsuite.PowerSystemStepLoad.mos ..................................................................................... Passed 4.44 sec
Start 2058: simulation.modelica.NBackend.array_handling.BenchmarksForResizeableArrays.ArrayEquations.CascadedFirstOrder3.mos
2047/2647 Test #2049: simulation.modelica.NBackend.alias.AliasCyclic4.mos ........................................................................................................ Passed 1.10 sec
Start 2059: simulation.modelica.NBackend.array_handling.BenchmarksForResizeableArrays.ArrayEquations.WaterHammer.mos
2048/2647 Test #2050: simulation.modelica.NBackend.alias.AliasCyclic6.mos ........................................................................................................ Passed 1.11 sec
Start 2060: simulation.modelica.NBackend.array_handling.BenchmarksForResizeableArrays.ComponentArrays.FiltersInSeries.mos
2049/2647 Test #2042: simulation.modelica.NBackend.ScalableTestsuite.Table.mos ................................................................................................... Passed 4.15 sec
Start 2061: simulation.modelica.NBackend.array_handling.BenchmarksForResizeableArrays.ErrorsIfArraysNotExpanded.LinearSystemOfEquations.mos
[testDgesvSources.mos:3] OK
[Modelica.Electrical.Digital.Examples.Counter3.mos:3] OK
PASS [ 50.186s] (1398/1413) openmodelica_codegen_wasm_jit CodegenWasmJitFunctions::runtime::tests::precompiled_runtime_array_constructors
PASS [ 50.292s] (1399/1413) openmodelica_codegen_wasm_jit CodegenWasmJitFunctions::runtime::tests::precompiled_runtime_array_abi
[Pipeline] sh
[TupleReturn.mos:0] OK
[ZeroCross.mos:1] OK
[Issue14470.mos:5] OK
2050/2647 Test #2052: simulation.modelica.NBackend.alias.Alias_pre.mos ........................................................................................................... Passed 1.14 sec
Start 2062: simulation.modelica.NBackend.array_handling.BenchmarksForResizeableArrays.ErrorsIfArraysNotExpanded.WrongNumberOfArrayEquations.mos
[DrModelicaForTesting.Xpowers1.mos:2] OK
[PlanarMechanicsForTesting.Examples.TestDryFrictionWheel.mos:3] OK
PASS [ 50.491s] (1400/1413) openmodelica_codegen_wasm_jit CodegenWasmJitFunctions::runtime::tests::precompiled_runtime_shape_builtins
+ sed -i.bak s/%/\%/g compliance.ignore.xml
+ sed -i.bak s/[^[:print:]]/ /g compliance.ignore.xml
[SumSeriesWhile.mos:1] OK
2051/2647 Test #2054: simulation.modelica.NBackend.alias.Alias_test5.mos ......................................................................................................... Passed 1.14 sec
Start 2063: simulation.modelica.NBackend.array_handling.BenchmarksForResizeableArrays.ForLoops.CascadedFirstOrder.mos
2052/2647 Test #2055: simulation.modelica.NBackend.alias.ArrayAlias1.mos ......................................................................................................... Passed 1.16 sec
Start 2064: simulation.modelica.NBackend.array_handling.BenchmarksForResizeableArrays.Resizable.CascadedFirstOrder1_Resizable.mos
[DrModelicaForTesting.HideVariableForEquations.mos:3] OK
[Modelica.Electrical.Machines.Examples.SynchronousMachines.SMR_Inverter.mos:3] OK
[algorithms.mos:2] OK
[Issue16192.mos:1] OK
[LocalVariableInit.mos:1] OK
[InverseAlgorithm4.mos:0] OK
[Issue16198.mos:1] OK
[SimplePeriodicSampler.mos:1] OK
2053/2647 Test #2043: simulation.modelica.NBackend.ScalableTestsuite.TestHysteresis.mos .......................................................................................... Passed 4.21 sec
Start 2065: simulation.modelica.NBackend.array_handling.BenchmarksForResizeableArrays.Resizable.CascadedFirstOrder3_Resizable.mos
[WhenTuple.mos:2] OK
[Pipeline] junit
Recording test results
[InverseAlgorithm3.mos:0] OK
PASS [ 51.040s] (1401/1413) openmodelica_codegen_wasm_jit CodegenWasmJitFunctions::runtime::tests::precompiled_runtime_real_format_and_pad_abi
PASS [ 51.077s] (1402/1413) openmodelica_codegen_wasm_jit CodegenWasmJitFunctions::runtime::tests::precompiled_runtime_array_slice
[Checks API] No suitable checks publisher found.
[LRB2.mos:2] OK
[DrModelicaForTesting.ArrayIndex.mos:3] OK
[InverseAlgorithm1.mos:0] OK
[InverseAlgorithm2.mos:0] OK
[FunctionPointerArrayOutput.mos:0] OK
[FunctionTupleRecord.mos:0] OK
[FunctionPointerRecordOutput.mos:0] OK
2054/2647 Test #2044: simulation.modelica.NBackend.ScalableTestsuite.TimeTable.mos ............................................................................................... Passed 4.18 sec
Start 2066: simulation.modelica.NBackend.array_handling.BenchmarksForResizeableArrays.Resizable.CascadedFirstOrder_Resizable.mos
[pendel.mos:3] OK
== Building FFITestLib
== Finding the tests in suite smoke
12 threads
[Pipeline] }
[Interpolation.mos:1] OK
[FunctionIndirectRecursion2.mos:1] OK
PASS [ 51.578s] (1403/1413) openmodelica_codegen_wasm_jit CodegenWasmJitFunctions::runtime::tests::precompiled_runtime_array_cat
PASS [ 51.696s] (1404/1413) openmodelica_codegen_wasm_jit CodegenWasmJitFunctions::runtime::tests::precompiled_runtime_array_transpose
[FunctionPointerArray.mos:1] OK
[FunctionPointer.mos:1] OK
[ModelicaTest.Fluid.Dissipation.Verifications.HeatTransfer.Channel.kc_evenGapLaminar.mos:2] OK
[FunctionIndirectRecursion.mos:0] OK
[Pipeline] // script
PASS [ 51.719s] (1405/1413) openmodelica_codegen_wasm_jit CodegenWasmJit::link_tests::fmu_component_links_the_carried_libraries
2055/2647 Test #2056: simulation.modelica.NBackend.alias.ArrayAliasSizeOne.mos ................................................................................................... Passed 2.12 sec
Start 2067: simulation.modelica.NBackend.array_handling.EnumIndex.mos
[TestFalseIterationNLS.mos:3] OK
[Modelica.Mechanics.Translational.Examples.ElastoGap.mos:3] OK
[FunctionInReinit.mos:0] OK
[FuncDer.mos:0] OK
[ForIterator1.mos:0] OK
[Pipeline] }
2056/2647 Test #2045: simulation.modelica.NBackend.ScalableTestsuite.Verification_Table.mos ...................................................................................... Passed 4.09 sec
Start 2068: simulation.modelica.NBackend.array_handling.MultiDimensionalArrays2.mos
[ComplexSystem.mos:1] OK
[ArrayInitSorting.mos:1] OK
[AlgorithmTupleAssign.mos:1] OK
[DoubleWhenSequential.mos:1] OK
Warning: The initial conditions are not fully specified. For more information set -d=initialization. In OMEdit Tools->Options->Simulation->Show additional information from the initialization process, in OMNotebook call setCommandLineOptions("-d=initialization").
Notification: Building FMU for platform 'arm-linux-gnueabihf' (1/5).
Notification: Using docker image 'ghcr.io/openmodelica/crossbuild:v1.28.0' for cross compilation.
Notification: Finished FMU for platform 'arm-linux-gnueabihf' (1/5).
Notification: Building FMU for platform 'x86_64-linux-gnu' (2/5).
Notification: Using docker image 'ghcr.io/openmodelica/crossbuild:v1.28.0' for cross compilation.
Notification: Finished FMU for platform 'x86_64-linux-gnu' (2/5).
Notification: Building FMU for platform 'i686-linux-gnu' (3/5).
Notification: Using docker image 'ghcr.io/openmodelica/crossbuild:v1.28.0' for cross compilation.
Notification: Finished FMU for platform 'i686-linux-gnu' (3/5).
Notification: Building FMU for platform 'x86_64-w64-mingw32' (4/5).
Notification: Using docker image 'ghcr.io/openmodelica/crossbuild:v1.28.0' for cross compilation.
Notification: Finished FMU for platform 'x86_64-w64-mingw32' (4/5).
Notification: Building FMU for platform 'i686-w64-mingw32' (5/5).
Notification: Using docker image 'ghcr.io/openmodelica/crossbuild:v1.28.0' for cross compilation.
Notification: Finished FMU for platform 'i686-w64-mingw32' (5/5).
record SimulationResult
resultFile = "/var/lib/jenkins/ws/OpenModelica/testsuite/special/FmuExportCrossCompile/WaterTank_Control_res.csv",
simulationOptions = "startTime = 0.0, stopTime = 1.0, numberOfIntervals = 2000, tolerance = 1e-6, method = 'euler', fileNamePrefix = 'WaterTank_Control', options = '', outputFormat = 'csv', variableFilter = '.*', cflags = '', simflags = ''",
messages = "LOG_SUCCESS | info | The initialization finished successfully without homotopy method.
LOG_SUCCESS | info | The simulation finished successfully.
profiling:/var/lib/jenkins1:Cannot create directory
profiling:/var/lib/jenkins1/ws/OpenModelica/build_cmake/OMCompiler/SimulationRuntime/c/util/CMakeFiles/OpenModelicaRuntimeCUtil.dir/write_matlab4.c.gcda:Skip
profiling:/var/lib/jenkins1:Cannot create directory
profiling:/var/lib/jenkins1/ws/OpenModelica/build_cmake/OMCompiler/SimulationRuntime/c/util/CMakeFiles/OpenModelicaRuntimeCUtil.dir/write_csv.c.gcda:Skip
profiling:/var/lib/jenkins1:Cannot create directory
profiling:/var/lib/jenkins1/ws/OpenModelica/build_cmake/OMCompiler/SimulationRuntime/c/util/CMakeFiles/OpenModelicaRuntimeCUtil.dir/tinymt64.c.gcda:Skip
profiling:/var/lib/jenkins1:Cannot create directory
profiling:/var/lib/jenkins1/ws/OpenModelica/build_cmake/OMCompiler/SimulationRuntime/c/util/CMakeFiles/OpenModelicaRuntimeCUtil.dir/read_matlab4.c.gcda:Skip
profiling:/var/lib/jenkins1:Cannot create directory
profiling:/var/lib/jenkins1/ws/OpenModelica/build_cmake/OMCompiler/SimulationRuntime/c/util/CMakeFiles/OpenModelicaRuntimeCUtil.dir/read_csv.c.gcda:Skip
profiling:/var/lib/jenkins1:Cannot create directory
profiling:/var/lib/jenkins1/ws/OpenModelica/build_cmake/OMCompiler/SimulationRuntime/c/util/CMakeFiles/OpenModelicaRuntimeCUtil.dir/omc_numbers.c.gcda:Skip
profiling:/var/lib/jenkins1:Cannot create directory
profiling:/var/lib/jenkins1/ws/OpenModelica/build_cmake/OMCompiler/SimulationRuntime/c/util/CMakeFiles/OpenModelicaRuntimeCUtil.dir/omc_init.c.gcda:Skip
profiling:/var/lib/jenkins1:Cannot create directory
profiling:/var/lib/jenkins1/ws/OpenModelica/build_cmake/OMCompiler/SimulationRuntime/c/util/CMakeFiles/OpenModelicaRuntimeCUtil.dir/OldModelicaTables.c.gcda:Skip
profiling:/var/lib/jenkins1:Cannot create directory
profiling:/var/lib/jenkins1/ws/OpenModelica/build_cmake/OMCompiler/SimulationRuntime/c/util/CMakeFiles/OpenModelicaRuntimeCUtil.dir/omc_stackoverflow.c.gcda:Skip
profiling:/var/lib/jenkins1:Cannot create directory
profiling:/var/lib/jenkins1/ws/OpenModelica/build_cmake/OMCompiler/SimulationRuntime/c/util/CMakeFiles/OpenModelicaRuntimeCUtil.dir/omc_str_utils.c.gcda:Skip
profiling:/var/lib/jenkins1:Cannot create directory
profiling:/var/lib/jenkins1/ws/OpenModelica/build_cmake/OMCompiler/SimulationRuntime/c/util/CMakeFiles/OpenModelicaRuntimeCUtil.dir/read_write.c.gcda:Skip
profiling:/var/lib/jenkins1:Cannot create directory
profiling:/var/lib/jenkins1/ws/OpenModelica/build_cmake/OMCompiler/SimulationRuntime/c/util/CMakeFiles/OpenModelicaRuntimeCUtil.dir/omc_string.c.gcda:Skip
profiling:/var/lib/jenkins1:Cannot create directory
profiling:/var/lib/jenkins1/ws/OpenModelica/build_cmake/OMCompiler/SimulationRuntime/c/util/CMakeFiles/OpenModelicaRuntimeCUtil.dir/omc_box.c.gcda:Skip
profiling:/var/lib/jenkins1:Cannot create directory
profiling:/var/lib/jenkins1/ws/OpenModelica/build_cmake/OMCompiler/SimulationRuntime/c/util/CMakeFiles/OpenModelicaRuntimeCUtil.dir/libcsv.c.gcda:Skip
profiling:/var/lib/jenkins1:Cannot create directory
profiling:/var/lib/jenkins1/ws/OpenModelica/build_cmake/OMCompiler/SimulationRuntime/c/util/CMakeFiles/OpenModelicaRuntimeCUtil.dir/index_spec.c.gcda:Skip
profiling:/var/lib/jenkins1:Cannot create directory
profiling:/var/lib/jenkins1/ws/OpenModelica/build_cmake/OMCompiler/SimulationRuntime/c/gc/CMakeFiles/OpenModelicaRuntimeCGC.dir/omc_rc.c.gcda:Skip
profiling:/var/lib/jenkins1:Cannot create directory
profiling:/var/lib/jenkins1/ws/OpenModelica/build_cmake/OMCompiler/SimulationRuntime/c/gc/CMakeFiles/OpenModelicaRuntimeCGC.dir/omc_alloc.c.gcda:Skip
",
timeFrontend = 0.002713117,
timeBackend = 0.006760047000000001,
timeSimCode = 0.0015985810000000002,
timeTemplates = 0.0036614280000000004,
timeCompile = 0.27306778000000004,
timeSimulation = 0.012112216,
timeTotal = 0.30003781100000004
end SimulationResult;
"Warning: The initial conditions are not fully specified. For more information set -d=initialization. In OMEdit Tools->Options->Simulation->Show additional information from the initialization process, in OMNotebook call setCommandLineOptions(\"-d=initialization\").
"
true
""
"/var/lib/jenkins/ws/OpenModelica/testsuite/special/FmuExportCrossCompile/WaterTank_Control.fmu"
WaterTank_TestSingleWaterTank
[ForIterator2.mos:1] OK
[AlgorithmForInClass.mos:0] OK
[AlgorithmCondAssign2.mos:0] OK
[ModelicaInternal_countLines.mos:1] OK
[Integer1.mos:1] OK
[Pipeline] // withEnv
[AlgorithmSection.mos:0] OK
[AlgorithmCondAssign1.mos:0] OK
[ASubIfExp.mos:0] OK
[15936.mos:0] OK
2057/2647 Test #2067: simulation.modelica.NBackend.array_handling.EnumIndex.mos .................................................................................................. Passed 1.15 sec
Start 2069: simulation.modelica.NBackend.array_handling.MultiDimensionalArrays4.mos
2058/2647 Test #2057: simulation.modelica.NBackend.array_handling.BenchmarksForResizeableArrays.ArrayEquations.CascadedFirstOrder1.mos ........................................... Passed 3.20 sec
Start 2070: simulation.modelica.NBackend.array_handling.arrayResultFile.mos
[Modelica.Clocked.Examples.CascadeControlledDrive.AbsoluteClocks.mos:2] OK
[Modelica.Fluid.Examples.AST_BatchPlant.Test.TwoTanks.mos:3] OK
[TSP_FourFlows2.mos:3] OK
[Modelica.Mechanics.Rotational.Examples.First.mos:2] OK
[PlanarMechanicsForTesting.Examples.CounterSpin.mos:3] OK
[for_if.mos:2] OK
2059/2647 Test #2068: simulation.modelica.NBackend.array_handling.MultiDimensionalArrays2.mos .................................................................................... Passed 1.13 sec
Start 2071: simulation.modelica.NBackend.array_handling.arrayZeroDivisionInitial.mos
2060/2647 Test #2058: simulation.modelica.NBackend.array_handling.BenchmarksForResizeableArrays.ArrayEquations.CascadedFirstOrder3.mos ........................................... Passed 3.25 sec
Start 2072: simulation.modelica.NBackend.array_handling.array_bound_attributes_alias.mos
2061/2647 Test #2061: simulation.modelica.NBackend.array_handling.BenchmarksForResizeableArrays.ErrorsIfArraysNotExpanded.LinearSystemOfEquations.mos ............................ Passed 3.18 sec
Start 2073: simulation.modelica.NBackend.array_handling.array_init_file.mos
2062/2647 Test #2060: simulation.modelica.NBackend.array_handling.BenchmarksForResizeableArrays.ComponentArrays.FiltersInSeries.mos .............................................. Passed 3.21 sec
Start 2074: simulation.modelica.NBackend.array_handling.array_start_int_bool_string.mos
2063/2647 Test #2059: simulation.modelica.NBackend.array_handling.BenchmarksForResizeableArrays.ArrayEquations.WaterHammer.mos ................................................... Passed 3.25 sec
Start 2075: simulation.modelica.NBackend.array_handling.diagonal_slice_for.mos
2064/2647 Test #2062: simulation.modelica.NBackend.array_handling.BenchmarksForResizeableArrays.ErrorsIfArraysNotExpanded.WrongNumberOfArrayEquations.mos ........................ Passed 3.19 sec
Start 2076: simulation.modelica.NBackend.array_handling.for_exp.mos
[Pipeline] }
$ docker stop --time=1 caf033ddc2dd71a9b6d35d25e9ed42b374d9bf6a25f70969be3113f59e65bb5f
[Modelica.Electrical.Digital.Examples.DFFREGL.mos:3] OK
[13328.mos:1] OK
[13144.mos:1] OK
[14530.mos:1] OK
[13788.mos:1] OK
[slicedLinearSystem.mos:1] OK
[torn2DForResidualIndex.mos:0] OK
[partialForArrayBodyLinear.mos:0] OK
2065/2647 Test #2064: simulation.modelica.NBackend.array_handling.BenchmarksForResizeableArrays.Resizable.CascadedFirstOrder1_Resizable.mos ...................................... Passed 3.10 sec
Start 2077: simulation.modelica.NBackend.array_handling.for_list.mos
2066/2647 Test #2063: simulation.modelica.NBackend.array_handling.BenchmarksForResizeableArrays.ForLoops.CascadedFirstOrder.mos .................................................. Passed 3.17 sec
Start 2078: simulation.modelica.NBackend.array_handling.irregular_for.mos
2067/2647 Test #2065: simulation.modelica.NBackend.array_handling.BenchmarksForResizeableArrays.Resizable.CascadedFirstOrder3_Resizable.mos ...................................... Passed 3.16 sec
Start 2079: simulation.modelica.NBackend.array_handling.print_array_var_names.mos
[minimalTearing_simple.mos:0] OK
[partialForArrayBody.mos:0] OK
[ModelicaTest.Blocks.Exponentiation.mos:3] OK
[DrModelicaForTesting.ConcatArr1.mos:3] OK
2068/2647 Test #2069: simulation.modelica.NBackend.array_handling.MultiDimensionalArrays4.mos .................................................................................... Passed 1.12 sec
Start 2080: simulation.modelica.NBackend.array_handling.scalar_product.mos
[partialNestedFor.mos:0] OK
[nonlinearContinuousLoop.mos:0] OK
[minimalTearing.mos:0] OK
[loopSizeOne.mos:1] OK
[impliedInner.mos:1] OK
2069/2647 Test #2071: simulation.modelica.NBackend.array_handling.arrayZeroDivisionInitial.mos ................................................................................... Passed 1.10 sec
Start 2081: simulation.modelica.NBackend.array_handling.simple_for.mos
2070/2647 Test #2072: simulation.modelica.NBackend.array_handling.array_bound_attributes_alias.mos ............................................................................... Passed 1.14 sec
Start 2082: simulation.modelica.NBackend.array_handling.slice_for.mos
2071/2647 Test #2074: simulation.modelica.NBackend.array_handling.array_start_int_bool_string.mos ................................................................................ Passed 1.13 sec
Start 2083: simulation.modelica.NBackend.array_handling.testVectorizedPowerSystem.mos
2072/2647 Test #2066: simulation.modelica.NBackend.array_handling.BenchmarksForResizeableArrays.Resizable.CascadedFirstOrder_Resizable.mos ....................................... Passed 3.09 sec
Start 2084: simulation.modelica.NBackend.basics.arrayCascade.mos
2073/2647 Test #2076: simulation.modelica.NBackend.array_handling.for_exp.mos .................................................................................................... Passed 1.11 sec
Start 2085: simulation.modelica.NBackend.basics.detectStates.mos
[TestCrossFunction.mos:5] OK
[Modelica.Electrical.Machines.Examples.InductionMachines.IMC_DOL.mos:3] OK
[DrModelicaForTesting.NamedCall.mos:3] OK
[DrModelicaForTesting.DVSSTest.mos:3] OK
$ docker rm -f --volumes caf033ddc2dd71a9b6d35d25e9ed42b374d9bf6a25f70969be3113f59e65bb5f
[guruTearing1.mos:0] OK
[duplicatePattern.mos:0] OK
[solveForLoop.mos:0] OK
2074/2647 Test #2077: simulation.modelica.NBackend.array_handling.for_list.mos ................................................................................................... Passed 1.10 sec
Start 2086: simulation.modelica.NBackend.basics.enumWithIntegerConstants.mos
2075/2647 Test #2078: simulation.modelica.NBackend.array_handling.irregular_for.mos .............................................................................................. Passed 1.11 sec
Start 2087: simulation.modelica.NBackend.basics.evaluateFalse.mos
2076/2647 Test #2079: simulation.modelica.NBackend.array_handling.print_array_var_names.mos ...................................................................................... Passed 1.14 sec
Start 2088: simulation.modelica.NBackend.basics.helloWorld.mos
2077/2647 Test #2070: simulation.modelica.NBackend.array_handling.arrayResultFile.mos ............................................................................................ Passed 2.06 sec
Start 2089: simulation.modelica.NBackend.basics.inactiveWhenBranch.mos
[solveMultaryBinary.mos:0] OK
[solveCallTan.mos:0] OK
[scalarFromSingleElementArray.mos:0] OK
[solveCallExp.mos:0] OK
2078/2647 Test #2080: simulation.modelica.NBackend.array_handling.scalar_product.mos ............................................................................................. Passed 1.09 sec
Start 2090: simulation.modelica.NBackend.basics.parameterIndex.mos
2079/2647 Test #2073: simulation.modelica.NBackend.array_handling.array_init_file.mos ............................................................................................ Passed 2.06 sec
Start 2091: simulation.modelica.NBackend.basics.partitioning.mos
[NPendulum.mos:11] OK
[simplifyWhen.mos:1] OK
[splitIf.mos:1] OK
[scalarFromArrayEquation.mos:1] OK
2080/2647 Test #2075: simulation.modelica.NBackend.array_handling.diagonal_slice_for.mos ......................................................................................... Passed 2.06 sec
Start 2092: simulation.modelica.NBackend.basics.simpleForLoop.mos
2081/2647 Test #2082: simulation.modelica.NBackend.array_handling.slice_for.mos .................................................................................................. Passed 1.10 sec
Start 2093: simulation.modelica.NBackend.basics.solveSingleEquation.mos
2082/2647 Test #2083: simulation.modelica.NBackend.array_handling.testVectorizedPowerSystem.mos .................................................................................. Passed 1.17 sec
Start 2094: simulation.modelica.NBackend.basics.variability.mos
[cellierArray.mos:1] OK
[simplifyIf.mos:1] OK
2083/2647 Test #2084: simulation.modelica.NBackend.basics.arrayCascade.mos ....................................................................................................... Passed 1.12 sec
Start 2095: simulation.modelica.NBackend.clocked.MSL_timeBasedStep.mos
2084/2647 Test #2094: simulation.modelica.NBackend.basics.variability.mos ........................................................................................................ Passed 0.18 sec
Start 2096: simulation.modelica.NBackend.clocked.backSample.mos
[Pipeline] // withDockerContainer
[simple_record.mos:0] OK
[simple_tuple.mos:0] OK
[multary_simplification.mos:0] OK
2085/2647 Test #2086: simulation.modelica.NBackend.basics.enumWithIntegerConstants.mos ........................................................................................... Passed 1.08 sec
Start 2097: simulation.modelica.NBackend.clocked.eventConstructor.mos
2086/2647 Test #2087: simulation.modelica.NBackend.basics.evaluateFalse.mos ...................................................................................................... Passed 1.10 sec
Start 2098: simulation.modelica.NBackend.clocked.implicitSignal.mos
[Modelica.Blocks.Examples.RealNetwork1.mos:2] OK
[Modelica.Electrical.Machines.Examples.DCMachines.DCEE_Start.mos:3] OK
[DrModelicaForTesting.WhenPriority.mos:3] OK
[DrModelicaForTesting.WaveEquationSample.mos:3] OK
[DrModelicaForTesting.SumVector.mos:3] OK
[record_arrays.mos:0] OK
[RecordCausality.mos:0] OK
[recordConstantArgument.mos:0] OK
[IntegralNewtonCotes.mos:5] OK
[nestedRecordBinding.mos:0] OK
[record_inlining.mos:0] OK
2087/2647 Test #2088: simulation.modelica.NBackend.basics.helloWorld.mos ......................................................................................................... Passed 1.09 sec
Start 2099: simulation.modelica.NBackend.clocked.inferredSampleVar.mos
2088/2647 Test #2089: simulation.modelica.NBackend.basics.inactiveWhenBranch.mos ................................................................................................. Passed 1.11 sec
Start 2100: simulation.modelica.NBackend.clocked.sampleVar.mos
2089/2647 Test #2090: simulation.modelica.NBackend.basics.parameterIndex.mos ..................................................................................................... Passed 1.10 sec
Start 2101: simulation.modelica.NBackend.clocked.shiftSample1.mos
[Pipeline] }
[Tearing8-celMC3sorted.mos:3] OK
[DrModelicaForTesting.PolynomialEvaluator2.mos:3] OK
[NonTopLevelInputs.mos:1] OK
[AliasRecord.mos:1] OK
[resizableParameterBinding.mos:1] OK
2090/2647 Test #2091: simulation.modelica.NBackend.basics.partitioning.mos ....................................................................................................... Passed 1.10 sec
Start 2102: simulation.modelica.NBackend.clocked.subSample.mos
2091/2647 Test #2092: simulation.modelica.NBackend.basics.simpleForLoop.mos ...................................................................................................... Passed 1.15 sec
Start 2103: simulation.modelica.NBackend.clocked.subSample_eq.mos
[Modelica.StateGraph.Examples.FirstExample.mos:3] OK
[Pipeline] // withEnv
[primaryParameterFor.mos:0] OK
2092/2647 Test #2093: simulation.modelica.NBackend.basics.solveSingleEquation.mos ................................................................................................ Passed 1.15 sec
Start 2104: simulation.modelica.NBackend.clocked.subSuperSample2.mos
2093/2647 Test #2096: simulation.modelica.NBackend.clocked.backSample.mos ........................................................................................................ Passed 1.10 sec
Start 2105: simulation.modelica.NBackend.cpp.ParArray.mos
[Modelica.Electrical.Machines.Examples.DCMachines.DCSE_SinglePhase.mos:3] OK
[Pipeline] }
[primaryParameterRecordArray.mos:0] OK
[homotopy_no_loop.mos:0] OK
[init_if_eq.mos:0] OK
[init_if_exp.mos:0] OK
[primaryParameterRecord.mos:0] OK
2094/2647 Test #2098: simulation.modelica.NBackend.clocked.implicitSignal.mos .................................................................................................... Passed 1.14 sec
Start 2106: simulation.modelica.NBackend.daemode.TestDaeModeNB.mos
[homotopy_indirect.mos:0] OK
[functionOutputStartAlias.mos:0] OK
[Pipeline] // ws
2095/2647 Test #2099: simulation.modelica.NBackend.clocked.inferredSampleVar.mos ................................................................................................. Passed 1.11 sec
Start 2107: simulation.modelica.NBackend.differentation.adjoint_jacobian2.mos
2096/2647 Test #2100: simulation.modelica.NBackend.clocked.sampleVar.mos ......................................................................................................... Passed 1.12 sec
Start 2108: simulation.modelica.NBackend.differentation.adjoint_jacobian4.mos
2097/2647 Test #2081: simulation.modelica.NBackend.array_handling.simple_for.mos ................................................................................................. Passed 2.98 sec
Start 2109: simulation.modelica.NBackend.differentation.algebraicLoop.mos
2098/2647 Test #2101: simulation.modelica.NBackend.clocked.shiftSample1.mos ...................................................................................................... Passed 1.12 sec
Start 2110: simulation.modelica.NBackend.differentation.arrayDiff.mos
[functionOutputStart.mos:1] OK
2099/2647 Test #2085: simulation.modelica.NBackend.basics.detectStates.mos ....................................................................................................... Passed 2.95 sec
Start 2111: simulation.modelica.NBackend.differentation.derSeedJacobian.mos
2100/2647 Test #2102: simulation.modelica.NBackend.clocked.subSample.mos ......................................................................................................... Passed 1.10 sec
Start 2112: simulation.modelica.NBackend.differentation.functionInputDerivative.mos
2101/2647 Test #2103: simulation.modelica.NBackend.clocked.subSample_eq.mos ...................................................................................................... Passed 1.11 sec
Start 2113: simulation.modelica.NBackend.differentation.numericJacobianRows.mos
[Pipeline] }
[experimental_initialSimplified.mos:1] OK
[functionAliasStartLoop.mos:1] OK
[overdeterminedIndexReduction.mos:1] OK
[static_index_3.mos:1] OK
[static_IR.mos:1] OK
[TestInversePlant.mos:1] OK
[derivativeDummyState.mos:1] OK
[Modelica.Electrical.Machines.Examples.DCMachines.DCPM_QuasiStatic.mos:3] OK
[Test8.mos:3] OK
[Modelica.Mechanics.Translational.Examples.HeatLosses.mos:3] OK
[AlgorithmSize.mos:6] OK
2102/2647 Test #2106: simulation.modelica.NBackend.daemode.TestDaeModeNB.mos ..................................................................................................... Passed 1.10 sec
Start 2114: simulation.modelica.NBackend.differentation.symbolicJacobianEvaluation.mos
[inlineAttributes15947.mos:0] OK
[basic_IR.mos:0] OK
[ifEquationFunctionCall.mos:0] OK
[function_partial_der.mos:0] OK
[aux_states.mos:0] OK
[tupleCallInForLoop.mos:0] OK
[DMwarm.mos:2] OK
[Pipeline] // node
2103/2647 Test #2107: simulation.modelica.NBackend.differentation.adjoint_jacobian2.mos .......................................................................................... Passed 1.14 sec
Start 2115: simulation.modelica.NBackend.differentation.tupleAssignmentDerivative.mos
2104/2647 Test #2109: simulation.modelica.NBackend.differentation.algebraicLoop.mos .............................................................................................. Passed 1.14 sec
Start 2116: simulation.modelica.NBackend.event_handling.algorithmWhen.mos
[function_diff.mos:1] OK
2105/2647 Test #2110: simulation.modelica.NBackend.differentation.arrayDiff.mos .................................................................................................. Passed 1.10 sec
Start 2117: simulation.modelica.NBackend.event_handling.compositeEvent.mos
2106/2647 Test #2108: simulation.modelica.NBackend.differentation.adjoint_jacobian4.mos .......................................................................................... Passed 1.16 sec
Start 2118: simulation.modelica.NBackend.event_handling.hybridSys.mos
2107/2647 Test #2111: simulation.modelica.NBackend.differentation.derSeedJacobian.mos ............................................................................................ Passed 1.17 sec
Start 2119: simulation.modelica.NBackend.event_handling.spatialDistributionTuple.mos
2108/2647 Test #2113: simulation.modelica.NBackend.differentation.numericJacobianRows.mos ........................................................................................ Passed 1.09 sec
Start 2120: simulation.modelica.NBackend.event_handling.whenTimeEvents.mos
[Pipeline] }
[function_annotation_der.mos:1] OK
[whenTimeEvents.mos:0] OK
[hybridSys.mos:0] OK
[DrModelicaForTesting.FiveForEquations.mos:3] OK
2109/2647 Test #2095: simulation.modelica.NBackend.clocked.MSL_timeBasedStep.mos ................................................................................................. Passed 3.10 sec
Start 2121: simulation.modelica.NBackend.functions.function_annotation_der.mos
[Pipeline] // retry
[builtin_functions.mos:0] OK
[spatialDistributionTuple.mos:0] OK
[integerIteratorNoEvent.mos:0] OK
[whenConditionAssertSplit.mos:0] OK
[Pipeline] }
[DrModelicaForTesting.Exp.mos:3] OK
[DrModelicaForTesting.BouncingBall.mos:3] OK
[RtlInverter.mos:3] OK
2110/2647 Test #2097: simulation.modelica.NBackend.clocked.eventConstructor.mos .................................................................................................. Passed 3.22 sec
Start 2122: simulation.modelica.NBackend.functions.function_inline_retype.mos
[Pipeline] // stage
[algorithmWhenPreCondition.mos:0] OK
[eventSystem.mos:0] OK
[Modelica.Electrical.Spice3.Examples.Graetz.mos:4] OK
[Pipeline] }
2111/2647 Test #2114: simulation.modelica.NBackend.differentation.symbolicJacobianEvaluation.mos ................................................................................. Passed 1.24 sec
Start 2123: simulation.modelica.NBackend.functions.ifEquationFunctionCall.mos
[compositeEvent.mos:1] OK
[AssertNoEvent.mos:1] OK
[algorithmWhen.mos:1] OK
[tornNLSJacobianRows.mos:1] OK
[tupleAssignmentDerivative.mos:1] OK
[OverdeterminedInitialization.Fluid.TwoVolumesEquationsFullSteadyStatePressureAndTemperature.mos:3] OK
[BenchmarksForResizeableArrays.Resizable.CascadedFirstOrder2_Resizable.mos:3] OK
2112/2647 Test #2117: simulation.modelica.NBackend.event_handling.compositeEvent.mos ............................................................................................. Passed 1.12 sec
Start 2124: simulation.modelica.NBackend.functions.tupleCallInForLoop.mos
2113/2647 Test #2118: simulation.modelica.NBackend.event_handling.hybridSys.mos .................................................................................................. Passed 1.14 sec
Start 2125: simulation.modelica.NBackend.index_reduction.basic_IR.mos
2114/2647 Test #2112: simulation.modelica.NBackend.differentation.functionInputDerivative.mos .................................................................................... Passed 2.12 sec
Start 2126: simulation.modelica.NBackend.index_reduction.overdeterminedIndexReduction.mos
[numericJacobianRows.mos:0] OK
[DrModelicaForTesting.ArrayDim2.mos:3] OK
2115/2647 Test #2119: simulation.modelica.NBackend.event_handling.spatialDistributionTuple.mos ................................................................................... Passed 1.11 sec
Start 2127: simulation.modelica.NBackend.index_reduction.static_index_3.mos
2116/2647 Test #2120: simulation.modelica.NBackend.event_handling.whenTimeEvents.mos ............................................................................................. Passed 1.10 sec
Start 2128: simulation.modelica.NBackend.init_xml.02_int_param_array_var.mos
2117/2647 Test #2104: simulation.modelica.NBackend.clocked.subSuperSample2.mos ................................................................................................... Passed 3.19 sec
Start 2129: simulation.modelica.NBackend.init_xml.04_real_matrix_var.mos
2118/2647 Test #2121: simulation.modelica.NBackend.functions.function_annotation_der.mos ......................................................................................... Passed 1.13 sec
Start 2130: simulation.modelica.NBackend.init_xml.07_array_attributes.mos
2119/2647 Test #2126: simulation.modelica.NBackend.index_reduction.overdeterminedIndexReduction.mos .............................................................................. Passed 0.25 sec
Start 2131: simulation.modelica.NBackend.initialization.discreteCallArgument.mos
2120/2647 Test #2105: simulation.modelica.NBackend.cpp.ParArray.mos .............................................................................................................. Passed 3.04 sec
Start 2132: simulation.modelica.NBackend.initialization.functionAliasStartLoop.mos
SLOW [> 60.000s] (─────────) openmodelica_codegen_wasm_jit CodegenWasmJit::link_tests::fmu_component_links_without_a_host
SLOW [> 60.000s] (─────────) openmodelica_codegen_wasm_jit CodegenWasmJit::link_tests::merge_leaves_only_wasi_imports
[recordArgumentDerivative.mos:0] OK
[symbolicJacobianEvaluation.mos:1] OK
[Model1.mos:2] OK
PASS [ 60.203s] (1406/1413) openmodelica_codegen_wasm_jit CodegenWasmJit::link_tests::fmu_component_links_without_a_host
[iteratorElementDerivative.mos:0] OK
[diff_subs.mos:0] OK
[arrayScalar.mos:0] OK
[functionInputDerivative.mos:1] OK
PASS [ 21.194s] (1407/1413) openmodelica_wasm_jit dylink_engine::tests::an_object_file_is_rejected_with_a_useful_message
2121/2647 Test #2115: simulation.modelica.NBackend.differentation.tupleAssignmentDerivative.mos .................................................................................. Passed 2.07 sec
Start 2133: simulation.modelica.NBackend.initialization.functionOutputStartAlias.mos
2122/2647 Test #2116: simulation.modelica.NBackend.event_handling.algorithmWhen.mos .............................................................................................. Passed 2.10 sec
Start 2134: simulation.modelica.NBackend.initialization.homotopy_no_loop.mos
[derSeedJacobian.mos:1] OK
[algebraicLoop.mos:1] OK
[arrayDiff.mos:1] OK
[allTheBuildins.mos:1] OK
2123/2647 Test #2123: simulation.modelica.NBackend.functions.ifEquationFunctionCall.mos .......................................................................................... Passed 1.13 sec
Start 2135: simulation.modelica.NBackend.initialization.init_if_exp.mos
2124/2647 Test #2124: simulation.modelica.NBackend.functions.tupleCallInForLoop.mos .............................................................................................. Passed 1.11 sec
Start 2136: simulation.modelica.NBackend.initialization.primaryParameterRecord.mos
2125/2647 Test #2125: simulation.modelica.NBackend.index_reduction.basic_IR.mos .................................................................................................. Passed 1.17 sec
Start 2137: simulation.modelica.NBackend.initialization.resizableParameterBinding.mos
[adjoint_jacobian4.mos:0] OK
[adjoint_jacobian5.mos:0] OK
2126/2647 Test #2128: simulation.modelica.NBackend.init_xml.02_int_param_array_var.mos ........................................................................................... Passed 1.08 sec
Start 2138: simulation.modelica.NBackend.records.ComplexTest.mos
2127/2647 Test #2129: simulation.modelica.NBackend.init_xml.04_real_matrix_var.mos ............................................................................................... Passed 1.08 sec
Start 2139: simulation.modelica.NBackend.records.RecordCausality.mos
2128/2647 Test #2127: simulation.modelica.NBackend.index_reduction.static_index_3.mos ............................................................................................ Passed 1.19 sec
Start 2140: simulation.modelica.NBackend.records.recordConstantArgument.mos
2129/2647 Test #2130: simulation.modelica.NBackend.init_xml.07_array_attributes.mos .............................................................................................. Passed 1.12 sec
Start 2141: simulation.modelica.NBackend.records.record_inlining.mos
2130/2647 Test #2132: simulation.modelica.NBackend.initialization.functionAliasStartLoop.mos ..................................................................................... Passed 1.16 sec
Start 2142: simulation.modelica.NBackend.records.simple_tuple.mos
[fmi3_import_boolean.mos:3] OK
[adjoint_jacobian3.mos:0] OK
[adjoint_jacobian2.mos:0] OK
[TestDaeModeNB.mos:0] OK
[Modelica.Mechanics.MultiBody.Frames.mos:4] OK
[adjoint_jacobian1.mos:0] OK
[superSample.mos:0] OK
2131/2647 Test #2133: simulation.modelica.NBackend.initialization.functionOutputStartAlias.mos ................................................................................... Passed 1.12 sec
Start 2143: simulation.modelica.NBackend.simplification.simplifyIf.mos
[subSuperSample1.mos:1] OK
[subSample_eq.mos:1] OK
2132/2647 Test #2135: simulation.modelica.NBackend.initialization.init_if_exp.mos ................................................................................................ Passed 1.12 sec
Start 2144: simulation.modelica.NBackend.simplification.splitIf.mos
2133/2647 Test #2134: simulation.modelica.NBackend.initialization.homotopy_no_loop.mos ........................................................................................... Passed 1.16 sec
Start 2145: simulation.modelica.NBackend.solve.scalarFromSingleElementArray.mos
2134/2647 Test #2136: simulation.modelica.NBackend.initialization.primaryParameterRecord.mos ..................................................................................... Passed 1.12 sec
Start 2146: simulation.modelica.NBackend.solve.solveCallTan.mos
[subSample.mos:1] OK
[subSample.mos:0] OK
[Modelica.Electrical.Analog.Examples.ThyristorBehaviourTest.mos:3] OK
[TestSourceCodeFMU.mos:3] OK
2135/2647 Test #2137: simulation.modelica.NBackend.initialization.resizableParameterBinding.mos .................................................................................. Passed 1.11 sec
Start 2147: simulation.modelica.NBackend.solve.solveMultaryBinary.mos
2136/2647 Test #2139: simulation.modelica.NBackend.records.RecordCausality.mos ................................................................................................... Passed 1.13 sec
Start 2148: simulation.modelica.NBackend.tearing.duplicatePattern.mos
2137/2647 Test #2140: simulation.modelica.NBackend.records.recordConstantArgument.mos ............................................................................................ Passed 1.14 sec
Start 2149: simulation.modelica.NBackend.tearing.impliedInner.mos
2138/2647 Test #2141: simulation.modelica.NBackend.records.record_inlining.mos ................................................................................................... Passed 1.17 sec
Start 2150: simulation.modelica.NBackend.tearing.minimalTearing.mos
[splitPartition.mos:0] OK
[ComplexTest.mos:6] OK
[shiftSample1.mos:0] OK
[discreteCallArgument.mos:5] OK
2139/2647 Test #2142: simulation.modelica.NBackend.records.simple_tuple.mos ...................................................................................................... Passed 1.13 sec
Start 2151: simulation.modelica.NBackend.tearing.nonlinearContinuousLoop.mos
2140/2647 Test #2122: simulation.modelica.NBackend.functions.function_inline_retype.mos .......................................................................................... Passed 3.20 sec
Start 2152: simulation.modelica.NBackend.tearing.partialForArrayBodyLinear.mos
PASS [ 22.941s] (1408/1413) openmodelica_wasm_jit dylink_engine::tests::static_data_is_relocated_into_the_shared_memory
[shiftSample.mos:0] OK
[sampleVar.mos:1] OK
[dataReconciliation.mos:4] OK
[Modelica_DeviceDrivers.Blocks.Examples.TestSerialPackager_ExternalTrigger.mos:4] OK
[inferredSampleVar.mos:1] OK
[rationalConstructor1.mos:1] OK
[inferredConstructor2.mos:1] OK
[DrModelicaForTesting.getPerson.mos:4] OK
[fmi3_cs_01.mos:3] OK
2141/2647 Test #2143: simulation.modelica.NBackend.simplification.simplifyIf.mos ................................................................................................. Passed 1.10 sec
Start 2153: simulation.modelica.NBackend.tearing.slicedLinearSystem.mos
2142/2647 Test #2144: simulation.modelica.NBackend.simplification.splitIf.mos .................................................................................................... Passed 1.10 sec
Start 2154: simulation.modelica.NBackend.tickets.13144.mos
2143/2647 Test #2145: simulation.modelica.NBackend.solve.scalarFromSingleElementArray.mos ........................................................................................ Passed 1.10 sec
Start 2155: simulation.modelica.NBackend.tickets.13788.mos
2144/2647 Test #2146: simulation.modelica.NBackend.solve.solveCallTan.mos ........................................................................................................ Passed 1.10 sec
Start 2156: simulation.modelica.NBackend.tickets.15936.mos
[implicitSignal.mos:0] OK
[holdVar.mos:0] OK
[backSample1.mos:0] OK
[fmi3_attributes_01.mos:3] OK
[Modelica.Electrical.Spice3.Examples.Spice3BenchmarkDifferentialPair.mos:3] OK
2145/2647 Test #2147: simulation.modelica.NBackend.solve.solveMultaryBinary.mos .................................................................................................. Passed 1.09 sec
Start 2157: simulation.modelica.algorithms_functions.AlgorithmCondAssign1.mos
2146/2647 Test #2131: simulation.modelica.NBackend.initialization.discreteCallArgument.mos ....................................................................................... Passed 3.23 sec
Start 2158: simulation.modelica.algorithms_functions.AlgorithmForInClass.mos
2147/2647 Test #2148: simulation.modelica.NBackend.tearing.duplicatePattern.mos .................................................................................................. Passed 1.13 sec
Start 2159: simulation.modelica.algorithms_functions.AlgorithmSize.mos
[backSample.mos:0] OK
[function_inline_retype.mos:5] OK
2148/2647 Test #2149: simulation.modelica.NBackend.tearing.impliedInner.mos ...................................................................................................... Passed 1.15 sec
Start 2160: simulation.modelica.algorithms_functions.ArrayInitSorting.mos
2149/2647 Test #2150: simulation.modelica.NBackend.tearing.minimalTearing.mos .................................................................................................... Passed 1.13 sec
Start 2161: simulation.modelica.algorithms_functions.DoubleWhenSequential.mos
2150/2647 Test #2151: simulation.modelica.NBackend.tearing.nonlinearContinuousLoop.mos ........................................................................................... Passed 1.11 sec
Start 2162: simulation.modelica.algorithms_functions.ForIterator2.mos
2151/2647 Test #2152: simulation.modelica.NBackend.tearing.partialForArrayBodyLinear.mos ......................................................................................... Passed 1.13 sec
Start 2163: simulation.modelica.algorithms_functions.FunctionInReinit.mos
[arraySample.mos:0] OK
[variability.mos:0] OK
[arrowhead.mos:1] OK
[underdetermined_init.mos:1] OK
[PlanarMechanicsForTesting.Examples.DoublePendulum.mos:4] OK
2152/2647 Test #2162: simulation.modelica.algorithms_functions.ForIterator2.mos .................................................................................................. Passed 0.29 sec
Start 2164: simulation.modelica.algorithms_functions.FunctionIndirectRecursion2.mos
[solveSingleEquation.mos:0] OK
[simpleNonlinearLoop.mos:0] OK
PASS [ 24.196s] (1409/1413) openmodelica_wasm_jit dylink_engine::tests::shared_c_import_links_against_the_c_prototype
2153/2647 Test #2164: simulation.modelica.algorithms_functions.FunctionIndirectRecursion2.mos .................................................................................... Passed 0.16 sec
Start 2165: simulation.modelica.algorithms_functions.FunctionPointerArray.mos
2154/2647 Test #2153: simulation.modelica.NBackend.tearing.slicedLinearSystem.mos ................................................................................................ Passed 1.16 sec
Start 2166: simulation.modelica.algorithms_functions.FunctionPointerRecordOutput.mos
2155/2647 Test #2154: simulation.modelica.NBackend.tickets.13144.mos ............................................................................................................. Passed 1.10 sec
Start 2167: simulation.modelica.algorithms_functions.IntegralNewtonCotes.mos
[simpleForLoop.mos:0] OK
[partitioning.mos:0] OK
[parameterSystem.mos:0] OK
[promotePreferStates.mos:0] OK
PASS [ 24.617s] (1410/1413) openmodelica_wasm_jit dylink_engine::tests::a_library_can_use_libc
2156/2647 Test #2157: simulation.modelica.algorithms_functions.AlgorithmCondAssign1.mos .......................................................................................... Passed 1.13 sec
Start 2168: simulation.modelica.algorithms_functions.InverseAlgorithm1.mos
[parameterIndex.mos:0] OK
PASS [ 24.831s] (1411/1413) openmodelica_wasm_jit dylink_engine::tests::loads_a_library_and_calls_it
2157/2647 Test #2158: simulation.modelica.algorithms_functions.AlgorithmForInClass.mos ........................................................................................... Passed 1.14 sec
Start 2169: simulation.modelica.algorithms_functions.InverseAlgorithm3.mos
2158/2647 Test #2160: simulation.modelica.algorithms_functions.ArrayInitSorting.mos .............................................................................................. Passed 1.13 sec
Start 2170: simulation.modelica.algorithms_functions.Issue16192.mos
2159/2647 Test #2161: simulation.modelica.algorithms_functions.DoubleWhenSequential.mos .......................................................................................... Passed 1.12 sec
Start 2171: simulation.modelica.algorithms_functions.LocalVariableInit.mos
[EventClockAndClassic.mos:5] OK
[minArr.mos:1] OK
[inactiveWhenBranch.mos:1] OK
[helloWorld.mos:1] OK
[implicitEquation.mos:1] OK
2160/2647 Test #2163: simulation.modelica.algorithms_functions.FunctionInReinit.mos .............................................................................................. Passed 1.12 sec
Start 2172: simulation.modelica.algorithms_functions.SimplePeriodicSampler.mos
[TSP_FourFlows6.mos:4] OK
[Modelica.Electrical.Digital.Examples.INV3S.mos:3] OK
[for_if_if.mos:1] OK
[evaluateFalse.mos:0] OK
2161/2647 Test #2155: simulation.modelica.NBackend.tickets.13788.mos ............................................................................................................. Passed 2.02 sec
Start 2173: simulation.modelica.algorithms_functions.TestCrossFunction.mos
2162/2647 Test #2165: simulation.modelica.algorithms_functions.FunctionPointerArray.mos .......................................................................................... Passed 1.11 sec
Start 2174: simulation.modelica.algorithms_functions.WhenPriority.mos
2163/2647 Test #2166: simulation.modelica.algorithms_functions.FunctionPointerRecordOutput.mos ................................................................................... Passed 1.11 sec
Start 2175: simulation.modelica.algorithms_functions.WhenStatement2.mos
2164/2647 Test #2156: simulation.modelica.NBackend.tickets.15936.mos ............................................................................................................. Passed 2.07 sec
Start 2176: simulation.modelica.algorithms_functions.ZeroCross.mos
[enumWithIntegerConstants.mos:0] OK
[enumeration.mos:0] OK
[emptyModel.mos:0] OK
PASS [ 25.829s] (1412/1413) openmodelica_wasm_jit dylink_engine::tests::a_scalar_external_binds_directly
[detectStates.mos:0] OK
[arrayReadElements.mos:0] OK
[Modelica.Mechanics.Translational.Examples.Oscillator.mos:3] OK
[Modelica.Thermal.FluidHeatFlow.Examples.TwoMass.mos:3] OK
Superseded by OpenModelica/master#7952
Sending interrupt signal to process
2165/2647 Test #2168: simulation.modelica.algorithms_functions.InverseAlgorithm1.mos ............................................................................................. Passed 1.17 sec
Start 2177: simulation.modelica.algorithms_functions.bug2888.mos
2166/2647 Test #2169: simulation.modelica.algorithms_functions.InverseAlgorithm3.mos ............................................................................................. Passed 1.13 sec
Start 2178: simulation.modelica.algorithms_functions.bug_2286.mos
2167/2647 Test #2170: simulation.modelica.algorithms_functions.Issue16192.mos .................................................................................................... Passed 1.17 sec
Start 2179: simulation.modelica.algorithms_functions.bug_2452.mos
2168/2647 Test #2171: simulation.modelica.algorithms_functions.LocalVariableInit.mos ............................................................................................. Passed 1.14 sec
Start 2180: simulation.modelica.algorithms_functions.bug_6068.mos
[arrayCascade.mos:1] OK
[subscripted_expression.mos:1] OK
[DrModelicaForTesting.ArrayConstruct1.mos:3] OK
2169/2647 Test #2179: simulation.modelica.algorithms_functions.bug_2452.mos ...................................................................................................... Passed 0.18 sec
Start 2181: simulation.modelica.algorithms_functions.val.mos
2170/2647 Test #2172: simulation.modelica.algorithms_functions.SimplePeriodicSampler.mos ......................................................................................... Passed 1.14 sec
Start 2182: simulation.modelica.algorithms_functions.whenFunctionTuple.mos
[fmi3_arrays_scalarized.mos:3] OK
[DrModelicaForTesting.ArrayDim4.mos:3] OK
[Modelica.Thermal.FluidHeatFlow.Examples.PumpDropOut.mos:3] OK
[slice_for.mos:1] OK
[testVectorizedPowerSystem.mos:1] OK
[simple_nested_for.mos:0] OK
2171/2647 Test #2174: simulation.modelica.algorithms_functions.WhenPriority.mos .................................................................................................. Passed 1.11 sec
Start 2183: simulation.modelica.arrays.ABCDsystem.csv.mos
[EnumerationTest.mos:3] OK
[Modelica.Blocks.Examples.LogicalNetwork1.mos:3] OK
2172/2647 Test #2175: simulation.modelica.algorithms_functions.WhenStatement2.mos ................................................................................................ Passed 1.14 sec
Start 2184: simulation.modelica.arrays.ABCDsystem.plt.mos
2173/2647 Test #2176: simulation.modelica.algorithms_functions.ZeroCross.mos ..................................................................................................... Passed 1.18 sec
Start 2185: simulation.modelica.arrays.AppendElement.mos
[simple_der_for.mos:0] OK
[resizableConnectFor.mos:0] OK
[scalar_product.mos:0] OK
[simple_for.mos:1] OK
[matrix_vector_product.mos:1] OK
2174/2647 Test #2177: simulation.modelica.algorithms_functions.bug2888.mos ....................................................................................................... Passed 1.11 sec
Start 2186: simulation.modelica.arrays.ArrayBox.mos
2175/2647 Test #2178: simulation.modelica.algorithms_functions.bug_2286.mos ...................................................................................................... Passed 1.13 sec
Start 2187: simulation.modelica.arrays.ArrayEquation.mos
2176/2647 Test #2159: simulation.modelica.algorithms_functions.AlgorithmSize.mos ................................................................................................. Passed 3.41 sec
Start 2188: simulation.modelica.arrays.ArrayFromRange.mos
Sending interrupt signal to process
[WhenInitialTerminal.mos:2] OK
[irregular_for.mos:0] OK
2177/2647 Test #2180: simulation.modelica.algorithms_functions.bug_6068.mos ...................................................................................................... Passed 1.11 sec
Start 2189: simulation.modelica.arrays.ArrayMult.mos
2178/2647 Test #2188: simulation.modelica.arrays.ArrayFromRange.mos .............................................................................................................. Passed 0.17 sec
Start 2190: simulation.modelica.arrays.ArrayReduce.mos
2179/2647 Test #2181: simulation.modelica.algorithms_functions.val.mos ........................................................................................................... Passed 1.10 sec
Start 2191: simulation.modelica.arrays.ArraySlice.mos
2180/2647 Test #2182: simulation.modelica.algorithms_functions.whenFunctionTuple.mos ............................................................................................. Passed 1.12 sec
Start 2192: simulation.modelica.arrays.ArraySliceAssigmentFunction.mos
[MSL_timeBasedStep.mos:4] OK
[integerComprehensionParameter.mos:0] OK
[testDAEModeFileSplit_Issue4851.mos:41] OK
[for_list.mos:0] OK
[for_if.mos:0] OK
Sending interrupt signal to process
2181/2647 Test #2183: simulation.modelica.arrays.ABCDsystem.csv.mos .............................................................................................................. Passed 1.11 sec
Start 2193: simulation.modelica.arrays.AsubCrefExpType.mos
Sending interrupt signal to process
[Tearing10-celMC13.mos:3] OK
Terminated
2182/2647 Test #2167: simulation.modelica.algorithms_functions.IntegralNewtonCotes.mos ........................................................................................... Passed 3.30 sec
Start 2194: simulation.modelica.arrays.BooleanArray2.mos
2183/2647 Test #2185: simulation.modelica.arrays.AppendElement.mos ............................................................................................................... Passed 1.10 sec
Start 2195: simulation.modelica.arrays.Bug3187.mos
Sending interrupt signal to process
Terminated
make[1]: *** [Makefile:24: fmuExportCrossCompile] Terminated
make: *** [Makefile:16: test] Terminated
2184/2647 Test #2184: simulation.modelica.arrays.ABCDsystem.plt.mos .............................................................................................................. Passed 1.25 sec
Start 2196: simulation.modelica.arrays.ConstantSubscriptOutOfRange.mos
2185/2647 Test #2194: simulation.modelica.arrays.BooleanArray2.mos ............................................................................................................... Passed 0.19 sec
Start 2197: simulation.modelica.arrays.DimConvert.mos
2186/2647 Test #2186: simulation.modelica.arrays.ArrayBox.mos .................................................................................................................... Passed 1.13 sec
Start 2198: simulation.modelica.arrays.FunctionArraySlices.mos
Sending interrupt signal to process
Terminated
Cancelling due to signal: 1 test still running
Terminated
SIGTERM [ 67.586s] (1413/1413) openmodelica_codegen_wasm_jit CodegenWasmJit::link_tests::merge_leaves_only_wasi_imports
stdout ───
running 1 test
test CodegenWasmJit::link_tests::merge_leaves_only_wasi_imports has been running for over 60 seconds
stderr ───
could not deduce the OpenModelica installation directory from executable path: [/tmp/omc-rust/rust-src/Compiler/OpenModelica.rs/target/debug/deps/openmodelica_codegen_wasm_jit-fcdb88fe729173bd], please set OPENMODELICAHOME
(test aborted with signal 15: SIGTERM)
────────────
Summary [ 67.710s] 1413 tests run: 1412 passed (1 slow), 1 failed, 0 skipped
SIGTERM [ 67.586s] (1413/1413) openmodelica_codegen_wasm_jit CodegenWasmJit::link_tests::merge_leaves_only_wasi_imports
error: test run failed
[DrModelicaForTesting.MRFcall.mos:3] OK
[translateResidualsDAE1.mos:2] OK
Sending interrupt signal to process
2187/2647 Test #2187: simulation.modelica.arrays.ArrayEquation.mos ............................................................................................................... Passed 1.15 sec
Start 2199: simulation.modelica.arrays.NPendulum.mos
2188/2647 Test #2189: simulation.modelica.arrays.ArrayMult.mos ................................................................................................................... Passed 1.10 sec
Start 2200: simulation.modelica.arrays.PolynomialEvaluator2.mos
2189/2647 Test #2190: simulation.modelica.arrays.ArrayReduce.mos ................................................................................................................. Passed 1.10 sec
Start 2201: simulation.modelica.arrays.PolynomialEvaluatorA.mos
Sending interrupt signal to process
Terminated
2190/2647 Test #2192: simulation.modelica.arrays.ArraySliceAssigmentFunction.mos ................................................................................................. Passed 1.11 sec
Start 2202: simulation.modelica.arrays.StringArrayLiteral.mos
2191/2647 Test #2191: simulation.modelica.arrays.ArraySlice.mos .................................................................................................................. Passed 1.18 sec
Start 2203: simulation.modelica.arrays.VectorizeOneReturnValue.mos
Terminated
gmake[3]: *** [OMCompiler/Compiler/CMakeFiles/rust_omedit_qt_web.dir/build.make:73: OMCompiler/Compiler/CMakeFiles/rust_omedit_qt_web] Terminated
Terminated
gmake[2]: *** [CMakeFiles/Makefile2:2061: OMCompiler/Compiler/CMakeFiles/rust_omedit_qt_web.dir/all] Terminated
gmake[1]: *** [CMakeFiles/Makefile2:2068: OMCompiler/Compiler/CMakeFiles/rust_omedit_qt_web.dir/rule] Terminated
gmake[6]: *** [CMakeFiles/OMEdit-qt.dir/build.make:560: OMEdit-qt.js] Terminated
gmake[5]: *** [CMakeFiles/Makefile2:269: CMakeFiles/OMEdit-qt.dir/all] Terminated
gmake: *** [Makefile:941: rust_omedit_qt_web] Terminated
gmake[4]: *** [Makefile:136: all] Terminated
[Pipeline] }
$ docker stop --time=1 327dea56c58691158381e83a9056c884d642aae96a512afe0f59a619572a042c
$ docker rm -f --volumes 327dea56c58691158381e83a9056c884d642aae96a512afe0f59a619572a042c
[Pipeline] }
[Pipeline] sh
[Pipeline] }
[Pipeline] }
[Pipeline] junit
Recording test results
None of the test reports contained any result
+ sccache --show-stats
Compile requests 0
Compile requests executed 0
Cache hits 0
Cache misses 0
Cache hits rate -
Cache timeouts 0
Cache read errors 0
Forced recaches 0
Cache write errors 0
Cache errors 0
Compilations 0
Compilation failures 0
Non-cacheable compilations 0
Non-cacheable calls 0
Non-compilation calls 0
Unsupported compiler calls 0
Average cache write 0.000 s
Average compiler 0.000 s
Average cache read hit 0.000 s
Failed distributed compilations 0
Cache location s3, name: omc-sccache, prefix: /
Base directories /var/lib/jenkins2/ws/OpenModelica/
Version (client) 0.18.0
[Pipeline] // withDockerContainer
[Pipeline] // script
[Pipeline] // withEnv
[Pipeline] // withEnv
[Pipeline] }
[Pipeline] }
$ docker stop --time=1 08705508e97c373c39f8f7f1b936c7a19d1bac3a074ecdb25e7cc1ec68e0f6cf
No test report files were found. Configuration error?
$ docker rm -f --volumes 08705508e97c373c39f8f7f1b936c7a19d1bac3a074ecdb25e7cc1ec68e0f6cf
gmake[2]: *** [OMCompiler/Compiler/CMakeFiles/rust_wasm_cargo.dir/build.make:71: OMCompiler/Compiler/CMakeFiles/rust_wasm_cargo] Terminated
Terminated
gmake[1]: *** [CMakeFiles/Makefile2:1762: OMCompiler/Compiler/CMakeFiles/rust_wasm_cargo.dir/all] Terminated
gmake: *** [Makefile:166: all] Terminated
[Pipeline] sh
[Pipeline] }
$ docker stop --time=1 ba53be48ad915e9747481f19e86ace4b826990473f2dca8cdf116d76b711c796
+ sccache --show-stats
Compile requests 0
Compile requests executed 0
Cache hits 0
Cache misses 0
Cache hits rate -
Cache timeouts 0
Cache read errors 0
Forced recaches 0
Cache write errors 0
Cache errors 0
Compilations 0
Compilation failures 0
Non-cacheable compilations 0
Non-cacheable calls 0
Non-compilation calls 0
Unsupported compiler calls 0
Average cache write 0.000 s
Average compiler 0.000 s
Average cache read hit 0.000 s
Failed distributed compilations 0
Cache location s3, name: omc-sccache, prefix: /
Base directories /var/lib/jenkins1/ws/OpenModelica/
Version (client) 0.18.0
$ docker rm -f --volumes ba53be48ad915e9747481f19e86ace4b826990473f2dca8cdf116d76b711c796
[Pipeline] }
$ docker stop --time=1 bf96cf9d0e1808a00dfeec1b285a4b3ddc0a0ad4fa5ed556e62ece25d3a84b13
$ docker rm -f --volumes bf96cf9d0e1808a00dfeec1b285a4b3ddc0a0ad4fa5ed556e62ece25d3a84b13
[Pipeline] }
[Pipeline] }
$ docker stop --time=1 c6bd00a30ce85394222a2ac8ad07c8b176ec2f8182ace3b8cb3f32676d05c809
$ docker rm -f --volumes c6bd00a30ce85394222a2ac8ad07c8b176ec2f8182ace3b8cb3f32676d05c809
Click here to forcibly terminate running steps
[Pipeline] // script
[Pipeline] // withDockerContainer
[Pipeline] // withDockerContainer
[Pipeline] // withDockerContainer
[Pipeline] }
[Pipeline] }
[Pipeline] sh
[Pipeline] }
[Pipeline] }
[Pipeline] }
[Pipeline] // withEnv
[Pipeline] // withDockerContainer
+ sccache --show-stats
Compile requests 0
Compile requests executed 0
Cache hits 0
Cache misses 0
Cache hits rate -
Cache timeouts 0
Cache read errors 0
Forced recaches 0
Cache write errors 0
Cache errors 0
Compilations 0
Compilation failures 0
Non-cacheable compilations 0
Non-cacheable calls 0
Non-compilation calls 0
Unsupported compiler calls 0
Average cache write 0.000 s
Average compiler 0.000 s
Average cache read hit 0.000 s
Failed distributed compilations 0
Cache location s3, name: omc-sccache, prefix: /
Base directories /var/lib/jenkins1/ws/OpenModelica/
Version (client) 0.18.0
[Pipeline] }
[Pipeline] }
[Pipeline] // withEnv
[Pipeline] // withEnv
[Pipeline] // withEnv
[Pipeline] // script
[Pipeline] // script
[Pipeline] }
[Pipeline] }
[Pipeline] }
[Pipeline] }
[Pipeline] }
[Pipeline] // withCredentials
[Pipeline] // script
[Pipeline] sh
[Pipeline] }
[Pipeline] }
[Pipeline] // ws
[Pipeline] // withEnv
+ cp /tmp/omc-rust/rust-src/Compiler/OpenModelica.rs/target/nextest/ci/junit.xml nextest-junit.xml
[Pipeline] // withCredentials
[Pipeline] // withEnv
[Pipeline] // withEnv
[Pipeline] }
[Pipeline] }
[Pipeline] }
[Pipeline] }
[Pipeline] }
[Pipeline] // withEnv
[Pipeline] // withEnv
[Pipeline] }
[Pipeline] }
[Pipeline] junit
Recording test results
[Checks API] No suitable checks publisher found.
[Pipeline] // node
[Pipeline] // ws
[Pipeline] // withCredentials
[Pipeline] // withEnv
[Pipeline] // withEnv
[Pipeline] }
[Pipeline] }
[Pipeline] }
[Pipeline] }
[Pipeline] }
[Pipeline] // withCredentials
[Pipeline] // withEnv
[Pipeline] }
[Pipeline] }
[Pipeline] }
[Pipeline] // stage
[Pipeline] // node
[Pipeline] // script
[Pipeline] // ws
[Pipeline] // ws
[Pipeline] }
Failed in branch 21 cross-build-omc-msvc
[Pipeline] }
[Pipeline] }
$ docker stop --time=1 55159ce77cf2d42bf3ca8d0148cce2eb76c6966b44a37654350271ed979e1459
$ docker rm -f --volumes 55159ce77cf2d42bf3ca8d0148cce2eb76c6966b44a37654350271ed979e1459
[Pipeline] }
[Pipeline] }
[Pipeline] // script
[Pipeline] // ws
[Pipeline] }
$ docker stop --time=1 f342a3160152b0154936785f1ceb4384f61fd32292260de31c18e35bb3c63e82
$ docker rm -f --volumes f342a3160152b0154936785f1ceb4384f61fd32292260de31c18e35bb3c63e82
[Pipeline] }
[Pipeline] // script
[Pipeline] }
$ docker stop --time=1 650a9af39136f8069b9791cc74d00d09c9a9bee75f0387377d66916799f2bf9e
$ docker rm -f --volumes 650a9af39136f8069b9791cc74d00d09c9a9bee75f0387377d66916799f2bf9e
[Pipeline] // retry
[Pipeline] // withDockerContainer
[Pipeline] // node
[Pipeline] // node
[Pipeline] }
[Pipeline] }
[Pipeline] }
[Pipeline] }
[Pipeline] }
[Pipeline] }
[Pipeline] }
[Pipeline] // stage
[Pipeline] // retry
[Pipeline] // retry
[Pipeline] // retry
[Pipeline] // withEnv
[Pipeline] // withEnv
[Pipeline] // withEnv
[Pipeline] }
Failed in branch 13 cross-build-fmu
[Pipeline] }
[Pipeline] }
[Pipeline] }
[Pipeline] }
[Pipeline] }
[Pipeline] }
[Pipeline] // stage
[Pipeline] // stage
[Pipeline] // stage
[Pipeline] // ws
[Pipeline] // ws
[Pipeline] // ws
[Pipeline] }
Failed in branch 04 testsuite-gcc 1/2
[Pipeline] }
Failed in branch 05 testsuite-clang 2/2
[Pipeline] }
Failed in branch 19 testsuite-wasm-jit
[Pipeline] }
[Pipeline] }
[Pipeline] }
[Pipeline] // node
[Pipeline] // node
[Pipeline] // node
[Pipeline] }
[Pipeline] }
[Pipeline] }
[Pipeline] // stage
[Pipeline] // stage
[Pipeline] // stage
[Pipeline] }
Failed in branch 10 web target
[Pipeline] }
Failed in branch 10b qt-web target
[Pipeline] }
Failed in branch 12 unit-tests-rust
[Pipeline] // parallel
[Pipeline] }
[Pipeline] // stage
[Pipeline] stage
[Pipeline] { (check-and-upload)
Stage "check-and-upload" skipped due to earlier failure(s)
[Pipeline] getContext
[Pipeline] parallel
[Pipeline] { (Branch: linux-FMPy)
[Pipeline] { (Branch: coverage-report)
[Pipeline] { (Branch: upload-compliance)
[Pipeline] { (Branch: upload-doc)
[Pipeline] { (Branch: upload-web)
[Pipeline] stage
[Pipeline] { (linux-FMPy)
[Pipeline] stage
[Pipeline] { (coverage-report)
[Pipeline] stage
[Pipeline] { (upload-compliance)
[Pipeline] stage
[Pipeline] { (upload-doc)
[Pipeline] stage
[Pipeline] { (upload-web)
Stage "linux-FMPy" skipped due to earlier failure(s)
[Pipeline] getContext
[Pipeline] }
Stage "coverage-report" skipped due to earlier failure(s)
[Pipeline] getContext
[Pipeline] }
Stage "upload-compliance" skipped due to earlier failure(s)
[Pipeline] getContext
[Pipeline] }
Stage "upload-doc" skipped due to earlier failure(s)
[Pipeline] getContext
[Pipeline] }
Stage "upload-web" skipped due to earlier failure(s)
[Pipeline] getContext
[Pipeline] }
[Pipeline] // stage
[Pipeline] // stage
[Pipeline] // stage
[Pipeline] // stage
[Pipeline] // stage
[Pipeline] }
Failed in branch linux-FMPy
[Pipeline] }
Failed in branch coverage-report
[Pipeline] }
Failed in branch upload-compliance
[Pipeline] }
Failed in branch upload-doc
[Pipeline] }
Failed in branch upload-web
[Pipeline] // parallel
[Pipeline] }
[Pipeline] // stage
[Pipeline] stage
[Pipeline] { (publish)
Stage "publish" skipped due to earlier failure(s)
[Pipeline] getContext
[Pipeline] parallel
[Pipeline] { (Branch: push-to-master)
[Pipeline] { (Branch: push-bibliography)
[Pipeline] stage
[Pipeline] { (push-to-master)
[Pipeline] stage
[Pipeline] { (push-bibliography)
Stage "push-to-master" skipped due to earlier failure(s)
[Pipeline] getContext
[Pipeline] }
Stage "push-bibliography" skipped due to earlier failure(s)
[Pipeline] getContext
[Pipeline] }
[Pipeline] // stage
[Pipeline] // stage
[Pipeline] }
Failed in branch push-to-master
[Pipeline] }
Failed in branch push-bibliography
[Pipeline] // parallel
[Pipeline] }
[Pipeline] // stage
[Pipeline] }
[Pipeline] // withEnv
[Pipeline] End of Pipeline
java.io.IOException: failed to run kill
at PluginClassLoader for docker-workflow//org.jenkinsci.plugins.docker.workflow.WithContainerStep$Decorator$1.kill(WithContainerStep.java:401)
at PluginClassLoader for durable-task//org.jenkinsci.plugins.durabletask.FileMonitoringTask$FileMonitoringController.stop(FileMonitoringTask.java:488)
at PluginClassLoader for workflow-durable-task-step//org.jenkinsci.plugins.workflow.steps.durable_task.DurableTaskStep$Execution.stop(DurableTaskStep.java:527)
at PluginClassLoader for workflow-cps//org.jenkinsci.plugins.workflow.cps.CpsThread.stop(CpsThread.java:330)
at PluginClassLoader for workflow-cps//org.jenkinsci.plugins.workflow.cps.CpsFlowExecution$6.onSuccess(CpsFlowExecution.java:1318)
at PluginClassLoader for workflow-cps//org.jenkinsci.plugins.workflow.cps.CpsFlowExecution$6.onSuccess(CpsFlowExecution.java:1307)
at PluginClassLoader for workflow-cps//org.jenkinsci.plugins.workflow.cps.CpsFlowExecution$4$1.run(CpsFlowExecution.java:1060)
at PluginClassLoader for workflow-cps//org.jenkinsci.plugins.workflow.cps.CpsVmExecutorService.lambda$wrap$2(CpsVmExecutorService.java:81)
at java.base/java.util.concurrent.Executors$RunnableAdapter.call(Unknown Source)
at java.base/java.util.concurrent.FutureTask.run(Unknown Source)
at hudson.remoting.SingleLaneExecutorService$1.run(SingleLaneExecutorService.java:139)
at jenkins.util.ContextResettingExecutorService.lambda$wrap$0(ContextResettingExecutorService.java:26)
at jenkins.security.ImpersonatingExecutorService.lambda$wrap$0(ImpersonatingExecutorService.java:66)
at jenkins.util.ErrorLoggingExecutorService.lambda$wrap$0(ErrorLoggingExecutorService.java:51)
at java.base/java.util.concurrent.Executors$RunnableAdapter.call(Unknown Source)
at java.base/java.util.concurrent.FutureTask.run(Unknown Source)
at java.base/java.util.concurrent.ThreadPoolExecutor.runWorker(Unknown Source)
at java.base/java.util.concurrent.ThreadPoolExecutor$Worker.run(Unknown Source)
at PluginClassLoader for workflow-cps//org.jenkinsci.plugins.workflow.cps.CpsVmExecutorService$1.call(CpsVmExecutorService.java:53)
at PluginClassLoader for workflow-cps//org.jenkinsci.plugins.workflow.cps.CpsVmExecutorService$1.call(CpsVmExecutorService.java:50)
at org.codehaus.groovy.runtime.GroovyCategorySupport$ThreadCategoryInfo.use(GroovyCategorySupport.java:136)
at org.codehaus.groovy.runtime.GroovyCategorySupport.use(GroovyCategorySupport.java:275)
at PluginClassLoader for workflow-cps//org.jenkinsci.plugins.workflow.cps.CpsVmExecutorService.lambda$categoryThreadFactory$0(CpsVmExecutorService.java:50)
at java.base/java.lang.Thread.run(Unknown Source)
java.io.IOException: failed to run kill
at PluginClassLoader for docker-workflow//org.jenkinsci.plugins.docker.workflow.WithContainerStep$Decorator$1.kill(WithContainerStep.java:401)
at PluginClassLoader for durable-task//org.jenkinsci.plugins.durabletask.FileMonitoringTask$FileMonitoringController.stop(FileMonitoringTask.java:488)
at PluginClassLoader for workflow-durable-task-step//org.jenkinsci.plugins.workflow.steps.durable_task.DurableTaskStep$Execution.stop(DurableTaskStep.java:527)
at PluginClassLoader for workflow-cps//org.jenkinsci.plugins.workflow.cps.CpsThread.stop(CpsThread.java:330)
at PluginClassLoader for workflow-cps//org.jenkinsci.plugins.workflow.cps.CpsFlowExecution$6.onSuccess(CpsFlowExecution.java:1318)
at PluginClassLoader for workflow-cps//org.jenkinsci.plugins.workflow.cps.CpsFlowExecution$6.onSuccess(CpsFlowExecution.java:1307)
at PluginClassLoader for workflow-cps//org.jenkinsci.plugins.workflow.cps.CpsFlowExecution$4$1.run(CpsFlowExecution.java:1060)
at PluginClassLoader for workflow-cps//org.jenkinsci.plugins.workflow.cps.CpsVmExecutorService.lambda$wrap$2(CpsVmExecutorService.java:81)
at java.base/java.util.concurrent.Executors$RunnableAdapter.call(Unknown Source)
at java.base/java.util.concurrent.FutureTask.run(Unknown Source)
at hudson.remoting.SingleLaneExecutorService$1.run(SingleLaneExecutorService.java:139)
at jenkins.util.ContextResettingExecutorService.lambda$wrap$0(ContextResettingExecutorService.java:26)
at jenkins.security.ImpersonatingExecutorService.lambda$wrap$0(ImpersonatingExecutorService.java:66)
at jenkins.util.ErrorLoggingExecutorService.lambda$wrap$0(ErrorLoggingExecutorService.java:51)
at java.base/java.util.concurrent.Executors$RunnableAdapter.call(Unknown Source)
at java.base/java.util.concurrent.FutureTask.run(Unknown Source)
at java.base/java.util.concurrent.ThreadPoolExecutor.runWorker(Unknown Source)
at java.base/java.util.concurrent.ThreadPoolExecutor$Worker.run(Unknown Source)
at PluginClassLoader for workflow-cps//org.jenkinsci.plugins.workflow.cps.CpsVmExecutorService$1.call(CpsVmExecutorService.java:53)
at PluginClassLoader for workflow-cps//org.jenkinsci.plugins.workflow.cps.CpsVmExecutorService$1.call(CpsVmExecutorService.java:50)
at org.codehaus.groovy.runtime.GroovyCategorySupport$ThreadCategoryInfo.use(GroovyCategorySupport.java:136)
at org.codehaus.groovy.runtime.GroovyCategorySupport.use(GroovyCategorySupport.java:275)
at PluginClassLoader for workflow-cps//org.jenkinsci.plugins.workflow.cps.CpsVmExecutorService.lambda$categoryThreadFactory$0(CpsVmExecutorService.java:50)
at java.base/java.lang.Thread.run(Unknown Source)
java.io.IOException: failed to run kill
at PluginClassLoader for docker-workflow//org.jenkinsci.plugins.docker.workflow.WithContainerStep$Decorator$1.kill(WithContainerStep.java:401)
at PluginClassLoader for durable-task//org.jenkinsci.plugins.durabletask.FileMonitoringTask$FileMonitoringController.stop(FileMonitoringTask.java:488)
at PluginClassLoader for workflow-durable-task-step//org.jenkinsci.plugins.workflow.steps.durable_task.DurableTaskStep$Execution.stop(DurableTaskStep.java:527)
at PluginClassLoader for workflow-cps//org.jenkinsci.plugins.workflow.cps.CpsThread.stop(CpsThread.java:330)
at PluginClassLoader for workflow-cps//org.jenkinsci.plugins.workflow.cps.CpsFlowExecution$6.onSuccess(CpsFlowExecution.java:1318)
at PluginClassLoader for workflow-cps//org.jenkinsci.plugins.workflow.cps.CpsFlowExecution$6.onSuccess(CpsFlowExecution.java:1307)
at PluginClassLoader for workflow-cps//org.jenkinsci.plugins.workflow.cps.CpsFlowExecution$4$1.run(CpsFlowExecution.java:1060)
at PluginClassLoader for workflow-cps//org.jenkinsci.plugins.workflow.cps.CpsVmExecutorService.lambda$wrap$2(CpsVmExecutorService.java:81)
at java.base/java.util.concurrent.Executors$RunnableAdapter.call(Unknown Source)
at java.base/java.util.concurrent.FutureTask.run(Unknown Source)
at hudson.remoting.SingleLaneExecutorService$1.run(SingleLaneExecutorService.java:139)
at jenkins.util.ContextResettingExecutorService.lambda$wrap$0(ContextResettingExecutorService.java:26)
at jenkins.security.ImpersonatingExecutorService.lambda$wrap$0(ImpersonatingExecutorService.java:66)
at jenkins.util.ErrorLoggingExecutorService.lambda$wrap$0(ErrorLoggingExecutorService.java:51)
at java.base/java.util.concurrent.Executors$RunnableAdapter.call(Unknown Source)
at java.base/java.util.concurrent.FutureTask.run(Unknown Source)
at java.base/java.util.concurrent.ThreadPoolExecutor.runWorker(Unknown Source)
at java.base/java.util.concurrent.ThreadPoolExecutor$Worker.run(Unknown Source)
at PluginClassLoader for workflow-cps//org.jenkinsci.plugins.workflow.cps.CpsVmExecutorService$1.call(CpsVmExecutorService.java:53)
at PluginClassLoader for workflow-cps//org.jenkinsci.plugins.workflow.cps.CpsVmExecutorService$1.call(CpsVmExecutorService.java:50)
at org.codehaus.groovy.runtime.GroovyCategorySupport$ThreadCategoryInfo.use(GroovyCategorySupport.java:136)
at org.codehaus.groovy.runtime.GroovyCategorySupport.use(GroovyCategorySupport.java:275)
at PluginClassLoader for workflow-cps//org.jenkinsci.plugins.workflow.cps.CpsVmExecutorService.lambda$categoryThreadFactory$0(CpsVmExecutorService.java:50)
at java.base/java.lang.Thread.run(Unknown Source)
java.io.IOException: failed to run kill
at PluginClassLoader for docker-workflow//org.jenkinsci.plugins.docker.workflow.WithContainerStep$Decorator$1.kill(WithContainerStep.java:401)
at PluginClassLoader for durable-task//org.jenkinsci.plugins.durabletask.FileMonitoringTask$FileMonitoringController.stop(FileMonitoringTask.java:488)
at PluginClassLoader for workflow-durable-task-step//org.jenkinsci.plugins.workflow.steps.durable_task.DurableTaskStep$Execution.stop(DurableTaskStep.java:527)
at PluginClassLoader for workflow-cps//org.jenkinsci.plugins.workflow.cps.CpsThread.stop(CpsThread.java:330)
at PluginClassLoader for workflow-cps//org.jenkinsci.plugins.workflow.cps.CpsFlowExecution$6.onSuccess(CpsFlowExecution.java:1318)
at PluginClassLoader for workflow-cps//org.jenkinsci.plugins.workflow.cps.CpsFlowExecution$6.onSuccess(CpsFlowExecution.java:1307)
at PluginClassLoader for workflow-cps//org.jenkinsci.plugins.workflow.cps.CpsFlowExecution$4$1.run(CpsFlowExecution.java:1060)
at PluginClassLoader for workflow-cps//org.jenkinsci.plugins.workflow.cps.CpsVmExecutorService.lambda$wrap$2(CpsVmExecutorService.java:81)
at java.base/java.util.concurrent.Executors$RunnableAdapter.call(Unknown Source)
at java.base/java.util.concurrent.FutureTask.run(Unknown Source)
at hudson.remoting.SingleLaneExecutorService$1.run(SingleLaneExecutorService.java:139)
at jenkins.util.ContextResettingExecutorService.lambda$wrap$0(ContextResettingExecutorService.java:26)
at jenkins.security.ImpersonatingExecutorService.lambda$wrap$0(ImpersonatingExecutorService.java:66)
at jenkins.util.ErrorLoggingExecutorService.lambda$wrap$0(ErrorLoggingExecutorService.java:51)
at java.base/java.util.concurrent.Executors$RunnableAdapter.call(Unknown Source)
at java.base/java.util.concurrent.FutureTask.run(Unknown Source)
at java.base/java.util.concurrent.ThreadPoolExecutor.runWorker(Unknown Source)
at java.base/java.util.concurrent.ThreadPoolExecutor$Worker.run(Unknown Source)
at PluginClassLoader for workflow-cps//org.jenkinsci.plugins.workflow.cps.CpsVmExecutorService$1.call(CpsVmExecutorService.java:53)
at PluginClassLoader for workflow-cps//org.jenkinsci.plugins.workflow.cps.CpsVmExecutorService$1.call(CpsVmExecutorService.java:50)
at org.codehaus.groovy.runtime.GroovyCategorySupport$ThreadCategoryInfo.use(GroovyCategorySupport.java:136)
at org.codehaus.groovy.runtime.GroovyCategorySupport.use(GroovyCategorySupport.java:275)
at PluginClassLoader for workflow-cps//org.jenkinsci.plugins.workflow.cps.CpsVmExecutorService.lambda$categoryThreadFactory$0(CpsVmExecutorService.java:50)
at java.base/java.lang.Thread.run(Unknown Source)
org.jenkinsci.plugins.workflow.actions.ErrorAction$ErrorId: 9bda65be-5a86-432a-a9a0-b48d1a415a69
Failed in branch 21 cross-build-omc-msvc
org.jenkinsci.plugins.workflow.actions.ErrorAction$ErrorId: a89cf837-3d3b-42de-bbca-c70cb53619f1
Triggering a new build of OpenModelica periodic tasks » Create source packages #7166
GitHub has been notified of this commit’s build result
Superseded by OpenModelica/master#7952
Finished: NOT_BUILT