Hudson logo

Failed

simulation_modelica_synchronous.boolSubClocks.mos (from (result.xml))

Failing for the past 1,335 builds (Since #1611 )

Stacktrace

Output mismatch (see stdout for details)

Standard Output

 + boolSubClocks                                                                     ... equation mismatch [time: 18]

==== Log /tmp/omc-rtest-hudson/simulation/modelica/synchronous/boolSubClocks.mos_temp6166/log-boolSubClocks.mos
true
""
true
true
""
record SimulationResult
    resultFile = "",
    simulationOptions = "startTime = 0.0, stopTime = 5.0, numberOfIntervals = 500, tolerance = 1e-06, method = 'dassl', fileNamePrefix = 'boolSubClocks', options = '', outputFormat = 'mat', variableFilter = '.*', cflags = '', simflags = ''",
    messages = "Failed to build model: boolSubClocks"
end SimulationResult;
"Warning: The initial conditions are not fully specified. For more information set -d=initialization. In OMEdit Tools->Options->Simulation->OMCFlags, in OMNotebook call setCommandLineOptions("-d=initialization").
Error: Error building simulator. Build log: g++-4.8 -fopenmp  -Winvalid-pch -O0 -g -DNDEBUG -fPIC   -std=c++11 -DBOOST_ALL_DYN_LINK   -DUSE_DGESV -DUSE_LOGGER -DOMC_BUILD -DUSE_THREAD -DSUNDIALS_MAJOR_VERSION=2 -DSUNDIALS_MINOR_VERSION=5 -DPMC_USE_SUNDIALS -I"." -I"/var/lib/hudson/slave/workspace/OpenModelica_BUILD_GCC_4.8/OpenModelica/build/include/omc/cpp/" -I.  -I"." -I"." -I"."     -DMEASURETIME_PROFILEBLOCKS -DUSE_LOGGER  -c -o OMCppboolSubClocksCalcHelperMain.o OMCppboolSubClocksCalcHelperMain.cpp
g++-4.8 -fopenmp -shared -o OMCppboolSubClocks.so OMCppboolSubClocksCalcHelperMain.o -L"/var/lib/hudson/slave/workspace/OpenModelica_BUILD_GCC_4.8/OpenModelica/testsuite/simulation/modelica/synchronous"   -lOMCppSystem -lOMCppModelicaUtilities -lOMCppDataExchange -lOMCppMath -lOMCppExtensionUtilities -lOMCppOMCFactory -L"/var/lib/hudson/slave/workspace/OpenModelica_BUILD_GCC_4.8/OpenModelica/build/lib/x86_64-linux-gnu/omc/cpp"    -Wl,-rpath,"/var/lib/hudson/slave/workspace/OpenModelica_BUILD_GCC_4.8/OpenModelica/build/lib/x86_64-linux-gnu/omc/cpp"  -L"." -lboost_filesystem -lboost_system -lboost_serialization -lboost_program_options -ldl -L/usr/lib -llapack -lblas 
g++-4.8 -fopenmp -Winvalid-pch -O0 -g -DNDEBUG -fPIC   -std=c++11 -DBOOST_ALL_DYN_LINK   -DUSE_DGESV -DUSE_LOGGER -DOMC_BUILD -DUSE_THREAD -DSUNDIALS_MAJOR_VERSION=2 -DSUNDIALS_MINOR_VERSION=5 -DPMC_USE_SUNDIALS -I"." -I"/var/lib/hudson/slave/workspace/OpenModelica_BUILD_GCC_4.8/OpenModelica/build/include/omc/cpp/" -I.  -I"." -I"." -I"."     -DMEASURETIME_PROFILEBLOCKS -DUSE_LOGGER -I. -o boolSubClocks OMCppboolSubClocksMain.cpp -lOMCppOMCFactory -lOMCppModelicaUtilities -lOMCppExtensionUtilities -L"/var/lib/hudson/slave/workspace/OpenModelica_BUILD_GCC_4.8/OpenModelica/build/lib/x86_64-linux-gnu/omc/cpp" -L"/var/lib/hudson/slave/workspace/OpenModelica_BUILD_GCC_4.8/OpenModelica/build/bin" -L"." -lboost_filesystem -lboost_system -lboost_serialization -lboost_program_options -ldl   -Wl,-rpath,"/var/lib/hudson/slave/workspace/OpenModelica_BUILD_GCC_4.8/OpenModelica/build/lib/x86_64-linux-gnu/omc/cpp" 
/var/lib/hudson/slave/workspace/OpenModelica_BUILD_GCC_4.8/OpenModelica/build/lib/x86_64-linux-gnu/omc/cpp/libOMCppOMCFactory.a(OMCFactory.cpp.o): In function `OMCFactory::readSimulationParameter(int, char const**)':
/var/lib/hudson/slave/workspace/OpenModelica_BUILD_GCC_4.8/OpenModelica/OMCompiler/SimulationRuntime/cpp/SimCoreFactory/OMCFactory/OMCFactory.cpp:305: undefined reference to `boost::program_options::options_description::options_description(std::string const&, unsigned int, unsigned int)'
/var/lib/hudson/slave/workspace/OpenModelica_BUILD_GCC_4.8/OpenModelica/OMCompiler/SimulationRuntime/cpp/SimCoreFactory/OMCFactory/OMCFactory.cpp:338: undefined reference to `boost::program_options::options_description::options_description(std::string const&, unsigned int, unsigned int)'
/var/lib/hudson/slave/workspace/OpenModelica_BUILD_GCC_4.8/OpenModelica/OMCompiler/SimulationRuntime/cpp/SimCoreFactory/OMCFactory/OMCFactory.cpp:345: undefined reference to `boost::program_options::options_description::options_description(std::string const&, unsigned int, unsigned int)'
/var/lib/hudson/slave/workspace/OpenModelica_BUILD_GCC_4.8/OpenModelica/build/lib/x86_64-linux-gnu/omc/cpp/libOMCppOMCFactory.a(OMCFactory.cpp.o): In function `boost::program_options::variables_map::operator[](std::string const&) const':
/var/lib/hudson/slave/workspace/OpenModelica_BUILD_GCC_4.8/OpenModelica/OMCompiler/SimulationRuntime/cpp/Build_dynamic/boost/program_options/variables_map.hpp:155: undefined reference to `boost::program_options::abstract_variables_map::operator[](std::string const&) const'
/var/lib/hudson/slave/workspace/OpenModelica_BUILD_GCC_4.8/OpenModelica/OMCompiler/SimulationRuntime/cpp/Build_dynamic/boost/program_options/variables_map.hpp:155: undefined reference to `boost::program_options::abstract_variables_map::operator[](std::string const&) const'
/var/lib/hudson/slave/workspace/OpenModelica_BUILD_GCC_4.8/OpenModelica/OMCompiler/SimulationRuntime/cpp/Build_dynamic/boost/program_options/variables_map.hpp:155: undefined reference to `boost::program_options::abstract_variables_map::operator[](std::string const&) const'
/var/lib/hudson/slave/workspace/OpenModelica_BUILD_GCC_4.8/OpenModelica/OMCompiler/SimulationRuntime/cpp/Build_dynamic/boost/program_options/variables_map.hpp:155: undefined reference to `boost::program_options::abstract_variables_map::operator[](std::string const&) const'
/var/lib/hudson/slave/workspace/OpenModelica_BUILD_GCC_4.8/OpenModelica/OMCompiler/SimulationRuntime/cpp/Build_dynamic/boost/program_options/variables_map.hpp:155: undefined reference to `boost::program_options::abstract_variables_map::operator[](std::string const&) const'
/var/lib/hudson/slave/workspace/OpenModelica_BUILD_GCC_4.8/OpenModelica/build/lib/x86_64-linux-gnu/omc/cpp/libOMCppOMCFactory.a(OMCFactory.cpp.o):/var/lib/hudson/slave/workspace/OpenModelica_BUILD_GCC_4.8/OpenModelica/OMCompiler/SimulationRuntime/cpp/Build_dynamic/boost/program_options/variables_map.hpp:155: more undefined references to `boost::program_options::abstract_variables_map::operator[](std::string const&) const' follow
/var/lib/hudson/slave/workspace/OpenModelica_BUILD_GCC_4.8/OpenModelica/build/lib/x86_64-linux-gnu/omc/cpp/libOMCppOMCFactory.a(OMCFactory.cpp.o): In function `boost::program_options::typed_value<std::string, char>::xparse(boost::any&, std::vector<std::string, std::allocator<std::string> > const&) const':
/var/lib/hudson/slave/workspace/OpenModelica_BUILD_GCC_4.8/OpenModelica/OMCompiler/SimulationRuntime/cpp/Build_dynamic/boost/program_options/detail/value_semantic.hpp:167: undefined reference to `boost::program_options::validate(boost::any&, std::vector<std::string, std::allocator<std::string> > const&, std::string*, int)'
/var/lib/hudson/slave/workspace/OpenModelica_BUILD_GCC_4.8/OpenModelica/build/lib/x86_64-linux-gnu/omc/cpp/libOMCppOMCFactory.a(OMCFactory.cpp.o): In function `boost::program_options::validation_error::validation_error(boost::program_options::validation_error::kind_t, std::string const&, std::string const&, int)':
/var/lib/hudson/slave/workspace/OpenModelica_BUILD_GCC_4.8/OpenModelica/OMCompiler/SimulationRuntime/cpp/Build_dynamic/boost/program_options/errors.hpp:373: undefined reference to `boost::program_options::validation_error::get_template(boost::program_options::validation_error::kind_t)'
/var/lib/hudson/slave/workspace/OpenModelica_BUILD_GCC_4.8/OpenModelica/OMCompiler/SimulationRuntime/cpp/Build_dynamic/boost/program_options/errors.hpp:373: undefined reference to `boost::program_options::error_with_option_name::error_with_option_name(std::string const&, std::string const&, std::string const&, int)'
/var/lib/hudson/slave/workspace/OpenModelica_BUILD_GCC_4.8/OpenModelica/build/lib/x86_64-linux-gnu/omc/cpp/libOMCppOMCFactory.a(OMCFactory.cpp.o): In function `boost::program_options::typed_value<unsigned int, char>::name() const':
/var/lib/hudson/slave/workspace/OpenModelica_BUILD_GCC_4.8/OpenModelica/OMCompiler/SimulationRuntime/cpp/Build_dynamic/boost/program_options/detail/value_semantic.hpp:19: undefined reference to `boost::program_options::arg'
/var/lib/hudson/slave/workspace/OpenModelica_BUILD_GCC_4.8/OpenModelica/build/lib/x86_64-linux-gnu/omc/cpp/libOMCppOMCFactory.a(OMCFactory.cpp.o): In function `boost::program_options::typed_value<int, char>::name() const':
/var/lib/hudson/slave/workspace/OpenModelica_BUILD_GCC_4.8/OpenModelica/OMCompiler/SimulationRuntime/cpp/Build_dynamic/boost/program_options/detail/value_semantic.hpp:19: undefined reference to `boost::program_options::arg'
/var/lib/hudson/slave/workspace/OpenModelica_BUILD_GCC_4.8/OpenModelica/build/lib/x86_64-linux-gnu/omc/cpp/libOMCppOMCFactory.a(OMCFactory.cpp.o): In function `boost::program_options::typed_value<double, char>::name() const':
/var/lib/hudson/slave/workspace/OpenModelica_BUILD_GCC_4.8/OpenModelica/OMCompiler/SimulationRuntime/cpp/Build_dynamic/boost/program_options/detail/value_semantic.hpp:19: undefined reference to `boost::program_options::arg'
/var/lib/hudson/slave/workspace/OpenModelica_BUILD_GCC_4.8/OpenModelica/build/lib/x86_64-linux-gnu/omc/cpp/libOMCppOMCFactory.a(OMCFactory.cpp.o): In function `boost::program_options::typed_value<std::vector<std::string, std::allocator<std::string> >, char>::name() const':
/var/lib/hudson/slave/workspace/OpenModelica_BUILD_GCC_4.8/OpenModelica/OMCompiler/SimulationRuntime/cpp/Build_dynamic/boost/program_options/detail/value_semantic.hpp:19: undefined reference to `boost::program_options::arg'
/var/lib/hudson/slave/workspace/OpenModelica_BUILD_GCC_4.8/OpenModelica/build/lib/x86_64-linux-gnu/omc/cpp/libOMCppOMCFactory.a(OMCFactory.cpp.o): In function `boost::program_options::typed_value<std::string, char>::name() const':
/var/lib/hudson/slave/workspace/OpenModelica_BUILD_GCC_4.8/OpenModelica/OMCompiler/SimulationRuntime/cpp/Build_dynamic/boost/program_options/detail/value_semantic.hpp:19: undefined reference to `boost::program_options::arg'
/var/lib/hudson/slave/workspace/OpenModelica_BUILD_GCC_4.8/OpenModelica/build/lib/x86_64-linux-gnu/omc/cpp/libOMCppOMCFactory.a(OMCFactory.cpp.o): In function `boost::program_options::basic_command_line_parser<char>::extra_parser(boost::function1<std::pair<std::string, std::string>, std::string const&>)':
/var/lib/hudson/slave/workspace/OpenModelica_BUILD_GCC_4.8/OpenModelica/OMCompiler/SimulationRuntime/cpp/Build_dynamic/boost/program_options/detail/parsers.hpp:77: undefined reference to `boost::program_options::detail::cmdline::set_additional_parser(boost::function1<std::pair<std::string, std::string>, std::string const&>)'
/var/lib/hudson/slave/workspace/OpenModelica_BUILD_GCC_4.8/OpenModelica/build/lib/x86_64-linux-gnu/omc/cpp/libOMCppOMCFactory.a(OMCFactory.cpp.o): In function `to_internal<std::basic_string<char> >':
/var/lib/hudson/slave/workspace/OpenModelica_BUILD_GCC_4.8/OpenModelica/OMCompiler/SimulationRuntime/cpp/Build_dynamic/boost/program_options/detail/convert.hpp:79: undefined reference to `boost::program_options::to_internal(std::string const&)'
/var/lib/hudson/slave/workspace/OpenModelica_BUILD_GCC_4.8/OpenModelica/build/lib/x86_64-linux-gnu/omc/cpp/libOMCppOMCFactory.a(OMCFactory.cpp.o): In function `boost::program_options::basic_command_line_parser<char>::basic_command_line_parser(int, char const* const*)':
/var/lib/hudson/slave/workspace/OpenModelica_BUILD_GCC_4.8/OpenModelica/OMCompiler/SimulationRuntime/cpp/Build_dynamic/boost/program_options/detail/parsers.hpp:43: undefined reference to `boost::program_options::detail::cmdline::cmdline(std::vector<std::string, std::allocator<std::string> > const&)'
/var/lib/hudson/slave/workspace/OpenModelica_BUILD_GCC_4.8/OpenModelica/build/lib/x86_64-linux-gnu/omc/cpp/libOMCppOMCFactory.a(OMCFactory.cpp.o): In function `void boost::program_options::validate<unsigned int, char>(boost::any&, std::vector<std::basic_string<char, std::char_traits<char>, std::allocator<char> >, std::allocator<std::basic_string<char, std::char_traits<char>, std::allocator<char> > > > const&, unsigned int*, long)':
/var/lib/hudson/slave/workspace/OpenModelica_BUILD_GCC_4.8/OpenModelica/OMCompiler/SimulationRuntime/cpp/Build_dynamic/boost/program_options/detail/value_semantic.hpp:92: undefined reference to `boost::program_options::invalid_option_value::invalid_option_value(std::string const&)'
/var/lib/hudson/slave/workspace/OpenModelica_BUILD_GCC_4.8/OpenModelica/build/lib/x86_64-linux-gnu/omc/cpp/libOMCppOMCFactory.a(OMCFactory.cpp.o): In function `void boost::program_options::validate<int, char>(boost::any&, std::vector<std::basic_string<char, std::char_traits<char>, std::allocator<char> >, std::allocator<std::basic_string<char, std::char_traits<char>, std::allocator<char> > > > const&, int*, long)':
/var/lib/hudson/slave/workspace/OpenModelica_BUILD_GCC_4.8/OpenModelica/OMCompiler/SimulationRuntime/cpp/Build_dynamic/boost/program_options/detail/value_semantic.hpp:92: undefined reference to `boost::program_options::invalid_option_value::invalid_option_value(std::string const&)'
/var/lib/hudson/slave/workspace/OpenModelica_BUILD_GCC_4.8/OpenModelica/build/lib/x86_64-linux-gnu/omc/cpp/libOMCppOMCFactory.a(OMCFactory.cpp.o): In function `void boost::program_options::validate<std::string, char>(boost::any&, std::vector<std::basic_string<char, std::char_traits<char>, std::allocator<char> >, std::allocator<std::basic_string<char, std::char_traits<char>, std::allocator<char> > > > const&, std::vector<std::string, std::allocator<std::string> >*, int)':
/var/lib/hudson/slave/workspace/OpenModelica_BUILD_GCC_4.8/OpenModelica/OMCompiler/SimulationRuntime/cpp/Build_dynamic/boost/program_options/detail/value_semantic.hpp:146: undefined reference to `boost::program_options::validate(boost::any&, std::vector<std::string, std::allocator<std::string> > const&, std::string*, int)'
/var/lib/hudson/slave/workspace/OpenModelica_BUILD_GCC_4.8/OpenModelica/OMCompiler/SimulationRuntime/cpp/Build_dynamic/boost/program_options/detail/value_semantic.hpp:150: undefined reference to `boost::program_options::invalid_option_value::invalid_option_value(std::string const&)'
/var/lib/hudson/slave/workspace/OpenModelica_BUILD_GCC_4.8/OpenModelica/build/lib/x86_64-linux-gnu/omc/cpp/libOMCppOMCFactory.a(OMCFactory.cpp.o): In function `void boost::program_options::validate<double, char>(boost::any&, std::vector<std::basic_string<char, std::char_traits<char>, std::allocator<char> >, std::allocator<std::basic_string<char, std::char_traits<char>, std::allocator<char> > > > const&, double*, long)':
/var/lib/hudson/slave/workspace/OpenModelica_BUILD_GCC_4.8/OpenModelica/OMCompiler/SimulationRuntime/cpp/Build_dynamic/boost/program_options/detail/value_semantic.hpp:92: undefined reference to `boost::program_options::invalid_option_value::invalid_option_value(std::string const&)'
/var/lib/hudson/slave/workspace/OpenModelica_BUILD_GCC_4.8/OpenModelica/build/lib/x86_64-linux-gnu/omc/cpp/libOMCppOMCFactory.a(OMCFactory.cpp.o):(.data.rel.ro._ZTVN5boost16exception_detail19error_info_injectorINS_15program_options20invalid_option_valueEEE[_ZTVN5boost16exception_detail19error_info_injectorINS_15program_options20invalid_option_valueEEE]+0x30): undefined reference to `boost::program_options::error_with_option_name::substitute_placeholders(std::string const&) const'
/var/lib/hudson/slave/workspace/OpenModelica_BUILD_GCC_4.8/OpenModelica/build/lib/x86_64-linux-gnu/omc/cpp/libOMCppOMCFactory.a(OMCFactory.cpp.o):(.data.rel.ro._ZTVN5boost16exception_detail10clone_implINS0_19error_info_injectorINS_15program_options20invalid_option_valueEEEEE[_ZTVN5boost16exception_detail10clone_implINS0_19error_info_injectorINS_15program_options20invalid_option_valueEEEEE]+0x38): undefined reference to `boost::program_options::error_with_option_name::substitute_placeholders(std::string const&) const'
/var/lib/hudson/slave/workspace/OpenModelica_BUILD_GCC_4.8/OpenModelica/build/lib/x86_64-linux-gnu/omc/cpp/libOMCppOMCFactory.a(OMCFactory.cpp.o):(.data.rel.ro._ZTVN5boost16exception_detail19error_info_injectorINS_15program_options16validation_errorEEE[_ZTVN5boost16exception_detail19error_info_injectorINS_15program_options16validation_errorEEE]+0x30): undefined reference to `boost::program_options::error_with_option_name::substitute_placeholders(std::string const&) const'
/var/lib/hudson/slave/workspace/OpenModelica_BUILD_GCC_4.8/OpenModelica/build/lib/x86_64-linux-gnu/omc/cpp/libOMCppOMCFactory.a(OMCFactory.cpp.o):(.data.rel.ro._ZTVN5boost16exception_detail10clone_implINS0_19error_info_injectorINS_15program_options16validation_errorEEEEE[_ZTVN5boost16exception_detail10clone_implINS0_19error_info_injectorINS_15program_options16validation_errorEEEEE]+0x38): undefined reference to `boost::program_options::error_with_option_name::substitute_placeholders(std::string const&) const'
/var/lib/hudson/slave/workspace/OpenModelica_BUILD_GCC_4.8/OpenModelica/build/lib/x86_64-linux-gnu/omc/cpp/libOMCppOMCFactory.a(OMCFactory.cpp.o):(.data.rel.ro._ZTVN5boost15program_options16validation_errorE[_ZTVN5boost15program_options16validation_errorE]+0x30): undefined reference to `boost::program_options::error_with_option_name::substitute_placeholders(std::string const&) const'
/var/lib/hudson/slave/workspace/OpenModelica_BUILD_GCC_4.8/OpenModelica/build/lib/x86_64-linux-gnu/omc/cpp/libOMCppOMCFactory.a(OMCFactory.cpp.o):(.data.rel.ro._ZTVN5boost15program_options20invalid_option_valueE[_ZTVN5boost15program_options20invalid_option_valueE]+0x30): more undefined references to `boost::program_options::error_with_option_name::substitute_placeholders(std::string const&) const' follow
/var/lib/hudson/slave/workspace/OpenModelica_BUILD_GCC_4.8/OpenModelica/build/lib/x86_64-linux-gnu/omc/cpp/libOMCppOMCFactory.a(OMCFactory.cpp.o):(.data.rel.ro._ZTVN5boost15program_options11typed_valueISscEE[_ZTVN5boost15program_options11typed_valueISscEE]+0x38): undefined reference to `boost::program_options::value_semantic_codecvt_helper<char>::parse(boost::any&, std::vector<std::string, std::allocator<std::string> > const&, bool) const'
/var/lib/hudson/slave/workspace/OpenModelica_BUILD_GCC_4.8/OpenModelica/build/lib/x86_64-linux-gnu/omc/cpp/libOMCppOMCFactory.a(OMCFactory.cpp.o):(.data.rel.ro._ZTVN5boost15program_options11typed_valueISt6vectorISsSaISsEEcEE[_ZTVN5boost15program_options11typed_valueISt6vectorISsSaISsEEcEE]+0x38): undefined reference to `boost::program_options::value_semantic_codecvt_helper<char>::parse(boost::any&, std::vector<std::string, std::allocator<std::string> > const&, bool) const'
/var/lib/hudson/slave/workspace/OpenModelica_BUILD_GCC_4.8/OpenModelica/build/lib/x86_64-linux-gnu/omc/cpp/libOMCppOMCFactory.a(OMCFactory.cpp.o):(.data.rel.ro._ZTVN5boost15program_options11typed_valueIdcEE[_ZTVN5boost15program_options11typed_valueIdcEE]+0x38): undefined reference to `boost::program_options::value_semantic_codecvt_helper<char>::parse(boost::any&, std::vector<std::string, std::allocator<std::string> > const&, bool) const'
/var/lib/hudson/slave/workspace/OpenModelica_BUILD_GCC_4.8/OpenModelica/build/lib/x86_64-linux-gnu/omc/cpp/libOMCppOMCFactory.a(OMCFactory.cpp.o):(.data.rel.ro._ZTVN5boost15program_options11typed_valueIicEE[_ZTVN5boost15program_options11typed_valueIicEE]+0x38): undefined reference to `boost::program_options::value_semantic_codecvt_helper<char>::parse(boost::any&, std::vector<std::string, std::allocator<std::string> > const&, bool) const'
/var/lib/hudson/slave/workspace/OpenModelica_BUILD_GCC_4.8/OpenModelica/build/lib/x86_64-linux-gnu/omc/cpp/libOMCppOMCFactory.a(OMCFactory.cpp.o):(.data.rel.ro._ZTVN5boost15program_options11typed_valueIjcEE[_ZTVN5boost15program_options11typed_valueIjcEE]+0x38): undefined reference to `boost::program_options::value_semantic_codecvt_helper<char>::parse(boost::any&, std::vector<std::string, std::allocator<std::string> > const&, bool) const'
collect2: error: ld returned 1 exit status
boolSubClocks.makefile:77: recipe for target 'boolSubClocks' failed
make: *** [boolSubClocks] Error 1
"














Equation mismatch: diff says:
--- /tmp/omc-rtest-hudson/simulation/modelica/synchronous/boolSubClocks.mos_temp6166/equations-expected2019-04-19 22:26:52.584228985 +0200
+++ /tmp/omc-rtest-hudson/simulation/modelica/synchronous/boolSubClocks.mos_temp6166/equations-got2019-04-19 22:27:10.152071282 +0200
@@ -2,24 +2,82 @@
 ""
 true
 true
 ""
 record SimulationResult
-resultFile = "boolSubClocks_res.mat",
-simulationOptions = "startTime = 0.0, stopTime = 5.0, numberOfIntervals = 500, tolerance = 1e-006, method = 'dassl', fileNamePrefix = 'boolSubClocks', options = '', outputFormat = 'mat', variableFilter = '.*', cflags = '', simflags = ''",
-messages = ""
+resultFile = "",
+simulationOptions = "startTime = 0.0, stopTime = 5.0, numberOfIntervals = 500, tolerance = 1e-06, method = 'dassl', fileNamePrefix = 'boolSubClocks', options = '', outputFormat = 'mat', variableFilter = '.*', cflags = '', simflags = ''",
+messages = "Failed to build model: boolSubClocks"
 end SimulationResult;
 "Warning: The initial conditions are not fully specified. For more information set -d=initialization. In OMEdit Tools->Options->Simulation->OMCFlags, in OMNotebook call setCommandLineOptions("-d=initialization").
+Error: Error building simulator. Build log: g++-4.8 -fopenmp  -Winvalid-pch -O0 -g -DNDEBUG -fPIC   -std=c++11 -DBOOST_ALL_DYN_LINK   -DUSE_DGESV -DUSE_LOGGER -DOMC_BUILD -DUSE_THREAD -DSUNDIALS_MAJOR_VERSION=2 -DSUNDIALS_MINOR_VERSION=5 -DPMC_USE_SUNDIALS -I"." -I"/var/lib/hudson/slave/workspace/OpenModelica_BUILD_GCC_4.8/OpenModelica/build/include/omc/cpp/" -I.  -I"." -I"." -I"."     -DMEASURETIME_PROFILEBLOCKS -DUSE_LOGGER  -c -o OMCppboolSubClocksCalcHelperMain.o OMCppboolSubClocksCalcHelperMain.cpp
+g++-4.8 -fopenmp -shared -o OMCppboolSubClocks.so OMCppboolSubClocksCalcHelperMain.o -L"/var/lib/hudson/slave/workspace/OpenModelica_BUILD_GCC_4.8/OpenModelica/testsuite/simulation/modelica/synchronous"   -lOMCppSystem -lOMCppModelicaUtilities -lOMCppDataExchange -lOMCppMath -lOMCppExtensionUtilities -lOMCppOMCFactory -L"/var/lib/hudson/slave/workspace/OpenModelica_BUILD_GCC_4.8/OpenModelica/build/lib/x86_64-linux-gnu/omc/cpp"    -Wl,-rpath,"/var/lib/hudson/slave/workspace/OpenModelica_BUILD_GCC_4.8/OpenModelica/build/lib/x86_64-linux-gnu/omc/cpp"  -L"." -lboost_filesystem -lboost_system -lboost_serialization -lboost_program_options -ldl -L/usr/lib -llapack -lblas 
+g++-4.8 -fopenmp -Winvalid-pch -O0 -g -DNDEBUG -fPIC   -std=c++11 -DBOOST_ALL_DYN_LINK   -DUSE_DGESV -DUSE_LOGGER -DOMC_BUILD -DUSE_THREAD -DSUNDIALS_MAJOR_VERSION=2 -DSUNDIALS_MINOR_VERSION=5 -DPMC_USE_SUNDIALS -I"." -I"/var/lib/hudson/slave/workspace/OpenModelica_BUILD_GCC_4.8/OpenModelica/build/include/omc/cpp/" -I.  -I"." -I"." -I"."     -DMEASURETIME_PROFILEBLOCKS -DUSE_LOGGER -I. -o boolSubClocks OMCppboolSubClocksMain.cpp -lOMCppOMCFactory -lOMCppModelicaUtilities -lOMCppExtensionUtilities -L"/var/lib/hudson/slave/workspace/OpenModelica_BUILD_GCC_4.8/OpenModelica/build/lib/x86_64-linux-gnu/omc/cpp" -L"/var/lib/hudson/slave/workspace/OpenModelica_BUILD_GCC_4.8/OpenModelica/build/bin" -L"." -lboost_filesystem -lboost_system -lboost_serialization -lboost_program_options -ldl   -Wl,-rpath,"/var/lib/hudson/slave/workspace/OpenModelica_BUILD_GCC_4.8/OpenModelica/build/lib/x86_64-linux-gnu/omc/cpp" 
+/var/lib/hudson/slave/workspace/OpenModelica_BUILD_GCC_4.8/OpenModelica/build/lib/x86_64-linux-gnu/omc/cpp/libOMCppOMCFactory.a(OMCFactory.cpp.o): In function `OMCFactory::readSimulationParameter(int, char const**)':
+/var/lib/hudson/slave/workspace/OpenModelica_BUILD_GCC_4.8/OpenModelica/OMCompiler/SimulationRuntime/cpp/SimCoreFactory/OMCFactory/OMCFactory.cpp:305: undefined reference to `boost::program_options::options_description::options_description(std::string const&, unsigned int, unsigned int)'
+/var/lib/hudson/slave/workspace/OpenModelica_BUILD_GCC_4.8/OpenModelica/OMCompiler/SimulationRuntime/cpp/SimCoreFactory/OMCFactory/OMCFactory.cpp:338: undefined reference to `boost::program_options::options_description::options_description(std::string const&, unsigned int, unsigned int)'
+/var/lib/hudson/slave/workspace/OpenModelica_BUILD_GCC_4.8/OpenModelica/OMCompiler/SimulationRuntime/cpp/SimCoreFactory/OMCFactory/OMCFactory.cpp:345: undefined reference to `boost::program_options::options_description::options_description(std::string const&, unsigned int, unsigned int)'
+/var/lib/hudson/slave/workspace/OpenModelica_BUILD_GCC_4.8/OpenModelica/build/lib/x86_64-linux-gnu/omc/cpp/libOMCppOMCFactory.a(OMCFactory.cpp.o): In function `boost::program_options::variables_map::operator[](std::string const&) const':
+/var/lib/hudson/slave/workspace/OpenModelica_BUILD_GCC_4.8/OpenModelica/OMCompiler/SimulationRuntime/cpp/Build_dynamic/boost/program_options/variables_map.hpp:155: undefined reference to `boost::program_options::abstract_variables_map::operator[](std::string const&) const'
+/var/lib/hudson/slave/workspace/OpenModelica_BUILD_GCC_4.8/OpenModelica/OMCompiler/SimulationRuntime/cpp/Build_dynamic/boost/program_options/variables_map.hpp:155: undefined reference to `boost::program_options::abstract_variables_map::operator[](std::string const&) const'
+/var/lib/hudson/slave/workspace/OpenModelica_BUILD_GCC_4.8/OpenModelica/OMCompiler/SimulationRuntime/cpp/Build_dynamic/boost/program_options/variables_map.hpp:155: undefined reference to `boost::program_options::abstract_variables_map::operator[](std::string const&) const'
+/var/lib/hudson/slave/workspace/OpenModelica_BUILD_GCC_4.8/OpenModelica/OMCompiler/SimulationRuntime/cpp/Build_dynamic/boost/program_options/variables_map.hpp:155: undefined reference to `boost::program_options::abstract_variables_map::operator[](std::string const&) const'
+/var/lib/hudson/slave/workspace/OpenModelica_BUILD_GCC_4.8/OpenModelica/OMCompiler/SimulationRuntime/cpp/Build_dynamic/boost/program_options/variables_map.hpp:155: undefined reference to `boost::program_options::abstract_variables_map::operator[](std::string const&) const'
+/var/lib/hudson/slave/workspace/OpenModelica_BUILD_GCC_4.8/OpenModelica/build/lib/x86_64-linux-gnu/omc/cpp/libOMCppOMCFactory.a(OMCFactory.cpp.o):/var/lib/hudson/slave/workspace/OpenModelica_BUILD_GCC_4.8/OpenModelica/OMCompiler/SimulationRuntime/cpp/Build_dynamic/boost/program_options/variables_map.hpp:155: more undefined references to `boost::program_options::abstract_variables_map::operator[](std::string const&) const' follow
+/var/lib/hudson/slave/workspace/OpenModelica_BUILD_GCC_4.8/OpenModelica/build/lib/x86_64-linux-gnu/omc/cpp/libOMCppOMCFactory.a(OMCFactory.cpp.o): In function `boost::program_options::typed_value<std::string, char>::xparse(boost::any&, std::vector<std::string, std::allocator<std::string> > const&) const':
+/var/lib/hudson/slave/workspace/OpenModelica_BUILD_GCC_4.8/OpenModelica/OMCompiler/SimulationRuntime/cpp/Build_dynamic/boost/program_options/detail/value_semantic.hpp:167: undefined reference to `boost::program_options::validate(boost::any&, std::vector<std::string, std::allocator<std::string> > const&, std::string*, int)'
+/var/lib/hudson/slave/workspace/OpenModelica_BUILD_GCC_4.8/OpenModelica/build/lib/x86_64-linux-gnu/omc/cpp/libOMCppOMCFactory.a(OMCFactory.cpp.o): In function `boost::program_options::validation_error::validation_error(boost::program_options::validation_error::kind_t, std::string const&, std::string const&, int)':
+/var/lib/hudson/slave/workspace/OpenModelica_BUILD_GCC_4.8/OpenModelica/OMCompiler/SimulationRuntime/cpp/Build_dynamic/boost/program_options/errors.hpp:373: undefined reference to `boost::program_options::validation_error::get_template(boost::program_options::validation_error::kind_t)'
+/var/lib/hudson/slave/workspace/OpenModelica_BUILD_GCC_4.8/OpenModelica/OMCompiler/SimulationRuntime/cpp/Build_dynamic/boost/program_options/errors.hpp:373: undefined reference to `boost::program_options::error_with_option_name::error_with_option_name(std::string const&, std::string const&, std::string const&, int)'
+/var/lib/hudson/slave/workspace/OpenModelica_BUILD_GCC_4.8/OpenModelica/build/lib/x86_64-linux-gnu/omc/cpp/libOMCppOMCFactory.a(OMCFactory.cpp.o): In function `boost::program_options::typed_value<unsigned int, char>::name() const':
+/var/lib/hudson/slave/workspace/OpenModelica_BUILD_GCC_4.8/OpenModelica/OMCompiler/SimulationRuntime/cpp/Build_dynamic/boost/program_options/detail/value_semantic.hpp:19: undefined reference to `boost::program_options::arg'
+/var/lib/hudson/slave/workspace/OpenModelica_BUILD_GCC_4.8/OpenModelica/build/lib/x86_64-linux-gnu/omc/cpp/libOMCppOMCFactory.a(OMCFactory.cpp.o): In function `boost::program_options::typed_value<int, char>::name() const':
+/var/lib/hudson/slave/workspace/OpenModelica_BUILD_GCC_4.8/OpenModelica/OMCompiler/SimulationRuntime/cpp/Build_dynamic/boost/program_options/detail/value_semantic.hpp:19: undefined reference to `boost::program_options::arg'
+/var/lib/hudson/slave/workspace/OpenModelica_BUILD_GCC_4.8/OpenModelica/build/lib/x86_64-linux-gnu/omc/cpp/libOMCppOMCFactory.a(OMCFactory.cpp.o): In function `boost::program_options::typed_value<double, char>::name() const':
+/var/lib/hudson/slave/workspace/OpenModelica_BUILD_GCC_4.8/OpenModelica/OMCompiler/SimulationRuntime/cpp/Build_dynamic/boost/program_options/detail/value_semantic.hpp:19: undefined reference to `boost::program_options::arg'
+/var/lib/hudson/slave/workspace/OpenModelica_BUILD_GCC_4.8/OpenModelica/build/lib/x86_64-linux-gnu/omc/cpp/libOMCppOMCFactory.a(OMCFactory.cpp.o): In function `boost::program_options::typed_value<std::vector<std::string, std::allocator<std::string> >, char>::name() const':
+/var/lib/hudson/slave/workspace/OpenModelica_BUILD_GCC_4.8/OpenModelica/OMCompiler/SimulationRuntime/cpp/Build_dynamic/boost/program_options/detail/value_semantic.hpp:19: undefined reference to `boost::program_options::arg'
+/var/lib/hudson/slave/workspace/OpenModelica_BUILD_GCC_4.8/OpenModelica/build/lib/x86_64-linux-gnu/omc/cpp/libOMCppOMCFactory.a(OMCFactory.cpp.o): In function `boost::program_options::typed_value<std::string, char>::name() const':
+/var/lib/hudson/slave/workspace/OpenModelica_BUILD_GCC_4.8/OpenModelica/OMCompiler/SimulationRuntime/cpp/Build_dynamic/boost/program_options/detail/value_semantic.hpp:19: undefined reference to `boost::program_options::arg'
+/var/lib/hudson/slave/workspace/OpenModelica_BUILD_GCC_4.8/OpenModelica/build/lib/x86_64-linux-gnu/omc/cpp/libOMCppOMCFactory.a(OMCFactory.cpp.o): In function `boost::program_options::basic_command_line_parser<char>::extra_parser(boost::function1<std::pair<std::string, std::string>, std::string const&>)':
+/var/lib/hudson/slave/workspace/OpenModelica_BUILD_GCC_4.8/OpenModelica/OMCompiler/SimulationRuntime/cpp/Build_dynamic/boost/program_options/detail/parsers.hpp:77: undefined reference to `boost::program_options::detail::cmdline::set_additional_parser(boost::function1<std::pair<std::string, std::string>, std::string const&>)'
+/var/lib/hudson/slave/workspace/OpenModelica_BUILD_GCC_4.8/OpenModelica/build/lib/x86_64-linux-gnu/omc/cpp/libOMCppOMCFactory.a(OMCFactory.cpp.o): In function `to_internal<std::basic_string<char> >':
+/var/lib/hudson/slave/workspace/OpenModelica_BUILD_GCC_4.8/OpenModelica/OMCompiler/SimulationRuntime/cpp/Build_dynamic/boost/program_options/detail/convert.hpp:79: undefined reference to `boost::program_options::to_internal(std::string const&)'
+/var/lib/hudson/slave/workspace/OpenModelica_BUILD_GCC_4.8/OpenModelica/build/lib/x86_64-linux-gnu/omc/cpp/libOMCppOMCFactory.a(OMCFactory.cpp.o): In function `boost::program_options::basic_command_line_parser<char>::basic_command_line_parser(int, char const* const*)':
+/var/lib/hudson/slave/workspace/OpenModelica_BUILD_GCC_4.8/OpenModelica/OMCompiler/SimulationRuntime/cpp/Build_dynamic/boost/program_options/detail/parsers.hpp:43: undefined reference to `boost::program_options::detail::cmdline::cmdline(std::vector<std::string, std::allocator<std::string> > const&)'
+/var/lib/hudson/slave/workspace/OpenModelica_BUILD_GCC_4.8/OpenModelica/build/lib/x86_64-linux-gnu/omc/cpp/libOMCppOMCFactory.a(OMCFactory.cpp.o): In function `void boost::program_options::validate<unsigned int, char>(boost::any&, std::vector<std::basic_string<char, std::char_traits<char>, std::allocator<char> >, std::allocator<std::basic_string<char, std::char_traits<char>, std::allocator<char> > > > const&, unsigned int*, long)':
+/var/lib/hudson/slave/workspace/OpenModelica_BUILD_GCC_4.8/OpenModelica/OMCompiler/SimulationRuntime/cpp/Build_dynamic/boost/program_options/detail/value_semantic.hpp:92: undefined reference to `boost::program_options::invalid_option_value::invalid_option_value(std::string const&)'
+/var/lib/hudson/slave/workspace/OpenModelica_BUILD_GCC_4.8/OpenModelica/build/lib/x86_64-linux-gnu/omc/cpp/libOMCppOMCFactory.a(OMCFactory.cpp.o): In function `void boost::program_options::validate<int, char>(boost::any&, std::vector<std::basic_string<char, std::char_traits<char>, std::allocator<char> >, std::allocator<std::basic_string<char, std::char_traits<char>, std::allocator<char> > > > const&, int*, long)':
+/var/lib/hudson/slave/workspace/OpenModelica_BUILD_GCC_4.8/OpenModelica/OMCompiler/SimulationRuntime/cpp/Build_dynamic/boost/program_options/detail/value_semantic.hpp:92: undefined reference to `boost::program_options::invalid_option_value::invalid_option_value(std::string const&)'
+/var/lib/hudson/slave/workspace/OpenModelica_BUILD_GCC_4.8/OpenModelica/build/lib/x86_64-linux-gnu/omc/cpp/libOMCppOMCFactory.a(OMCFactory.cpp.o): In function `void boost::program_options::validate<std::string, char>(boost::any&, std::vector<std::basic_string<char, std::char_traits<char>, std::allocator<char> >, std::allocator<std::basic_string<char, std::char_traits<char>, std::allocator<char> > > > const&, std::vector<std::string, std::allocator<std::string> >*, int)':
+/var/lib/hudson/slave/workspace/OpenModelica_BUILD_GCC_4.8/OpenModelica/OMCompiler/SimulationRuntime/cpp/Build_dynamic/boost/program_options/detail/value_semantic.hpp:146: undefined reference to `boost::program_options::validate(boost::any&, std::vector<std::string, std::allocator<std::string> > const&, std::string*, int)'
+/var/lib/hudson/slave/workspace/OpenModelica_BUILD_GCC_4.8/OpenModelica/OMCompiler/SimulationRuntime/cpp/Build_dynamic/boost/program_options/detail/value_semantic.hpp:150: undefined reference to `boost::program_options::invalid_option_value::invalid_option_value(std::string const&)'
+/var/lib/hudson/slave/workspace/OpenModelica_BUILD_GCC_4.8/OpenModelica/build/lib/x86_64-linux-gnu/omc/cpp/libOMCppOMCFactory.a(OMCFactory.cpp.o): In function `void boost::program_options::validate<double, char>(boost::any&, std::vector<std::basic_string<char, std::char_traits<char>, std::allocator<char> >, std::allocator<std::basic_string<char, std::char_traits<char>, std::allocator<char> > > > const&, double*, long)':
+/var/lib/hudson/slave/workspace/OpenModelica_BUILD_GCC_4.8/OpenModelica/OMCompiler/SimulationRuntime/cpp/Build_dynamic/boost/program_options/detail/value_semantic.hpp:92: undefined reference to `boost::program_options::invalid_option_value::invalid_option_value(std::string const&)'
+/var/lib/hudson/slave/workspace/OpenModelica_BUILD_GCC_4.8/OpenModelica/build/lib/x86_64-linux-gnu/omc/cpp/libOMCppOMCFactory.a(OMCFactory.cpp.o):(.data.rel.ro._ZTVN5boost16exception_detail19error_info_injectorINS_15program_options20invalid_option_valueEEE[_ZTVN5boost16exception_detail19error_info_injectorINS_15program_options20invalid_option_valueEEE]+0x30): undefined reference to `boost::program_options::error_with_option_name::substitute_placeholders(std::string const&) const'
+/var/lib/hudson/slave/workspace/OpenModelica_BUILD_GCC_4.8/OpenModelica/build/lib/x86_64-linux-gnu/omc/cpp/libOMCppOMCFactory.a(OMCFactory.cpp.o):(.data.rel.ro._ZTVN5boost16exception_detail10clone_implINS0_19error_info_injectorINS_15program_options20invalid_option_valueEEEEE[_ZTVN5boost16exception_detail10clone_implINS0_19error_info_injectorINS_15program_options20invalid_option_valueEEEEE]+0x38): undefined reference to `boost::program_options::error_with_option_name::substitute_placeholders(std::string const&) const'
+/var/lib/hudson/slave/workspace/OpenModelica_BUILD_GCC_4.8/OpenModelica/build/lib/x86_64-linux-gnu/omc/cpp/libOMCppOMCFactory.a(OMCFactory.cpp.o):(.data.rel.ro._ZTVN5boost16exception_detail19error_info_injectorINS_15program_options16validation_errorEEE[_ZTVN5boost16exception_detail19error_info_injectorINS_15program_options16validation_errorEEE]+0x30): undefined reference to `boost::program_options::error_with_option_name::substitute_placeholders(std::string const&) const'
+/var/lib/hudson/slave/workspace/OpenModelica_BUILD_GCC_4.8/OpenModelica/build/lib/x86_64-linux-gnu/omc/cpp/libOMCppOMCFactory.a(OMCFactory.cpp.o):(.data.rel.ro._ZTVN5boost16exception_detail10clone_implINS0_19error_info_injectorINS_15program_options16validation_errorEEEEE[_ZTVN5boost16exception_detail10clone_implINS0_19error_info_injectorINS_15program_options16validation_errorEEEEE]+0x38): undefined reference to `boost::program_options::error_with_option_name::substitute_placeholders(std::string const&) const'
+/var/lib/hudson/slave/workspace/OpenModelica_BUILD_GCC_4.8/OpenModelica/build/lib/x86_64-linux-gnu/omc/cpp/libOMCppOMCFactory.a(OMCFactory.cpp.o):(.data.rel.ro._ZTVN5boost15program_options16validation_errorE[_ZTVN5boost15program_options16validation_errorE]+0x30): undefined reference to `boost::program_options::error_with_option_name::substitute_placeholders(std::string const&) const'
+/var/lib/hudson/slave/workspace/OpenModelica_BUILD_GCC_4.8/OpenModelica/build/lib/x86_64-linux-gnu/omc/cpp/libOMCppOMCFactory.a(OMCFactory.cpp.o):(.data.rel.ro._ZTVN5boost15program_options20invalid_option_valueE[_ZTVN5boost15program_options20invalid_option_valueE]+0x30): more undefined references to `boost::program_options::error_with_option_name::substitute_placeholders(std::string const&) const' follow
+/var/lib/hudson/slave/workspace/OpenModelica_BUILD_GCC_4.8/OpenModelica/build/lib/x86_64-linux-gnu/omc/cpp/libOMCppOMCFactory.a(OMCFactory.cpp.o):(.data.rel.ro._ZTVN5boost15program_options11typed_valueISscEE[_ZTVN5boost15program_options11typed_valueISscEE]+0x38): undefined reference to `boost::program_options::value_semantic_codecvt_helper<char>::parse(boost::any&, std::vector<std::string, std::allocator<std::string> > const&, bool) const'
+/var/lib/hudson/slave/workspace/OpenModelica_BUILD_GCC_4.8/OpenModelica/build/lib/x86_64-linux-gnu/omc/cpp/libOMCppOMCFactory.a(OMCFactory.cpp.o):(.data.rel.ro._ZTVN5boost15program_options11typed_valueISt6vectorISsSaISsEEcEE[_ZTVN5boost15program_options11typed_valueISt6vectorISsSaISsEEcEE]+0x38): undefined reference to `boost::program_options::value_semantic_codecvt_helper<char>::parse(boost::any&, std::vector<std::string, std::allocator<std::string> > const&, bool) const'
+/var/lib/hudson/slave/workspace/OpenModelica_BUILD_GCC_4.8/OpenModelica/build/lib/x86_64-linux-gnu/omc/cpp/libOMCppOMCFactory.a(OMCFactory.cpp.o):(.data.rel.ro._ZTVN5boost15program_options11typed_valueIdcEE[_ZTVN5boost15program_options11typed_valueIdcEE]+0x38): undefined reference to `boost::program_options::value_semantic_codecvt_helper<char>::parse(boost::any&, std::vector<std::string, std::allocator<std::string> > const&, bool) const'
+/var/lib/hudson/slave/workspace/OpenModelica_BUILD_GCC_4.8/OpenModelica/build/lib/x86_64-linux-gnu/omc/cpp/libOMCppOMCFactory.a(OMCFactory.cpp.o):(.data.rel.ro._ZTVN5boost15program_options11typed_valueIicEE[_ZTVN5boost15program_options11typed_valueIicEE]+0x38): undefined reference to `boost::program_options::value_semantic_codecvt_helper<char>::parse(boost::any&, std::vector<std::string, std::allocator<std::string> > const&, bool) const'
+/var/lib/hudson/slave/workspace/OpenModelica_BUILD_GCC_4.8/OpenModelica/build/lib/x86_64-linux-gnu/omc/cpp/libOMCppOMCFactory.a(OMCFactory.cpp.o):(.data.rel.ro._ZTVN5boost15program_options11typed_valueIjcEE[_ZTVN5boost15program_options11typed_valueIjcEE]+0x38): undefined reference to `boost::program_options::value_semantic_codecvt_helper<char>::parse(boost::any&, std::vector<std::string, std::allocator<std::string> > const&, bool) const'
+collect2: error: ld returned 1 exit status
+boolSubClocks.makefile:77: recipe for target 'boolSubClocks' failed
+make: *** [boolSubClocks] Error 1
 "
-2.000000000159155
-0.0
-0.0
-2.000000000159155
-0.3
-0.8999999999999999
-0.0
-0.8999999999999999
-2.4
-0.5
-0.8
-0.4
-1.0
+
+
+
+
+
+
+
+
+
+
+
+
+

Equation mismatch: omc-diff says:
Failed 'b' '"'
Line 7: Text differs:
expected: resultFile = "boolSubClocks_res.mat",
got:      resultFile = "",

== 1 out of 1 tests failed [simulation/modelica/synchronous/boolSubClocks.mos_temp6166, time: 18]

Powered by Hudson Open Source Continuous Integration Server from the Eclipse Foundation