Hudson logo

Failed

openmodelica_bootstrapping.UtilTest.mos (from (result.xml))

Failing for the past 711 builds (Since #6660 )

Stacktrace

Output mismatch (see stdout for details)

Standard Output

 + UtilTest                                                                          ... equation mismatch [time: 6]

==== Log /tmp/omc-rtest-hudson/openmodelica/bootstrapping/UtilTest.mos_temp8975/log-UtilTest.mos
true
true
true
""
true
22000
true
""
{1,2,3,4,5,6,7,8,9,10}
""
{10,9,8,7,6,5,4,3,2,1}
""
{1}
""
(759,{"3","6","9","12","15","18","21","24","27","30","33","36","39","42","45","48","51","54","57","60","63","66"})
""
({1,2},{1,2})
""
fail()
""
{"Myprefix: abc","Myprefix: 123"}
""
({1,3,5},{2,4,6})
""
({SOME(1),SOME(2),SOME(3)},{NONE(),NONE(),NONE()})
""
{"abc","def"}
""
"UtilTest.listListMap({{1,2},{3,4,5}})"
{{"1","2"},{"3","4","5"}}
""
({1,2,3},{4,5})
""
{"1.0","2.0","3.0","4.0","5.0"}
""
1
""
{2,3,4,5}
""
{2,3,4,5}
""
{1,2,4,5}
""
{{1,2},{3,4}}
""
{1,3,4,5,6}
""
{"a","A","B","c"}
""
({1,2},{3,4,5})
""
({{2,3,4},{5,6,7},{8,9}},36)
""
{"a","A","c"}
""
{"a","A","c"}
""

"Error: Error building simulator. Build log: clang -g  -mfpmath=sse -fno-dollars-in-identifiers   -I"/Users/hudson/slave/workspace/OpenModelica_OSX_BUILD/OpenModelica/build/include/omc/c"  -c -o System_strtok.o System_strtok.c
clang -g  -mfpmath=sse -fno-dollars-in-identifiers   -I"/Users/hudson/slave/workspace/OpenModelica_OSX_BUILD/OpenModelica/build/include/omc/c"  -c -o System_strtok_records.o System_strtok_records.c
clang -single_module -dynamiclib -flat_namespace -o System_strtok.dylib System_strtok.o System_strtok_records.o "-L/Users/hudson/slave/workspace/OpenModelica_OSX_BUILD/OpenModelica/build/lib/x86_64-darwin15.4.0/omc" "-L/Users/hudson/slave/workspace/OpenModelica_OSX_BUILD/OpenModelica/build/lib/" "-L/Users/hudson/.openmodelica/binaries/System" "-L/Users/hudson/slave/workspace/OpenModelica_OSX_BUILD/OpenModelica/OMCompiler/Compiler/Util/Resources/Library/x86_64-darwin" "-L/Users/hudson/slave/workspace/OpenModelica_OSX_BUILD/OpenModelica/OMCompiler/Compiler/Util/Resources/Library/darwin64" "-L/Users/hudson/slave/workspace/OpenModelica_OSX_BUILD/OpenModelica/OMCompiler/Compiler/Util/Resources/Library" -lomcruntime -lexpat -lsqlite3 -llpsolve55 -lcolamd   -lomniORB4 -lomnithread -lpthread -lomcgc -g  -mfpmath=sse -fno-dollars-in-identifiers   -I"/Users/hudson/slave/workspace/OpenModelica_OSX_BUILD/OpenModelica/build/include/omc/c"  -L"/Users/hudson/slave/workspace/OpenModelica_OSX_BUILD/OpenModelica/build/lib/x86_64-darwin15.4.0/omc" -Wl,-rpath,'/Users/hudson/slave/workspace/OpenModelica_OSX_BUILD/OpenModelica/build/lib/x86_64-darwin15.4.0/omc'    -L/opt/openmodelica/lib -lOpenModelicaRuntimeC  -lopenblas   -lm -lm
ld: warning: directory not found for option '-L/Users/hudson/.openmodelica/binaries/System'
ld: warning: directory not found for option '-L/Users/hudson/slave/workspace/OpenModelica_OSX_BUILD/OpenModelica/OMCompiler/Compiler/Util/Resources/Library/x86_64-darwin'
ld: warning: directory not found for option '-L/Users/hudson/slave/workspace/OpenModelica_OSX_BUILD/OpenModelica/OMCompiler/Compiler/Util/Resources/Library/darwin64'
ld: warning: directory not found for option '-L/Users/hudson/slave/workspace/OpenModelica_OSX_BUILD/OpenModelica/OMCompiler/Compiler/Util/Resources/Library'
ld: file not found: @rpath/libzmq.dylib for architecture x86_64
clang: error: linker command failed with exit code 1 (use -v to see invocation)
make: *** [System_strtok] Error 1
Error: Error building simulator. Build log: clang -g  -mfpmath=sse -fno-dollars-in-identifiers   -I"/Users/hudson/slave/workspace/OpenModelica_OSX_BUILD/OpenModelica/build/include/omc/c"  -c -o StringUtil_wordWrap.o StringUtil_wordWrap.c
Util/StringUtil.mo:95:70: warning: equality comparison with extraneous parentheses [-Wparentheses-equality]
      if((stringGetNoBoundsChecking(_inString, (modelica_integer)_i) == (modelica_integer)_inChar))
          ~~~~~~~~~~~~~~~~~~~~~~~~~~~~~~~~~~~~~~~~~~~~~~~~~~~~~~~~~~~^~~~~~~~~~~~~~~~~~~~~~~~~~~~
Util/StringUtil.mo:95:70: note: remove extraneous parentheses around the comparison to silence this warning
      if((stringGetNoBoundsChecking(_inString, (modelica_integer)_i) == (modelica_integer)_inChar))
         ~                                                           ^                           ~
Util/StringUtil.mo:95:70: note: use '=' to turn this equality comparison into an assignment
      if((stringGetNoBoundsChecking(_inString, (modelica_integer)_i) == (modelica_integer)_inChar))
                                                                     ^~
                                                                     =
1 warning generated.
clang -g  -mfpmath=sse -fno-dollars-in-identifiers   -I"/Users/hudson/slave/workspace/OpenModelica_OSX_BUILD/OpenModelica/build/include/omc/c"  -c -o StringUtil_wordWrap_records.o StringUtil_wordWrap_records.c
clang -single_module -dynamiclib -flat_namespace -o StringUtil_wordWrap.dylib StringUtil_wordWrap.o StringUtil_wordWrap_records.o "-L/Users/hudson/slave/workspace/OpenModelica_OSX_BUILD/OpenModelica/build/lib/x86_64-darwin15.4.0/omc" "-L/Users/hudson/slave/workspace/OpenModelica_OSX_BUILD/OpenModelica/build/lib/" "-L/Users/hudson/.openmodelica/binaries/System" "-L/Users/hudson/slave/workspace/OpenModelica_OSX_BUILD/OpenModelica/OMCompiler/Compiler/Util/Resources/Library/x86_64-darwin" "-L/Users/hudson/slave/workspace/OpenModelica_OSX_BUILD/OpenModelica/OMCompiler/Compiler/Util/Resources/Library/darwin64" "-L/Users/hudson/slave/workspace/OpenModelica_OSX_BUILD/OpenModelica/OMCompiler/Compiler/Util/Resources/Library" -lomcruntime -lexpat -lsqlite3 -llpsolve55 -lcolamd   -lomniORB4 -lomnithread -lpthread -lomcgc -g  -mfpmath=sse -fno-dollars-in-identifiers   -I"/Users/hudson/slave/workspace/OpenModelica_OSX_BUILD/OpenModelica/build/include/omc/c"  -L"/Users/hudson/slave/workspace/OpenModelica_OSX_BUILD/OpenModelica/build/lib/x86_64-darwin15.4.0/omc" -Wl,-rpath,'/Users/hudson/slave/workspace/OpenModelica_OSX_BUILD/OpenModelica/build/lib/x86_64-darwin15.4.0/omc'    -L/opt/openmodelica/lib -lOpenModelicaRuntimeC  -lopenblas   -lm -lm
ld: warning: directory not found for option '-L/Users/hudson/.openmodelica/binaries/System'
ld: warning: directory not found for option '-L/Users/hudson/slave/workspace/OpenModelica_OSX_BUILD/OpenModelica/OMCompiler/Compiler/Util/Resources/Library/x86_64-darwin'
ld: warning: directory not found for option '-L/Users/hudson/slave/workspace/OpenModelica_OSX_BUILD/OpenModelica/OMCompiler/Compiler/Util/Resources/Library/darwin64'
ld: warning: directory not found for option '-L/Users/hudson/slave/workspace/OpenModelica_OSX_BUILD/OpenModelica/OMCompiler/Compiler/Util/Resources/Library'
ld: file not found: @rpath/libzmq.dylib for architecture x86_64
clang: error: linker command failed with exit code 1 (use -v to see invocation)
make: *** [StringUtil_wordWrap] Error 1
Error: Error building simulator. Build log: clang -g  -mfpmath=sse -fno-dollars-in-identifiers   -I"/Users/hudson/slave/workspace/OpenModelica_OSX_BUILD/OpenModelica/build/include/omc/c"  -c -o System_strtok.o System_strtok.c
clang -g  -mfpmath=sse -fno-dollars-in-identifiers   -I"/Users/hudson/slave/workspace/OpenModelica_OSX_BUILD/OpenModelica/build/include/omc/c"  -c -o System_strtok_records.o System_strtok_records.c
clang -single_module -dynamiclib -flat_namespace -o System_strtok.dylib System_strtok.o System_strtok_records.o "-L/Users/hudson/slave/workspace/OpenModelica_OSX_BUILD/OpenModelica/build/lib/x86_64-darwin15.4.0/omc" "-L/Users/hudson/slave/workspace/OpenModelica_OSX_BUILD/OpenModelica/build/lib/" "-L/Users/hudson/.openmodelica/binaries/System" "-L/Users/hudson/slave/workspace/OpenModelica_OSX_BUILD/OpenModelica/OMCompiler/Compiler/Util/Resources/Library/x86_64-darwin" "-L/Users/hudson/slave/workspace/OpenModelica_OSX_BUILD/OpenModelica/OMCompiler/Compiler/Util/Resources/Library/darwin64" "-L/Users/hudson/slave/workspace/OpenModelica_OSX_BUILD/OpenModelica/OMCompiler/Compiler/Util/Resources/Library" -lomcruntime -lexpat -lsqlite3 -llpsolve55 -lcolamd   -lomniORB4 -lomnithread -lpthread -lomcgc -g  -mfpmath=sse -fno-dollars-in-identifiers   -I"/Users/hudson/slave/workspace/OpenModelica_OSX_BUILD/OpenModelica/build/include/omc/c"  -L"/Users/hudson/slave/workspace/OpenModelica_OSX_BUILD/OpenModelica/build/lib/x86_64-darwin15.4.0/omc" -Wl,-rpath,'/Users/hudson/slave/workspace/OpenModelica_OSX_BUILD/OpenModelica/build/lib/x86_64-darwin15.4.0/omc'    -L/opt/openmodelica/lib -lOpenModelicaRuntimeC  -lopenblas   -lm -lm
ld: warning: directory not found for option '-L/Users/hudson/.openmodelica/binaries/System'
ld: warning: directory not found for option '-L/Users/hudson/slave/workspace/OpenModelica_OSX_BUILD/OpenModelica/OMCompiler/Compiler/Util/Resources/Library/x86_64-darwin'
ld: warning: directory not found for option '-L/Users/hudson/slave/workspace/OpenModelica_OSX_BUILD/OpenModelica/OMCompiler/Compiler/Util/Resources/Library/darwin64'
ld: warning: directory not found for option '-L/Users/hudson/slave/workspace/OpenModelica_OSX_BUILD/OpenModelica/OMCompiler/Compiler/Util/Resources/Library'
ld: file not found: @rpath/libzmq.dylib for architecture x86_64
clang: error: linker command failed with exit code 1 (use -v to see invocation)
make: *** [System_strtok] Error 1
Error: Error building simulator. Build log: clang -g  -mfpmath=sse -fno-dollars-in-identifiers   -I"/Users/hudson/slave/workspace/OpenModelica_OSX_BUILD/OpenModelica/build/include/omc/c"  -c -o StringUtil_wordWrap.o StringUtil_wordWrap.c
Util/StringUtil.mo:95:70: warning: equality comparison with extraneous parentheses [-Wparentheses-equality]
      if((stringGetNoBoundsChecking(_inString, (modelica_integer)_i) == (modelica_integer)_inChar))
          ~~~~~~~~~~~~~~~~~~~~~~~~~~~~~~~~~~~~~~~~~~~~~~~~~~~~~~~~~~~^~~~~~~~~~~~~~~~~~~~~~~~~~~~
Util/StringUtil.mo:95:70: note: remove extraneous parentheses around the comparison to silence this warning
      if((stringGetNoBoundsChecking(_inString, (modelica_integer)_i) == (modelica_integer)_inChar))
         ~                                                           ^                           ~
Util/StringUtil.mo:95:70: note: use '=' to turn this equality comparison into an assignment
      if((stringGetNoBoundsChecking(_inString, (modelica_integer)_i) == (modelica_integer)_inChar))
                                                                     ^~
                                                                     =
1 warning generated.
clang -g  -mfpmath=sse -fno-dollars-in-identifiers   -I"/Users/hudson/slave/workspace/OpenModelica_OSX_BUILD/OpenModelica/build/include/omc/c"  -c -o StringUtil_wordWrap_records.o StringUtil_wordWrap_records.c
clang -single_module -dynamiclib -flat_namespace -o StringUtil_wordWrap.dylib StringUtil_wordWrap.o StringUtil_wordWrap_records.o "-L/Users/hudson/slave/workspace/OpenModelica_OSX_BUILD/OpenModelica/build/lib/x86_64-darwin15.4.0/omc" "-L/Users/hudson/slave/workspace/OpenModelica_OSX_BUILD/OpenModelica/build/lib/" "-L/Users/hudson/.openmodelica/binaries/System" "-L/Users/hudson/slave/workspace/OpenModelica_OSX_BUILD/OpenModelica/OMCompiler/Compiler/Util/Resources/Library/x86_64-darwin" "-L/Users/hudson/slave/workspace/OpenModelica_OSX_BUILD/OpenModelica/OMCompiler/Compiler/Util/Resources/Library/darwin64" "-L/Users/hudson/slave/workspace/OpenModelica_OSX_BUILD/OpenModelica/OMCompiler/Compiler/Util/Resources/Library" -lomcruntime -lexpat -lsqlite3 -llpsolve55 -lcolamd   -lomniORB4 -lomnithread -lpthread -lomcgc -g  -mfpmath=sse -fno-dollars-in-identifiers   -I"/Users/hudson/slave/workspace/OpenModelica_OSX_BUILD/OpenModelica/build/include/omc/c"  -L"/Users/hudson/slave/workspace/OpenModelica_OSX_BUILD/OpenModelica/build/lib/x86_64-darwin15.4.0/omc" -Wl,-rpath,'/Users/hudson/slave/workspace/OpenModelica_OSX_BUILD/OpenModelica/build/lib/x86_64-darwin15.4.0/omc'    -L/opt/openmodelica/lib -lOpenModelicaRuntimeC  -lopenblas   -lm -lm
ld: warning: directory not found for option '-L/Users/hudson/.openmodelica/binaries/System'
ld: warning: directory not found for option '-L/Users/hudson/slave/workspace/OpenModelica_OSX_BUILD/OpenModelica/OMCompiler/Compiler/Util/Resources/Library/x86_64-darwin'
ld: warning: directory not found for option '-L/Users/hudson/slave/workspace/OpenModelica_OSX_BUILD/OpenModelica/OMCompiler/Compiler/Util/Resources/Library/darwin64'
ld: warning: directory not found for option '-L/Users/hudson/slave/workspace/OpenModelica_OSX_BUILD/OpenModelica/OMCompiler/Compiler/Util/Resources/Library'
ld: file not found: @rpath/libzmq.dylib for architecture x86_64
clang: error: linker command failed with exit code 1 (use -v to see invocation)
make: *** [StringUtil_wordWrap] Error 1
"

Equation mismatch: diff says:
--- /tmp/omc-rtest-hudson/openmodelica/bootstrapping/UtilTest.mos_temp8975/equations-expected2019-05-16 21:51:06.000000000 +0200
+++ /tmp/omc-rtest-hudson/openmodelica/bootstrapping/UtilTest.mos_temp8975/equations-got2019-05-16 21:51:12.000000000 +0200
@@ -53,10 +53,69 @@
 ""
 {"a","A","c"}
 ""
 {"a","A","c"}
 ""
-{"this is a somewhat","
-long string with","
-new","
-lines"}
-""
+
+"Error: Error building simulator. Build log: clang -g  -mfpmath=sse -fno-dollars-in-identifiers   -I"/Users/hudson/slave/workspace/OpenModelica_OSX_BUILD/OpenModelica/build/include/omc/c"  -c -o System_strtok.o System_strtok.c
+clang -g  -mfpmath=sse -fno-dollars-in-identifiers   -I"/Users/hudson/slave/workspace/OpenModelica_OSX_BUILD/OpenModelica/build/include/omc/c"  -c -o System_strtok_records.o System_strtok_records.c
+clang -single_module -dynamiclib -flat_namespace -o System_strtok.dylib System_strtok.o System_strtok_records.o "-L/Users/hudson/slave/workspace/OpenModelica_OSX_BUILD/OpenModelica/build/lib/x86_64-darwin15.4.0/omc" "-L/Users/hudson/slave/workspace/OpenModelica_OSX_BUILD/OpenModelica/build/lib/" "-L/Users/hudson/.openmodelica/binaries/System" "-L/Users/hudson/slave/workspace/OpenModelica_OSX_BUILD/OpenModelica/OMCompiler/Compiler/Util/Resources/Library/x86_64-darwin" "-L/Users/hudson/slave/workspace/OpenModelica_OSX_BUILD/OpenModelica/OMCompiler/Compiler/Util/Resources/Library/darwin64" "-L/Users/hudson/slave/workspace/OpenModelica_OSX_BUILD/OpenModelica/OMCompiler/Compiler/Util/Resources/Library" -lomcruntime -lexpat -lsqlite3 -llpsolve55 -lcolamd   -lomniORB4 -lomnithread -lpthread -lomcgc -g  -mfpmath=sse -fno-dollars-in-identifiers   -I"/Users/hudson/slave/workspace/OpenModelica_OSX_BUILD/OpenModelica/build/include/omc/c"  -L"/Users/hudson/slave/workspace/OpenModelica_OSX_BUILD/OpenModelica/build/lib/x86_64-darwin15.4.0/omc" -Wl,-rpath,'/Users/hudson/slave/workspace/OpenModelica_OSX_BUILD/OpenModelica/build/lib/x86_64-darwin15.4.0/omc'    -L/opt/openmodelica/lib -lOpenModelicaRuntimeC  -lopenblas   -lm -lm
+ld: warning: directory not found for option '-L/Users/hudson/.openmodelica/binaries/System'
+ld: warning: directory not found for option '-L/Users/hudson/slave/workspace/OpenModelica_OSX_BUILD/OpenModelica/OMCompiler/Compiler/Util/Resources/Library/x86_64-darwin'
+ld: warning: directory not found for option '-L/Users/hudson/slave/workspace/OpenModelica_OSX_BUILD/OpenModelica/OMCompiler/Compiler/Util/Resources/Library/darwin64'
+ld: warning: directory not found for option '-L/Users/hudson/slave/workspace/OpenModelica_OSX_BUILD/OpenModelica/OMCompiler/Compiler/Util/Resources/Library'
+ld: file not found: @rpath/libzmq.dylib for architecture x86_64
+clang: error: linker command failed with exit code 1 (use -v to see invocation)
+make: *** [System_strtok] Error 1
+Error: Error building simulator. Build log: clang -g  -mfpmath=sse -fno-dollars-in-identifiers   -I"/Users/hudson/slave/workspace/OpenModelica_OSX_BUILD/OpenModelica/build/include/omc/c"  -c -o StringUtil_wordWrap.o StringUtil_wordWrap.c
+Util/StringUtil.mo:95:70: warning: equality comparison with extraneous parentheses [-Wparentheses-equality]
+if((stringGetNoBoundsChecking(_inString, (modelica_integer)_i) == (modelica_integer)_inChar))
+~~~~~~~~~~~~~~~~~~~~~~~~~~~~~~~~~~~~~~~~~~~~~~~~~~~~~~~~~~~^~~~~~~~~~~~~~~~~~~~~~~~~~~~
+Util/StringUtil.mo:95:70: note: remove extraneous parentheses around the comparison to silence this warning
+if((stringGetNoBoundsChecking(_inString, (modelica_integer)_i) == (modelica_integer)_inChar))
+~ ^                           ~
+Util/StringUtil.mo:95:70: note: use '=' to turn this equality comparison into an assignment
+if((stringGetNoBoundsChecking(_inString, (modelica_integer)_i) == (modelica_integer)_inChar))
+^~
+=
+1 warning generated.
+clang -g  -mfpmath=sse -fno-dollars-in-identifiers   -I"/Users/hudson/slave/workspace/OpenModelica_OSX_BUILD/OpenModelica/build/include/omc/c"  -c -o StringUtil_wordWrap_records.o StringUtil_wordWrap_records.c
+clang -single_module -dynamiclib -flat_namespace -o StringUtil_wordWrap.dylib StringUtil_wordWrap.o StringUtil_wordWrap_records.o "-L/Users/hudson/slave/workspace/OpenModelica_OSX_BUILD/OpenModelica/build/lib/x86_64-darwin15.4.0/omc" "-L/Users/hudson/slave/workspace/OpenModelica_OSX_BUILD/OpenModelica/build/lib/" "-L/Users/hudson/.openmodelica/binaries/System" "-L/Users/hudson/slave/workspace/OpenModelica_OSX_BUILD/OpenModelica/OMCompiler/Compiler/Util/Resources/Library/x86_64-darwin" "-L/Users/hudson/slave/workspace/OpenModelica_OSX_BUILD/OpenModelica/OMCompiler/Compiler/Util/Resources/Library/darwin64" "-L/Users/hudson/slave/workspace/OpenModelica_OSX_BUILD/OpenModelica/OMCompiler/Compiler/Util/Resources/Library" -lomcruntime -lexpat -lsqlite3 -llpsolve55 -lcolamd   -lomniORB4 -lomnithread -lpthread -lomcgc -g  -mfpmath=sse -fno-dollars-in-identifiers   -I"/Users/hudson/slave/workspace/OpenModelica_OSX_BUILD/OpenModelica/build/include/omc/c"  -L"/Users/hudson/slave/workspace/OpenModelica_OSX_BUILD/OpenModelica/build/lib/x86_64-darwin15.4.0/omc" -Wl,-rpath,'/Users/hudson/slave/workspace/OpenModelica_OSX_BUILD/OpenModelica/build/lib/x86_64-darwin15.4.0/omc'    -L/opt/openmodelica/lib -lOpenModelicaRuntimeC  -lopenblas   -lm -lm
+ld: warning: directory not found for option '-L/Users/hudson/.openmodelica/binaries/System'
+ld: warning: directory not found for option '-L/Users/hudson/slave/workspace/OpenModelica_OSX_BUILD/OpenModelica/OMCompiler/Compiler/Util/Resources/Library/x86_64-darwin'
+ld: warning: directory not found for option '-L/Users/hudson/slave/workspace/OpenModelica_OSX_BUILD/OpenModelica/OMCompiler/Compiler/Util/Resources/Library/darwin64'
+ld: warning: directory not found for option '-L/Users/hudson/slave/workspace/OpenModelica_OSX_BUILD/OpenModelica/OMCompiler/Compiler/Util/Resources/Library'
+ld: file not found: @rpath/libzmq.dylib for architecture x86_64
+clang: error: linker command failed with exit code 1 (use -v to see invocation)
+make: *** [StringUtil_wordWrap] Error 1
+Error: Error building simulator. Build log: clang -g  -mfpmath=sse -fno-dollars-in-identifiers   -I"/Users/hudson/slave/workspace/OpenModelica_OSX_BUILD/OpenModelica/build/include/omc/c"  -c -o System_strtok.o System_strtok.c
+clang -g  -mfpmath=sse -fno-dollars-in-identifiers   -I"/Users/hudson/slave/workspace/OpenModelica_OSX_BUILD/OpenModelica/build/include/omc/c"  -c -o System_strtok_records.o System_strtok_records.c
+clang -single_module -dynamiclib -flat_namespace -o System_strtok.dylib System_strtok.o System_strtok_records.o "-L/Users/hudson/slave/workspace/OpenModelica_OSX_BUILD/OpenModelica/build/lib/x86_64-darwin15.4.0/omc" "-L/Users/hudson/slave/workspace/OpenModelica_OSX_BUILD/OpenModelica/build/lib/" "-L/Users/hudson/.openmodelica/binaries/System" "-L/Users/hudson/slave/workspace/OpenModelica_OSX_BUILD/OpenModelica/OMCompiler/Compiler/Util/Resources/Library/x86_64-darwin" "-L/Users/hudson/slave/workspace/OpenModelica_OSX_BUILD/OpenModelica/OMCompiler/Compiler/Util/Resources/Library/darwin64" "-L/Users/hudson/slave/workspace/OpenModelica_OSX_BUILD/OpenModelica/OMCompiler/Compiler/Util/Resources/Library" -lomcruntime -lexpat -lsqlite3 -llpsolve55 -lcolamd   -lomniORB4 -lomnithread -lpthread -lomcgc -g  -mfpmath=sse -fno-dollars-in-identifiers   -I"/Users/hudson/slave/workspace/OpenModelica_OSX_BUILD/OpenModelica/build/include/omc/c"  -L"/Users/hudson/slave/workspace/OpenModelica_OSX_BUILD/OpenModelica/build/lib/x86_64-darwin15.4.0/omc" -Wl,-rpath,'/Users/hudson/slave/workspace/OpenModelica_OSX_BUILD/OpenModelica/build/lib/x86_64-darwin15.4.0/omc'    -L/opt/openmodelica/lib -lOpenModelicaRuntimeC  -lopenblas   -lm -lm
+ld: warning: directory not found for option '-L/Users/hudson/.openmodelica/binaries/System'
+ld: warning: directory not found for option '-L/Users/hudson/slave/workspace/OpenModelica_OSX_BUILD/OpenModelica/OMCompiler/Compiler/Util/Resources/Library/x86_64-darwin'
+ld: warning: directory not found for option '-L/Users/hudson/slave/workspace/OpenModelica_OSX_BUILD/OpenModelica/OMCompiler/Compiler/Util/Resources/Library/darwin64'
+ld: warning: directory not found for option '-L/Users/hudson/slave/workspace/OpenModelica_OSX_BUILD/OpenModelica/OMCompiler/Compiler/Util/Resources/Library'
+ld: file not found: @rpath/libzmq.dylib for architecture x86_64
+clang: error: linker command failed with exit code 1 (use -v to see invocation)
+make: *** [System_strtok] Error 1
+Error: Error building simulator. Build log: clang -g  -mfpmath=sse -fno-dollars-in-identifiers   -I"/Users/hudson/slave/workspace/OpenModelica_OSX_BUILD/OpenModelica/build/include/omc/c"  -c -o StringUtil_wordWrap.o StringUtil_wordWrap.c
+Util/StringUtil.mo:95:70: warning: equality comparison with extraneous parentheses [-Wparentheses-equality]
+if((stringGetNoBoundsChecking(_inString, (modelica_integer)_i) == (modelica_integer)_inChar))
+~~~~~~~~~~~~~~~~~~~~~~~~~~~~~~~~~~~~~~~~~~~~~~~~~~~~~~~~~~~^~~~~~~~~~~~~~~~~~~~~~~~~~~~
+Util/StringUtil.mo:95:70: note: remove extraneous parentheses around the comparison to silence this warning
+if((stringGetNoBoundsChecking(_inString, (modelica_integer)_i) == (modelica_integer)_inChar))
+~ ^                           ~
+Util/StringUtil.mo:95:70: note: use '=' to turn this equality comparison into an assignment
+if((stringGetNoBoundsChecking(_inString, (modelica_integer)_i) == (modelica_integer)_inChar))
+^~
+=
+1 warning generated.
+clang -g  -mfpmath=sse -fno-dollars-in-identifiers   -I"/Users/hudson/slave/workspace/OpenModelica_OSX_BUILD/OpenModelica/build/include/omc/c"  -c -o StringUtil_wordWrap_records.o StringUtil_wordWrap_records.c
+clang -single_module -dynamiclib -flat_namespace -o StringUtil_wordWrap.dylib StringUtil_wordWrap.o StringUtil_wordWrap_records.o "-L/Users/hudson/slave/workspace/OpenModelica_OSX_BUILD/OpenModelica/build/lib/x86_64-darwin15.4.0/omc" "-L/Users/hudson/slave/workspace/OpenModelica_OSX_BUILD/OpenModelica/build/lib/" "-L/Users/hudson/.openmodelica/binaries/System" "-L/Users/hudson/slave/workspace/OpenModelica_OSX_BUILD/OpenModelica/OMCompiler/Compiler/Util/Resources/Library/x86_64-darwin" "-L/Users/hudson/slave/workspace/OpenModelica_OSX_BUILD/OpenModelica/OMCompiler/Compiler/Util/Resources/Library/darwin64" "-L/Users/hudson/slave/workspace/OpenModelica_OSX_BUILD/OpenModelica/OMCompiler/Compiler/Util/Resources/Library" -lomcruntime -lexpat -lsqlite3 -llpsolve55 -lcolamd   -lomniORB4 -lomnithread -lpthread -lomcgc -g  -mfpmath=sse -fno-dollars-in-identifiers   -I"/Users/hudson/slave/workspace/OpenModelica_OSX_BUILD/OpenModelica/build/include/omc/c"  -L"/Users/hudson/slave/workspace/OpenModelica_OSX_BUILD/OpenModelica/build/lib/x86_64-darwin15.4.0/omc" -Wl,-rpath,'/Users/hudson/slave/workspace/OpenModelica_OSX_BUILD/OpenModelica/build/lib/x86_64-darwin15.4.0/omc'    -L/opt/openmodelica/lib -lOpenModelicaRuntimeC  -lopenblas   -lm -lm
+ld: warning: directory not found for option '-L/Users/hudson/.openmodelica/binaries/System'
+ld: warning: directory not found for option '-L/Users/hudson/slave/workspace/OpenModelica_OSX_BUILD/OpenModelica/OMCompiler/Compiler/Util/Resources/Library/x86_64-darwin'
+ld: warning: directory not found for option '-L/Users/hudson/slave/workspace/OpenModelica_OSX_BUILD/OpenModelica/OMCompiler/Compiler/Util/Resources/Library/darwin64'
+ld: warning: directory not found for option '-L/Users/hudson/slave/workspace/OpenModelica_OSX_BUILD/OpenModelica/OMCompiler/Compiler/Util/Resources/Library'
+ld: file not found: @rpath/libzmq.dylib for architecture x86_64
+clang: error: linker command failed with exit code 1 (use -v to see invocation)
+make: *** [StringUtil_wordWrap] Error 1
+"

Equation mismatch: omc-diff says:
Line 58: Lexical token differs:
expected: {"this is a somewhat","
got:      


== 1 out of 1 tests failed [openmodelica/bootstrapping/UtilTest.mos_temp8975, time: 6]

Powered by Hudson Open Source Continuous Integration Server from the Eclipse Foundation