Hudson logo

Failed

openmodelica_bootstrapping.System.mos (from (result.xml))

Failing for the past 711 builds (Since #6660 )

Stacktrace

Output mismatch (see stdout for details)

Standard Output

 + System                                                                            ... equation mismatch [time: 2]

==== Log /tmp/omc-rtest-hudson/openmodelica/bootstrapping/System.mos_temp2724/log-System.mos
true
true
true
"System.getCurrentTimeStr"

"Error: Error building simulator. Build log: clang -g  -mfpmath=sse -fno-dollars-in-identifiers   -I"/Users/hudson/slave/workspace/OpenModelica_OSX_BUILD/OpenModelica/build/include/omc/c"  -c -o System_getCurrentTimeStr.o System_getCurrentTimeStr.c
clang -g  -mfpmath=sse -fno-dollars-in-identifiers   -I"/Users/hudson/slave/workspace/OpenModelica_OSX_BUILD/OpenModelica/build/include/omc/c"  -c -o System_getCurrentTimeStr_records.o System_getCurrentTimeStr_records.c
clang -single_module -dynamiclib -flat_namespace -o System_getCurrentTimeStr.dylib System_getCurrentTimeStr.o System_getCurrentTimeStr_records.o "-L/Users/hudson/slave/workspace/OpenModelica_OSX_BUILD/OpenModelica/build/lib/x86_64-darwin15.4.0/omc" "-L/Users/hudson/slave/workspace/OpenModelica_OSX_BUILD/OpenModelica/build/lib/" "-L/Users/hudson/.openmodelica/binaries/System" "-L/Users/hudson/slave/workspace/OpenModelica_OSX_BUILD/OpenModelica/OMCompiler/Compiler/Util/Resources/Library/x86_64-darwin" "-L/Users/hudson/slave/workspace/OpenModelica_OSX_BUILD/OpenModelica/OMCompiler/Compiler/Util/Resources/Library/darwin64" "-L/Users/hudson/slave/workspace/OpenModelica_OSX_BUILD/OpenModelica/OMCompiler/Compiler/Util/Resources/Library" -lomcruntime -lexpat -lsqlite3 -llpsolve55 -lcolamd   -lomniORB4 -lomnithread -lpthread -lomcgc -g  -mfpmath=sse -fno-dollars-in-identifiers   -I"/Users/hudson/slave/workspace/OpenModelica_OSX_BUILD/OpenModelica/build/include/omc/c"  -L"/Users/hudson/slave/workspace/OpenModelica_OSX_BUILD/OpenModelica/build/lib/x86_64-darwin15.4.0/omc" -Wl,-rpath,'/Users/hudson/slave/workspace/OpenModelica_OSX_BUILD/OpenModelica/build/lib/x86_64-darwin15.4.0/omc'    -L/opt/openmodelica/lib -lOpenModelicaRuntimeC  -lopenblas   -lm -lm
ld: warning: directory not found for option '-L/Users/hudson/.openmodelica/binaries/System'
ld: warning: directory not found for option '-L/Users/hudson/slave/workspace/OpenModelica_OSX_BUILD/OpenModelica/OMCompiler/Compiler/Util/Resources/Library/x86_64-darwin'
ld: warning: directory not found for option '-L/Users/hudson/slave/workspace/OpenModelica_OSX_BUILD/OpenModelica/OMCompiler/Compiler/Util/Resources/Library/darwin64'
ld: warning: directory not found for option '-L/Users/hudson/slave/workspace/OpenModelica_OSX_BUILD/OpenModelica/OMCompiler/Compiler/Util/Resources/Library'
ld: file not found: @rpath/libzmq.dylib for architecture x86_64
clang: error: linker command failed with exit code 1 (use -v to see invocation)
make: *** [System_getCurrentTimeStr] Error 1
"
"SystemTest.substringTest"
("abc "," def","abc def")
""
"SystemTest.substringTest"
("a","a","a")
""
"SystemTest.substringTest"
fail()
""

"Error: Error building simulator. Build log: clang -g  -mfpmath=sse -fno-dollars-in-identifiers   -I"/Users/hudson/slave/workspace/OpenModelica_OSX_BUILD/OpenModelica/build/include/omc/c"  -c -o SystemTest_timerTest.o SystemTest_timerTest.c
clang -g  -mfpmath=sse -fno-dollars-in-identifiers   -I"/Users/hudson/slave/workspace/OpenModelica_OSX_BUILD/OpenModelica/build/include/omc/c"  -c -o SystemTest_timerTest_records.o SystemTest_timerTest_records.c
clang -single_module -dynamiclib -flat_namespace -o SystemTest_timerTest.dylib SystemTest_timerTest.o SystemTest_timerTest_records.o "-L/Users/hudson/slave/workspace/OpenModelica_OSX_BUILD/OpenModelica/build/lib/x86_64-darwin15.4.0/omc" "-L/Users/hudson/slave/workspace/OpenModelica_OSX_BUILD/OpenModelica/build/lib/" "-L/Users/hudson/.openmodelica/binaries/System" "-L/Users/hudson/slave/workspace/OpenModelica_OSX_BUILD/OpenModelica/OMCompiler/Compiler/Util/Resources/Library/x86_64-darwin" "-L/Users/hudson/slave/workspace/OpenModelica_OSX_BUILD/OpenModelica/OMCompiler/Compiler/Util/Resources/Library/darwin64" "-L/Users/hudson/slave/workspace/OpenModelica_OSX_BUILD/OpenModelica/OMCompiler/Compiler/Util/Resources/Library" -lomcruntime -lexpat -lsqlite3 -llpsolve55 -lcolamd   -lomniORB4 -lomnithread -lpthread -lomcgc -g  -mfpmath=sse -fno-dollars-in-identifiers   -I"/Users/hudson/slave/workspace/OpenModelica_OSX_BUILD/OpenModelica/build/include/omc/c"  -L"/Users/hudson/slave/workspace/OpenModelica_OSX_BUILD/OpenModelica/build/lib/x86_64-darwin15.4.0/omc" -Wl,-rpath,'/Users/hudson/slave/workspace/OpenModelica_OSX_BUILD/OpenModelica/build/lib/x86_64-darwin15.4.0/omc'    -L/opt/openmodelica/lib -lOpenModelicaRuntimeC  -lopenblas   -lm -lm
ld: warning: directory not found for option '-L/Users/hudson/.openmodelica/binaries/System'
ld: warning: directory not found for option '-L/Users/hudson/slave/workspace/OpenModelica_OSX_BUILD/OpenModelica/OMCompiler/Compiler/Util/Resources/Library/x86_64-darwin'
ld: warning: directory not found for option '-L/Users/hudson/slave/workspace/OpenModelica_OSX_BUILD/OpenModelica/OMCompiler/Compiler/Util/Resources/Library/darwin64'
ld: warning: directory not found for option '-L/Users/hudson/slave/workspace/OpenModelica_OSX_BUILD/OpenModelica/OMCompiler/Compiler/Util/Resources/Library'
ld: file not found: @rpath/libzmq.dylib for architecture x86_64
clang: error: linker command failed with exit code 1 (use -v to see invocation)
make: *** [SystemTest_timerTest] Error 1
"
"SystemTest.randTest"

"Error: Error building simulator. Build log: clang -g  -mfpmath=sse -fno-dollars-in-identifiers   -I"/Users/hudson/slave/workspace/OpenModelica_OSX_BUILD/OpenModelica/build/include/omc/c"  -c -o SystemTest_randTest.o SystemTest_randTest.c
clang -g  -mfpmath=sse -fno-dollars-in-identifiers   -I"/Users/hudson/slave/workspace/OpenModelica_OSX_BUILD/OpenModelica/build/include/omc/c"  -c -o SystemTest_randTest_records.o SystemTest_randTest_records.c
clang -single_module -dynamiclib -flat_namespace -o SystemTest_randTest.dylib SystemTest_randTest.o SystemTest_randTest_records.o "-L/Users/hudson/slave/workspace/OpenModelica_OSX_BUILD/OpenModelica/build/lib/x86_64-darwin15.4.0/omc" "-L/Users/hudson/slave/workspace/OpenModelica_OSX_BUILD/OpenModelica/build/lib/" "-L/Users/hudson/.openmodelica/binaries/System" "-L/Users/hudson/slave/workspace/OpenModelica_OSX_BUILD/OpenModelica/OMCompiler/Compiler/Util/Resources/Library/x86_64-darwin" "-L/Users/hudson/slave/workspace/OpenModelica_OSX_BUILD/OpenModelica/OMCompiler/Compiler/Util/Resources/Library/darwin64" "-L/Users/hudson/slave/workspace/OpenModelica_OSX_BUILD/OpenModelica/OMCompiler/Compiler/Util/Resources/Library" -lomcruntime -lexpat -lsqlite3 -llpsolve55 -lcolamd   -lomniORB4 -lomnithread -lpthread -lomcgc -g  -mfpmath=sse -fno-dollars-in-identifiers   -I"/Users/hudson/slave/workspace/OpenModelica_OSX_BUILD/OpenModelica/build/include/omc/c"  -L"/Users/hudson/slave/workspace/OpenModelica_OSX_BUILD/OpenModelica/build/lib/x86_64-darwin15.4.0/omc" -Wl,-rpath,'/Users/hudson/slave/workspace/OpenModelica_OSX_BUILD/OpenModelica/build/lib/x86_64-darwin15.4.0/omc'    -L/opt/openmodelica/lib -lOpenModelicaRuntimeC  -lopenblas   -lm -lm
ld: warning: directory not found for option '-L/Users/hudson/.openmodelica/binaries/System'
ld: warning: directory not found for option '-L/Users/hudson/slave/workspace/OpenModelica_OSX_BUILD/OpenModelica/OMCompiler/Compiler/Util/Resources/Library/x86_64-darwin'
ld: warning: directory not found for option '-L/Users/hudson/slave/workspace/OpenModelica_OSX_BUILD/OpenModelica/OMCompiler/Compiler/Util/Resources/Library/darwin64'
ld: warning: directory not found for option '-L/Users/hudson/slave/workspace/OpenModelica_OSX_BUILD/OpenModelica/OMCompiler/Compiler/Util/Resources/Library'
ld: file not found: @rpath/libzmq.dylib for architecture x86_64
clang: error: linker command failed with exit code 1 (use -v to see invocation)
make: *** [SystemTest_randTest] Error 1
"

"Error: Error building simulator. Build log: clang -g  -mfpmath=sse -fno-dollars-in-identifiers   -I"/Users/hudson/slave/workspace/OpenModelica_OSX_BUILD/OpenModelica/build/include/omc/c"  -c -o SystemTest_randTest.o SystemTest_randTest.c
clang -g  -mfpmath=sse -fno-dollars-in-identifiers   -I"/Users/hudson/slave/workspace/OpenModelica_OSX_BUILD/OpenModelica/build/include/omc/c"  -c -o SystemTest_randTest_records.o SystemTest_randTest_records.c
clang -single_module -dynamiclib -flat_namespace -o SystemTest_randTest.dylib SystemTest_randTest.o SystemTest_randTest_records.o "-L/Users/hudson/slave/workspace/OpenModelica_OSX_BUILD/OpenModelica/build/lib/x86_64-darwin15.4.0/omc" "-L/Users/hudson/slave/workspace/OpenModelica_OSX_BUILD/OpenModelica/build/lib/" "-L/Users/hudson/.openmodelica/binaries/System" "-L/Users/hudson/slave/workspace/OpenModelica_OSX_BUILD/OpenModelica/OMCompiler/Compiler/Util/Resources/Library/x86_64-darwin" "-L/Users/hudson/slave/workspace/OpenModelica_OSX_BUILD/OpenModelica/OMCompiler/Compiler/Util/Resources/Library/darwin64" "-L/Users/hudson/slave/workspace/OpenModelica_OSX_BUILD/OpenModelica/OMCompiler/Compiler/Util/Resources/Library" -lomcruntime -lexpat -lsqlite3 -llpsolve55 -lcolamd   -lomniORB4 -lomnithread -lpthread -lomcgc -g  -mfpmath=sse -fno-dollars-in-identifiers   -I"/Users/hudson/slave/workspace/OpenModelica_OSX_BUILD/OpenModelica/build/include/omc/c"  -L"/Users/hudson/slave/workspace/OpenModelica_OSX_BUILD/OpenModelica/build/lib/x86_64-darwin15.4.0/omc" -Wl,-rpath,'/Users/hudson/slave/workspace/OpenModelica_OSX_BUILD/OpenModelica/build/lib/x86_64-darwin15.4.0/omc'    -L/opt/openmodelica/lib -lOpenModelicaRuntimeC  -lopenblas   -lm -lm
ld: warning: directory not found for option '-L/Users/hudson/.openmodelica/binaries/System'
ld: warning: directory not found for option '-L/Users/hudson/slave/workspace/OpenModelica_OSX_BUILD/OpenModelica/OMCompiler/Compiler/Util/Resources/Library/x86_64-darwin'
ld: warning: directory not found for option '-L/Users/hudson/slave/workspace/OpenModelica_OSX_BUILD/OpenModelica/OMCompiler/Compiler/Util/Resources/Library/darwin64'
ld: warning: directory not found for option '-L/Users/hudson/slave/workspace/OpenModelica_OSX_BUILD/OpenModelica/OMCompiler/Compiler/Util/Resources/Library'
ld: file not found: @rpath/libzmq.dylib for architecture x86_64
clang: error: linker command failed with exit code 1 (use -v to see invocation)
make: *** [SystemTest_randTest] Error 1
"

"Error: Error building simulator. Build log: clang -g  -mfpmath=sse -fno-dollars-in-identifiers   -I"/Users/hudson/slave/workspace/OpenModelica_OSX_BUILD/OpenModelica/build/include/omc/c"  -c -o SystemTest_randTest.o SystemTest_randTest.c
clang -g  -mfpmath=sse -fno-dollars-in-identifiers   -I"/Users/hudson/slave/workspace/OpenModelica_OSX_BUILD/OpenModelica/build/include/omc/c"  -c -o SystemTest_randTest_records.o SystemTest_randTest_records.c
clang -single_module -dynamiclib -flat_namespace -o SystemTest_randTest.dylib SystemTest_randTest.o SystemTest_randTest_records.o "-L/Users/hudson/slave/workspace/OpenModelica_OSX_BUILD/OpenModelica/build/lib/x86_64-darwin15.4.0/omc" "-L/Users/hudson/slave/workspace/OpenModelica_OSX_BUILD/OpenModelica/build/lib/" "-L/Users/hudson/.openmodelica/binaries/System" "-L/Users/hudson/slave/workspace/OpenModelica_OSX_BUILD/OpenModelica/OMCompiler/Compiler/Util/Resources/Library/x86_64-darwin" "-L/Users/hudson/slave/workspace/OpenModelica_OSX_BUILD/OpenModelica/OMCompiler/Compiler/Util/Resources/Library/darwin64" "-L/Users/hudson/slave/workspace/OpenModelica_OSX_BUILD/OpenModelica/OMCompiler/Compiler/Util/Resources/Library" -lomcruntime -lexpat -lsqlite3 -llpsolve55 -lcolamd   -lomniORB4 -lomnithread -lpthread -lomcgc -g  -mfpmath=sse -fno-dollars-in-identifiers   -I"/Users/hudson/slave/workspace/OpenModelica_OSX_BUILD/OpenModelica/build/include/omc/c"  -L"/Users/hudson/slave/workspace/OpenModelica_OSX_BUILD/OpenModelica/build/lib/x86_64-darwin15.4.0/omc" -Wl,-rpath,'/Users/hudson/slave/workspace/OpenModelica_OSX_BUILD/OpenModelica/build/lib/x86_64-darwin15.4.0/omc'    -L/opt/openmodelica/lib -lOpenModelicaRuntimeC  -lopenblas   -lm -lm
ld: warning: directory not found for option '-L/Users/hudson/.openmodelica/binaries/System'
ld: warning: directory not found for option '-L/Users/hudson/slave/workspace/OpenModelica_OSX_BUILD/OpenModelica/OMCompiler/Compiler/Util/Resources/Library/x86_64-darwin'
ld: warning: directory not found for option '-L/Users/hudson/slave/workspace/OpenModelica_OSX_BUILD/OpenModelica/OMCompiler/Compiler/Util/Resources/Library/darwin64'
ld: warning: directory not found for option '-L/Users/hudson/slave/workspace/OpenModelica_OSX_BUILD/OpenModelica/OMCompiler/Compiler/Util/Resources/Library'
ld: file not found: @rpath/libzmq.dylib for architecture x86_64
clang: error: linker command failed with exit code 1 (use -v to see invocation)
make: *** [SystemTest_randTest] Error 1
"

Equation mismatch: diff says:
--- /tmp/omc-rtest-hudson/openmodelica/bootstrapping/System.mos_temp2724/equations-expected2019-05-16 22:00:50.000000000 +0200
+++ /tmp/omc-rtest-hudson/openmodelica/bootstrapping/System.mos_temp2724/equations-got2019-05-16 22:00:52.000000000 +0200
@@ -1,24 +1,74 @@
 true
 true
 true
 "System.getCurrentTimeStr"
-true
-""
+
+"Error: Error building simulator. Build log: clang -g  -mfpmath=sse -fno-dollars-in-identifiers   -I"/Users/hudson/slave/workspace/OpenModelica_OSX_BUILD/OpenModelica/build/include/omc/c"  -c -o System_getCurrentTimeStr.o System_getCurrentTimeStr.c
+clang -g  -mfpmath=sse -fno-dollars-in-identifiers   -I"/Users/hudson/slave/workspace/OpenModelica_OSX_BUILD/OpenModelica/build/include/omc/c"  -c -o System_getCurrentTimeStr_records.o System_getCurrentTimeStr_records.c
+clang -single_module -dynamiclib -flat_namespace -o System_getCurrentTimeStr.dylib System_getCurrentTimeStr.o System_getCurrentTimeStr_records.o "-L/Users/hudson/slave/workspace/OpenModelica_OSX_BUILD/OpenModelica/build/lib/x86_64-darwin15.4.0/omc" "-L/Users/hudson/slave/workspace/OpenModelica_OSX_BUILD/OpenModelica/build/lib/" "-L/Users/hudson/.openmodelica/binaries/System" "-L/Users/hudson/slave/workspace/OpenModelica_OSX_BUILD/OpenModelica/OMCompiler/Compiler/Util/Resources/Library/x86_64-darwin" "-L/Users/hudson/slave/workspace/OpenModelica_OSX_BUILD/OpenModelica/OMCompiler/Compiler/Util/Resources/Library/darwin64" "-L/Users/hudson/slave/workspace/OpenModelica_OSX_BUILD/OpenModelica/OMCompiler/Compiler/Util/Resources/Library" -lomcruntime -lexpat -lsqlite3 -llpsolve55 -lcolamd   -lomniORB4 -lomnithread -lpthread -lomcgc -g  -mfpmath=sse -fno-dollars-in-identifiers   -I"/Users/hudson/slave/workspace/OpenModelica_OSX_BUILD/OpenModelica/build/include/omc/c"  -L"/Users/hudson/slave/workspace/OpenModelica_OSX_BUILD/OpenModelica/build/lib/x86_64-darwin15.4.0/omc" -Wl,-rpath,'/Users/hudson/slave/workspace/OpenModelica_OSX_BUILD/OpenModelica/build/lib/x86_64-darwin15.4.0/omc'    -L/opt/openmodelica/lib -lOpenModelicaRuntimeC  -lopenblas   -lm -lm
+ld: warning: directory not found for option '-L/Users/hudson/.openmodelica/binaries/System'
+ld: warning: directory not found for option '-L/Users/hudson/slave/workspace/OpenModelica_OSX_BUILD/OpenModelica/OMCompiler/Compiler/Util/Resources/Library/x86_64-darwin'
+ld: warning: directory not found for option '-L/Users/hudson/slave/workspace/OpenModelica_OSX_BUILD/OpenModelica/OMCompiler/Compiler/Util/Resources/Library/darwin64'
+ld: warning: directory not found for option '-L/Users/hudson/slave/workspace/OpenModelica_OSX_BUILD/OpenModelica/OMCompiler/Compiler/Util/Resources/Library'
+ld: file not found: @rpath/libzmq.dylib for architecture x86_64
+clang: error: linker command failed with exit code 1 (use -v to see invocation)
+make: *** [System_getCurrentTimeStr] Error 1
+"
 "SystemTest.substringTest"
 ("abc "," def","abc def")
 ""
 "SystemTest.substringTest"
 ("a","a","a")
 ""
 "SystemTest.substringTest"
 fail()
 ""
-true
-""
+
+"Error: Error building simulator. Build log: clang -g  -mfpmath=sse -fno-dollars-in-identifiers   -I"/Users/hudson/slave/workspace/OpenModelica_OSX_BUILD/OpenModelica/build/include/omc/c"  -c -o SystemTest_timerTest.o SystemTest_timerTest.c
+clang -g  -mfpmath=sse -fno-dollars-in-identifiers   -I"/Users/hudson/slave/workspace/OpenModelica_OSX_BUILD/OpenModelica/build/include/omc/c"  -c -o SystemTest_timerTest_records.o SystemTest_timerTest_records.c
+clang -single_module -dynamiclib -flat_namespace -o SystemTest_timerTest.dylib SystemTest_timerTest.o SystemTest_timerTest_records.o "-L/Users/hudson/slave/workspace/OpenModelica_OSX_BUILD/OpenModelica/build/lib/x86_64-darwin15.4.0/omc" "-L/Users/hudson/slave/workspace/OpenModelica_OSX_BUILD/OpenModelica/build/lib/" "-L/Users/hudson/.openmodelica/binaries/System" "-L/Users/hudson/slave/workspace/OpenModelica_OSX_BUILD/OpenModelica/OMCompiler/Compiler/Util/Resources/Library/x86_64-darwin" "-L/Users/hudson/slave/workspace/OpenModelica_OSX_BUILD/OpenModelica/OMCompiler/Compiler/Util/Resources/Library/darwin64" "-L/Users/hudson/slave/workspace/OpenModelica_OSX_BUILD/OpenModelica/OMCompiler/Compiler/Util/Resources/Library" -lomcruntime -lexpat -lsqlite3 -llpsolve55 -lcolamd   -lomniORB4 -lomnithread -lpthread -lomcgc -g  -mfpmath=sse -fno-dollars-in-identifiers   -I"/Users/hudson/slave/workspace/OpenModelica_OSX_BUILD/OpenModelica/build/include/omc/c"  -L"/Users/hudson/slave/workspace/OpenModelica_OSX_BUILD/OpenModelica/build/lib/x86_64-darwin15.4.0/omc" -Wl,-rpath,'/Users/hudson/slave/workspace/OpenModelica_OSX_BUILD/OpenModelica/build/lib/x86_64-darwin15.4.0/omc'    -L/opt/openmodelica/lib -lOpenModelicaRuntimeC  -lopenblas   -lm -lm
+ld: warning: directory not found for option '-L/Users/hudson/.openmodelica/binaries/System'
+ld: warning: directory not found for option '-L/Users/hudson/slave/workspace/OpenModelica_OSX_BUILD/OpenModelica/OMCompiler/Compiler/Util/Resources/Library/x86_64-darwin'
+ld: warning: directory not found for option '-L/Users/hudson/slave/workspace/OpenModelica_OSX_BUILD/OpenModelica/OMCompiler/Compiler/Util/Resources/Library/darwin64'
+ld: warning: directory not found for option '-L/Users/hudson/slave/workspace/OpenModelica_OSX_BUILD/OpenModelica/OMCompiler/Compiler/Util/Resources/Library'
+ld: file not found: @rpath/libzmq.dylib for architecture x86_64
+clang: error: linker command failed with exit code 1 (use -v to see invocation)
+make: *** [SystemTest_timerTest] Error 1
+"
 "SystemTest.randTest"
-"1: 248, 2: 259, 3: 254, 4: 239"
-""
-"1: 178, 2: 185, 3: 216, 4: 202, 5: 219"
-""
-"1: 184, 2: 159, 3: 168, 4: 164, 5: 143, 6: 182"
-""
+
+"Error: Error building simulator. Build log: clang -g  -mfpmath=sse -fno-dollars-in-identifiers   -I"/Users/hudson/slave/workspace/OpenModelica_OSX_BUILD/OpenModelica/build/include/omc/c"  -c -o SystemTest_randTest.o SystemTest_randTest.c
+clang -g  -mfpmath=sse -fno-dollars-in-identifiers   -I"/Users/hudson/slave/workspace/OpenModelica_OSX_BUILD/OpenModelica/build/include/omc/c"  -c -o SystemTest_randTest_records.o SystemTest_randTest_records.c
+clang -single_module -dynamiclib -flat_namespace -o SystemTest_randTest.dylib SystemTest_randTest.o SystemTest_randTest_records.o "-L/Users/hudson/slave/workspace/OpenModelica_OSX_BUILD/OpenModelica/build/lib/x86_64-darwin15.4.0/omc" "-L/Users/hudson/slave/workspace/OpenModelica_OSX_BUILD/OpenModelica/build/lib/" "-L/Users/hudson/.openmodelica/binaries/System" "-L/Users/hudson/slave/workspace/OpenModelica_OSX_BUILD/OpenModelica/OMCompiler/Compiler/Util/Resources/Library/x86_64-darwin" "-L/Users/hudson/slave/workspace/OpenModelica_OSX_BUILD/OpenModelica/OMCompiler/Compiler/Util/Resources/Library/darwin64" "-L/Users/hudson/slave/workspace/OpenModelica_OSX_BUILD/OpenModelica/OMCompiler/Compiler/Util/Resources/Library" -lomcruntime -lexpat -lsqlite3 -llpsolve55 -lcolamd   -lomniORB4 -lomnithread -lpthread -lomcgc -g  -mfpmath=sse -fno-dollars-in-identifiers   -I"/Users/hudson/slave/workspace/OpenModelica_OSX_BUILD/OpenModelica/build/include/omc/c"  -L"/Users/hudson/slave/workspace/OpenModelica_OSX_BUILD/OpenModelica/build/lib/x86_64-darwin15.4.0/omc" -Wl,-rpath,'/Users/hudson/slave/workspace/OpenModelica_OSX_BUILD/OpenModelica/build/lib/x86_64-darwin15.4.0/omc'    -L/opt/openmodelica/lib -lOpenModelicaRuntimeC  -lopenblas   -lm -lm
+ld: warning: directory not found for option '-L/Users/hudson/.openmodelica/binaries/System'
+ld: warning: directory not found for option '-L/Users/hudson/slave/workspace/OpenModelica_OSX_BUILD/OpenModelica/OMCompiler/Compiler/Util/Resources/Library/x86_64-darwin'
+ld: warning: directory not found for option '-L/Users/hudson/slave/workspace/OpenModelica_OSX_BUILD/OpenModelica/OMCompiler/Compiler/Util/Resources/Library/darwin64'
+ld: warning: directory not found for option '-L/Users/hudson/slave/workspace/OpenModelica_OSX_BUILD/OpenModelica/OMCompiler/Compiler/Util/Resources/Library'
+ld: file not found: @rpath/libzmq.dylib for architecture x86_64
+clang: error: linker command failed with exit code 1 (use -v to see invocation)
+make: *** [SystemTest_randTest] Error 1
+"
+
+"Error: Error building simulator. Build log: clang -g  -mfpmath=sse -fno-dollars-in-identifiers   -I"/Users/hudson/slave/workspace/OpenModelica_OSX_BUILD/OpenModelica/build/include/omc/c"  -c -o SystemTest_randTest.o SystemTest_randTest.c
+clang -g  -mfpmath=sse -fno-dollars-in-identifiers   -I"/Users/hudson/slave/workspace/OpenModelica_OSX_BUILD/OpenModelica/build/include/omc/c"  -c -o SystemTest_randTest_records.o SystemTest_randTest_records.c
+clang -single_module -dynamiclib -flat_namespace -o SystemTest_randTest.dylib SystemTest_randTest.o SystemTest_randTest_records.o "-L/Users/hudson/slave/workspace/OpenModelica_OSX_BUILD/OpenModelica/build/lib/x86_64-darwin15.4.0/omc" "-L/Users/hudson/slave/workspace/OpenModelica_OSX_BUILD/OpenModelica/build/lib/" "-L/Users/hudson/.openmodelica/binaries/System" "-L/Users/hudson/slave/workspace/OpenModelica_OSX_BUILD/OpenModelica/OMCompiler/Compiler/Util/Resources/Library/x86_64-darwin" "-L/Users/hudson/slave/workspace/OpenModelica_OSX_BUILD/OpenModelica/OMCompiler/Compiler/Util/Resources/Library/darwin64" "-L/Users/hudson/slave/workspace/OpenModelica_OSX_BUILD/OpenModelica/OMCompiler/Compiler/Util/Resources/Library" -lomcruntime -lexpat -lsqlite3 -llpsolve55 -lcolamd   -lomniORB4 -lomnithread -lpthread -lomcgc -g  -mfpmath=sse -fno-dollars-in-identifiers   -I"/Users/hudson/slave/workspace/OpenModelica_OSX_BUILD/OpenModelica/build/include/omc/c"  -L"/Users/hudson/slave/workspace/OpenModelica_OSX_BUILD/OpenModelica/build/lib/x86_64-darwin15.4.0/omc" -Wl,-rpath,'/Users/hudson/slave/workspace/OpenModelica_OSX_BUILD/OpenModelica/build/lib/x86_64-darwin15.4.0/omc'    -L/opt/openmodelica/lib -lOpenModelicaRuntimeC  -lopenblas   -lm -lm
+ld: warning: directory not found for option '-L/Users/hudson/.openmodelica/binaries/System'
+ld: warning: directory not found for option '-L/Users/hudson/slave/workspace/OpenModelica_OSX_BUILD/OpenModelica/OMCompiler/Compiler/Util/Resources/Library/x86_64-darwin'
+ld: warning: directory not found for option '-L/Users/hudson/slave/workspace/OpenModelica_OSX_BUILD/OpenModelica/OMCompiler/Compiler/Util/Resources/Library/darwin64'
+ld: warning: directory not found for option '-L/Users/hudson/slave/workspace/OpenModelica_OSX_BUILD/OpenModelica/OMCompiler/Compiler/Util/Resources/Library'
+ld: file not found: @rpath/libzmq.dylib for architecture x86_64
+clang: error: linker command failed with exit code 1 (use -v to see invocation)
+make: *** [SystemTest_randTest] Error 1
+"
+
+"Error: Error building simulator. Build log: clang -g  -mfpmath=sse -fno-dollars-in-identifiers   -I"/Users/hudson/slave/workspace/OpenModelica_OSX_BUILD/OpenModelica/build/include/omc/c"  -c -o SystemTest_randTest.o SystemTest_randTest.c
+clang -g  -mfpmath=sse -fno-dollars-in-identifiers   -I"/Users/hudson/slave/workspace/OpenModelica_OSX_BUILD/OpenModelica/build/include/omc/c"  -c -o SystemTest_randTest_records.o SystemTest_randTest_records.c
+clang -single_module -dynamiclib -flat_namespace -o SystemTest_randTest.dylib SystemTest_randTest.o SystemTest_randTest_records.o "-L/Users/hudson/slave/workspace/OpenModelica_OSX_BUILD/OpenModelica/build/lib/x86_64-darwin15.4.0/omc" "-L/Users/hudson/slave/workspace/OpenModelica_OSX_BUILD/OpenModelica/build/lib/" "-L/Users/hudson/.openmodelica/binaries/System" "-L/Users/hudson/slave/workspace/OpenModelica_OSX_BUILD/OpenModelica/OMCompiler/Compiler/Util/Resources/Library/x86_64-darwin" "-L/Users/hudson/slave/workspace/OpenModelica_OSX_BUILD/OpenModelica/OMCompiler/Compiler/Util/Resources/Library/darwin64" "-L/Users/hudson/slave/workspace/OpenModelica_OSX_BUILD/OpenModelica/OMCompiler/Compiler/Util/Resources/Library" -lomcruntime -lexpat -lsqlite3 -llpsolve55 -lcolamd   -lomniORB4 -lomnithread -lpthread -lomcgc -g  -mfpmath=sse -fno-dollars-in-identifiers   -I"/Users/hudson/slave/workspace/OpenModelica_OSX_BUILD/OpenModelica/build/include/omc/c"  -L"/Users/hudson/slave/workspace/OpenModelica_OSX_BUILD/OpenModelica/build/lib/x86_64-darwin15.4.0/omc" -Wl,-rpath,'/Users/hudson/slave/workspace/OpenModelica_OSX_BUILD/OpenModelica/build/lib/x86_64-darwin15.4.0/omc'    -L/opt/openmodelica/lib -lOpenModelicaRuntimeC  -lopenblas   -lm -lm
+ld: warning: directory not found for option '-L/Users/hudson/.openmodelica/binaries/System'
+ld: warning: directory not found for option '-L/Users/hudson/slave/workspace/OpenModelica_OSX_BUILD/OpenModelica/OMCompiler/Compiler/Util/Resources/Library/x86_64-darwin'
+ld: warning: directory not found for option '-L/Users/hudson/slave/workspace/OpenModelica_OSX_BUILD/OpenModelica/OMCompiler/Compiler/Util/Resources/Library/darwin64'
+ld: warning: directory not found for option '-L/Users/hudson/slave/workspace/OpenModelica_OSX_BUILD/OpenModelica/OMCompiler/Compiler/Util/Resources/Library'
+ld: file not found: @rpath/libzmq.dylib for architecture x86_64
+clang: error: linker command failed with exit code 1 (use -v to see invocation)
+make: *** [SystemTest_randTest] Error 1
+"

Equation mismatch: omc-diff says:
Line 5: Lexical token differs:
expected: true
got:      


== 1 out of 1 tests failed [openmodelica/bootstrapping/System.mos_temp2724, time: 2]

Powered by Hudson Open Source Continuous Integration Server from the Eclipse Foundation