Hudson logo

Failed

openmodelica_bootstrapping.JSONParser.mos (from (result.xml))

Failing for the past 711 builds (Since #6660 )

Stacktrace

Output mismatch (see stdout for details)

Standard Output

 + JSONParser                                                                        ... equation mismatch [time: 6]

==== Log /tmp/omc-rtest-hudson/openmodelica/bootstrapping/JSONParser.mos_temp1386/log-JSONParser.mos
true
true
true
""
true
""
true
""
true
""
true
""
true
""
true
""
true
""
true
""
true
""
true
""
true
""
true
""
true

"Error: Error building simulator. Build log: clang -g  -mfpmath=sse -fno-dollars-in-identifiers   -I"/Users/hudson/slave/workspace/OpenModelica_OSX_BUILD/OpenModelica/build/include/omc/c"  -c -o testJSON.o testJSON.c
clang -g  -mfpmath=sse -fno-dollars-in-identifiers   -I"/Users/hudson/slave/workspace/OpenModelica_OSX_BUILD/OpenModelica/build/include/omc/c"  -c -o testJSON_records.o testJSON_records.c
clang -single_module -dynamiclib -flat_namespace -o testJSON.dylib testJSON.o testJSON_records.o "-L/Users/hudson/slave/workspace/OpenModelica_OSX_BUILD/OpenModelica/build/lib/x86_64-darwin15.4.0/omc" "-L/Users/hudson/slave/workspace/OpenModelica_OSX_BUILD/OpenModelica/build/lib/" "-L/Users/hudson/.openmodelica/binaries/System" "-L/Users/hudson/slave/workspace/OpenModelica_OSX_BUILD/OpenModelica/OMCompiler/Compiler/Util/Resources/Library/x86_64-darwin" "-L/Users/hudson/slave/workspace/OpenModelica_OSX_BUILD/OpenModelica/OMCompiler/Compiler/Util/Resources/Library/darwin64" "-L/Users/hudson/slave/workspace/OpenModelica_OSX_BUILD/OpenModelica/OMCompiler/Compiler/Util/Resources/Library" -lomcruntime -lexpat -lsqlite3 -llpsolve55 -lcolamd   -lomniORB4 -lomnithread -lpthread -lomcgc "-L/Users/hudson/.openmodelica/binaries/ErrorExt" -g  -mfpmath=sse -fno-dollars-in-identifiers   -I"/Users/hudson/slave/workspace/OpenModelica_OSX_BUILD/OpenModelica/build/include/omc/c"  -L"/Users/hudson/slave/workspace/OpenModelica_OSX_BUILD/OpenModelica/build/lib/x86_64-darwin15.4.0/omc" -Wl,-rpath,'/Users/hudson/slave/workspace/OpenModelica_OSX_BUILD/OpenModelica/build/lib/x86_64-darwin15.4.0/omc'    -L/opt/openmodelica/lib -lOpenModelicaRuntimeC  -lopenblas   -lm -lm
ld: warning: directory not found for option '-L/Users/hudson/.openmodelica/binaries/System'
ld: warning: directory not found for option '-L/Users/hudson/slave/workspace/OpenModelica_OSX_BUILD/OpenModelica/OMCompiler/Compiler/Util/Resources/Library/x86_64-darwin'
ld: warning: directory not found for option '-L/Users/hudson/slave/workspace/OpenModelica_OSX_BUILD/OpenModelica/OMCompiler/Compiler/Util/Resources/Library/darwin64'
ld: warning: directory not found for option '-L/Users/hudson/slave/workspace/OpenModelica_OSX_BUILD/OpenModelica/OMCompiler/Compiler/Util/Resources/Library'
ld: warning: directory not found for option '-L/Users/hudson/.openmodelica/binaries/ErrorExt'
ld: file not found: @rpath/libzmq.dylib for architecture x86_64
clang: error: linker command failed with exit code 1 (use -v to see invocation)
make: *** [testJSON] Error 1
"

Equation mismatch: diff says:
--- /tmp/omc-rtest-hudson/openmodelica/bootstrapping/JSONParser.mos_temp1386/equations-expected2019-05-16 21:37:45.000000000 +0200
+++ /tmp/omc-rtest-hudson/openmodelica/bootstrapping/JSONParser.mos_temp1386/equations-got2019-05-16 21:37:51.000000000 +0200
@@ -25,8 +25,18 @@
 true
 ""
 true
 ""
 true
-{"a":[true, false, null], "b":[], "c":"", "int":13, "dbl":[14.1, 1e+06, 100000]}
-"{\"a\":[true, false, null], \"b\":[], \"c\":\"\", \"int\":13, \"dbl\":[14.1, 1e+06, 100000]}"
-""
+
+"Error: Error building simulator. Build log: clang -g  -mfpmath=sse -fno-dollars-in-identifiers   -I"/Users/hudson/slave/workspace/OpenModelica_OSX_BUILD/OpenModelica/build/include/omc/c"  -c -o testJSON.o testJSON.c
+clang -g  -mfpmath=sse -fno-dollars-in-identifiers   -I"/Users/hudson/slave/workspace/OpenModelica_OSX_BUILD/OpenModelica/build/include/omc/c"  -c -o testJSON_records.o testJSON_records.c
+clang -single_module -dynamiclib -flat_namespace -o testJSON.dylib testJSON.o testJSON_records.o "-L/Users/hudson/slave/workspace/OpenModelica_OSX_BUILD/OpenModelica/build/lib/x86_64-darwin15.4.0/omc" "-L/Users/hudson/slave/workspace/OpenModelica_OSX_BUILD/OpenModelica/build/lib/" "-L/Users/hudson/.openmodelica/binaries/System" "-L/Users/hudson/slave/workspace/OpenModelica_OSX_BUILD/OpenModelica/OMCompiler/Compiler/Util/Resources/Library/x86_64-darwin" "-L/Users/hudson/slave/workspace/OpenModelica_OSX_BUILD/OpenModelica/OMCompiler/Compiler/Util/Resources/Library/darwin64" "-L/Users/hudson/slave/workspace/OpenModelica_OSX_BUILD/OpenModelica/OMCompiler/Compiler/Util/Resources/Library" -lomcruntime -lexpat -lsqlite3 -llpsolve55 -lcolamd   -lomniORB4 -lomnithread -lpthread -lomcgc "-L/Users/hudson/.openmodelica/binaries/ErrorExt" -g  -mfpmath=sse -fno-dollars-in-identifiers   -I"/Users/hudson/slave/workspace/OpenModelica_OSX_BUILD/OpenModelica/build/include/omc/c"  -L"/Users/hudson/slave/workspace/OpenModelica_OSX_BUILD/OpenModelica/build/lib/x86_64-darwin15.4.0/omc" -Wl,-rpath,'/Users/hudson/slave/workspace/OpenModelica_OSX_BUILD/OpenModelica/build/lib/x86_64-darwin15.4.0/omc'    -L/opt/openmodelica/lib -lOpenModelicaRuntimeC  -lopenblas   -lm -lm
+ld: warning: directory not found for option '-L/Users/hudson/.openmodelica/binaries/System'
+ld: warning: directory not found for option '-L/Users/hudson/slave/workspace/OpenModelica_OSX_BUILD/OpenModelica/OMCompiler/Compiler/Util/Resources/Library/x86_64-darwin'
+ld: warning: directory not found for option '-L/Users/hudson/slave/workspace/OpenModelica_OSX_BUILD/OpenModelica/OMCompiler/Compiler/Util/Resources/Library/darwin64'
+ld: warning: directory not found for option '-L/Users/hudson/slave/workspace/OpenModelica_OSX_BUILD/OpenModelica/OMCompiler/Compiler/Util/Resources/Library'
+ld: warning: directory not found for option '-L/Users/hudson/.openmodelica/binaries/ErrorExt'
+ld: file not found: @rpath/libzmq.dylib for architecture x86_64
+clang: error: linker command failed with exit code 1 (use -v to see invocation)
+make: *** [testJSON] Error 1
+"

Equation mismatch: omc-diff says:
Line 30: Lexical token differs:
expected: {"a":[true, false, null], "b":[], "c":"", "int":
got:      


== 1 out of 1 tests failed [openmodelica/bootstrapping/JSONParser.mos_temp1386, time: 7]

Powered by Hudson Open Source Continuous Integration Server from the Eclipse Foundation