Hudson logo

Failed

openmodelica_bootstrapping.HashTableTest.mos (from (result.xml))

Failing for the past 3,871 builds (Since #3500 )

Stacktrace

Output mismatch (see stdout for details)

Standard Output

 + HashTable Unit Testing                                                            ... equation mismatch [time: 25]

==== Log /tmp/omc-rtest-hudson/openmodelica/bootstrapping/HashTableTest.mos_temp1711/log-HashTableTest.mos
"
"
""
true
""
true

"Error: Error building simulator. Build log: clang -g  -mfpmath=sse -fno-dollars-in-identifiers   -I"/Users/hudson/slave/workspace/OpenModelica_OSX_BUILD/OpenModelica/build/include/omc/c" "-I/Users/hudson/slave/workspace/OpenModelica_OSX_BUILD/OpenModelica/OMCompiler/Compiler/Util/" -c -o HashTableTest_fn.o HashTableTest_fn.c
/Users/hudson/slave/workspace/OpenModelica_OSX_BUILD/OpenModelica/testsuite/openmodelica/bootstrapping/HashTableTest.mos_temp1711/HashTableTest_fn.c:15287:3: warning: implicit declaration of function 'omc_File_File_destructor' is invalid in C99 [-Wimplicit-function-declaration]
  omc_File_File_destructor(threadData,_file);
  ^
/Users/hudson/slave/workspace/OpenModelica_OSX_BUILD/OpenModelica/testsuite/openmodelica/bootstrapping/HashTableTest.mos_temp1711/HashTableTest_fn.c:42755:3: warning: implicit declaration of function 'omc_System_StringAllocator_destructor' is invalid in C99 [-Wimplicit-function-declaration]
  omc_System_StringAllocator_destructor(threadData,_sb);
  ^
2 warnings generated.
clang -g  -mfpmath=sse -fno-dollars-in-identifiers   -I"/Users/hudson/slave/workspace/OpenModelica_OSX_BUILD/OpenModelica/build/include/omc/c" "-I/Users/hudson/slave/workspace/OpenModelica_OSX_BUILD/OpenModelica/OMCompiler/Compiler/Util/" -c -o HashTableTest_fn_records.o HashTableTest_fn_records.c
clang -single_module -dynamiclib -flat_namespace -o HashTableTest_fn.dylib HashTableTest_fn.o HashTableTest_fn_records.o "-L/Users/hudson/slave/workspace/OpenModelica_OSX_BUILD/OpenModelica/build/lib/x86_64-darwin15.4.0/omc" "-L/Users/hudson/slave/workspace/OpenModelica_OSX_BUILD/OpenModelica/build/lib/" "-L/Users/hudson/.openmodelica/binaries/System" "-L/Users/hudson/slave/workspace/OpenModelica_OSX_BUILD/OpenModelica/OMCompiler/Compiler/Util/Resources/Library/x86_64-darwin" "-L/Users/hudson/slave/workspace/OpenModelica_OSX_BUILD/OpenModelica/OMCompiler/Compiler/Util/Resources/Library/darwin64" "-L/Users/hudson/slave/workspace/OpenModelica_OSX_BUILD/OpenModelica/OMCompiler/Compiler/Util/Resources/Library" -lomcruntime -lexpat -lsqlite3 -llpsolve55 -lcolamd   -lomniORB4 -lomnithread -lpthread -lomcgc "-L/Users/hudson/.openmodelica/binaries/ErrorExt" "-L/Users/hudson/.openmodelica/binaries/Print" -g  -mfpmath=sse -fno-dollars-in-identifiers   -I"/Users/hudson/slave/workspace/OpenModelica_OSX_BUILD/OpenModelica/build/include/omc/c" "-I/Users/hudson/slave/workspace/OpenModelica_OSX_BUILD/OpenModelica/OMCompiler/Compiler/Util/" -L"/Users/hudson/slave/workspace/OpenModelica_OSX_BUILD/OpenModelica/build/lib/x86_64-darwin15.4.0/omc" -Wl,-rpath,'/Users/hudson/slave/workspace/OpenModelica_OSX_BUILD/OpenModelica/build/lib/x86_64-darwin15.4.0/omc'    -L/opt/openmodelica/lib -lOpenModelicaRuntimeC  -lopenblas   -lm -lm
ld: warning: directory not found for option '-L/Users/hudson/.openmodelica/binaries/System'
ld: warning: directory not found for option '-L/Users/hudson/slave/workspace/OpenModelica_OSX_BUILD/OpenModelica/OMCompiler/Compiler/Util/Resources/Library/x86_64-darwin'
ld: warning: directory not found for option '-L/Users/hudson/slave/workspace/OpenModelica_OSX_BUILD/OpenModelica/OMCompiler/Compiler/Util/Resources/Library/darwin64'
ld: warning: directory not found for option '-L/Users/hudson/slave/workspace/OpenModelica_OSX_BUILD/OpenModelica/OMCompiler/Compiler/Util/Resources/Library'
ld: warning: directory not found for option '-L/Users/hudson/.openmodelica/binaries/ErrorExt'
ld: warning: directory not found for option '-L/Users/hudson/.openmodelica/binaries/Print'
ld: file not found: @rpath/libzmq.dylib for architecture x86_64
clang: error: linker command failed with exit code 1 (use -v to see invocation)
make: *** [HashTableTest_fn] Error 1
"

Equation mismatch: diff says:
--- /tmp/omc-rtest-hudson/openmodelica/bootstrapping/HashTableTest.mos_temp1711/equations-expected2019-05-16 21:25:50.000000000 +0200
+++ /tmp/omc-rtest-hudson/openmodelica/bootstrapping/HashTableTest.mos_temp1711/equations-got2019-05-16 21:26:15.000000000 +0200
@@ -2,19 +2,26 @@
 "
 ""
 true
 ""
 true
-({record DAE.Exp.ICONST
-integer = 7
-end DAE.Exp.ICONST;,record DAE.Exp.ICONST
-integer = 3
-end DAE.Exp.ICONST;,record DAE.Exp.ICONST
-integer = 2
-end DAE.Exp.ICONST;,record DAE.Exp.ICONST
-integer = 1
-end DAE.Exp.ICONST;},{record DAE.Exp.ICONST
-integer = 2
-end DAE.Exp.ICONST;,record DAE.Exp.ICONST
-integer = 7
-end DAE.Exp.ICONST;})
-""
+
+"Error: Error building simulator. Build log: clang -g  -mfpmath=sse -fno-dollars-in-identifiers   -I"/Users/hudson/slave/workspace/OpenModelica_OSX_BUILD/OpenModelica/build/include/omc/c" "-I/Users/hudson/slave/workspace/OpenModelica_OSX_BUILD/OpenModelica/OMCompiler/Compiler/Util/" -c -o HashTableTest_fn.o HashTableTest_fn.c
+/Users/hudson/slave/workspace/OpenModelica_OSX_BUILD/OpenModelica/testsuite/openmodelica/bootstrapping/HashTableTest.mos_temp1711/HashTableTest_fn.c:15287:3: warning: implicit declaration of function 'omc_File_File_destructor' is invalid in C99 [-Wimplicit-function-declaration]
+omc_File_File_destructor(threadData,_file);
+^
+/Users/hudson/slave/workspace/OpenModelica_OSX_BUILD/OpenModelica/testsuite/openmodelica/bootstrapping/HashTableTest.mos_temp1711/HashTableTest_fn.c:42755:3: warning: implicit declaration of function 'omc_System_StringAllocator_destructor' is invalid in C99 [-Wimplicit-function-declaration]
+omc_System_StringAllocator_destructor(threadData,_sb);
+^
+2 warnings generated.
+clang -g  -mfpmath=sse -fno-dollars-in-identifiers   -I"/Users/hudson/slave/workspace/OpenModelica_OSX_BUILD/OpenModelica/build/include/omc/c" "-I/Users/hudson/slave/workspace/OpenModelica_OSX_BUILD/OpenModelica/OMCompiler/Compiler/Util/" -c -o HashTableTest_fn_records.o HashTableTest_fn_records.c
+clang -single_module -dynamiclib -flat_namespace -o HashTableTest_fn.dylib HashTableTest_fn.o HashTableTest_fn_records.o "-L/Users/hudson/slave/workspace/OpenModelica_OSX_BUILD/OpenModelica/build/lib/x86_64-darwin15.4.0/omc" "-L/Users/hudson/slave/workspace/OpenModelica_OSX_BUILD/OpenModelica/build/lib/" "-L/Users/hudson/.openmodelica/binaries/System" "-L/Users/hudson/slave/workspace/OpenModelica_OSX_BUILD/OpenModelica/OMCompiler/Compiler/Util/Resources/Library/x86_64-darwin" "-L/Users/hudson/slave/workspace/OpenModelica_OSX_BUILD/OpenModelica/OMCompiler/Compiler/Util/Resources/Library/darwin64" "-L/Users/hudson/slave/workspace/OpenModelica_OSX_BUILD/OpenModelica/OMCompiler/Compiler/Util/Resources/Library" -lomcruntime -lexpat -lsqlite3 -llpsolve55 -lcolamd   -lomniORB4 -lomnithread -lpthread -lomcgc "-L/Users/hudson/.openmodelica/binaries/ErrorExt" "-L/Users/hudson/.openmodelica/binaries/Print" -g  -mfpmath=sse -fno-dollars-in-identifiers   -I"/Users/hudson/slave/workspace/OpenModelica_OSX_BUILD/OpenModelica/build/include/omc/c" "-I/Users/hudson/slave/workspace/OpenModelica_OSX_BUILD/OpenModelica/OMCompiler/Compiler/Util/" -L"/Users/hudson/slave/workspace/OpenModelica_OSX_BUILD/OpenModelica/build/lib/x86_64-darwin15.4.0/omc" -Wl,-rpath,'/Users/hudson/slave/workspace/OpenModelica_OSX_BUILD/OpenModelica/build/lib/x86_64-darwin15.4.0/omc'    -L/opt/openmodelica/lib -lOpenModelicaRuntimeC  -lopenblas   -lm -lm
+ld: warning: directory not found for option '-L/Users/hudson/.openmodelica/binaries/System'
+ld: warning: directory not found for option '-L/Users/hudson/slave/workspace/OpenModelica_OSX_BUILD/OpenModelica/OMCompiler/Compiler/Util/Resources/Library/x86_64-darwin'
+ld: warning: directory not found for option '-L/Users/hudson/slave/workspace/OpenModelica_OSX_BUILD/OpenModelica/OMCompiler/Compiler/Util/Resources/Library/darwin64'
+ld: warning: directory not found for option '-L/Users/hudson/slave/workspace/OpenModelica_OSX_BUILD/OpenModelica/OMCompiler/Compiler/Util/Resources/Library'
+ld: warning: directory not found for option '-L/Users/hudson/.openmodelica/binaries/ErrorExt'
+ld: warning: directory not found for option '-L/Users/hudson/.openmodelica/binaries/Print'
+ld: file not found: @rpath/libzmq.dylib for architecture x86_64
+clang: error: linker command failed with exit code 1 (use -v to see invocation)
+make: *** [HashTableTest_fn] Error 1
+"

Equation mismatch: omc-diff says:
Line 7: Lexical token differs:
expected: ({record DAE.Exp.ICONST
got:      


== 1 out of 1 tests failed [openmodelica/bootstrapping/HashTableTest.mos_temp1711, time: 25]

Powered by Hudson Open Source Continuous Integration Server from the Eclipse Foundation