Hudson logo

Failed

openmodelica_bootstrapping.DumpTest.mos (from (result.xml))

Failing for the past 3,871 builds (Since #3500 )

Stacktrace

Output mismatch (see stdout for details)

Standard Output

 + DumpTest                                                                          ... equation mismatch [time: 101]

==== Log /tmp/omc-rtest-hudson/openmodelica/bootstrapping/DumpTest.mos_temp9941/log-DumpTest.mos
"
"
""
true
""
true
true
"DumpGraphviz.dump"

"Error: Error building simulator. Build log: clang -g  -mfpmath=sse -fno-dollars-in-identifiers   -I"/Users/hudson/slave/workspace/OpenModelica_OSX_BUILD/OpenModelica/build/include/omc/c" "-I/Users/hudson/slave/workspace/OpenModelica_OSX_BUILD/OpenModelica/OMCompiler/Compiler/Util/" -c -o DumpGraphviz_dump.o DumpGraphviz_dump.c
/Users/hudson/slave/workspace/OpenModelica_OSX_BUILD/OpenModelica/testsuite/openmodelica/bootstrapping/DumpTest.mos_temp9941/DumpGraphviz_dump.c:14440:3: warning: implicit declaration of function 'omc_File_File_destructor' is invalid in C99 [-Wimplicit-function-declaration]
  omc_File_File_destructor(threadData,_file);
  ^
/Users/hudson/slave/workspace/OpenModelica_OSX_BUILD/OpenModelica/testsuite/openmodelica/bootstrapping/DumpTest.mos_temp9941/DumpGraphviz_dump.c:36071:3: warning: implicit declaration of function 'omc_System_StringAllocator_destructor' is invalid in C99 [-Wimplicit-function-declaration]
  omc_System_StringAllocator_destructor(threadData,_sb);
  ^
2 warnings generated.
clang -g  -mfpmath=sse -fno-dollars-in-identifiers   -I"/Users/hudson/slave/workspace/OpenModelica_OSX_BUILD/OpenModelica/build/include/omc/c" "-I/Users/hudson/slave/workspace/OpenModelica_OSX_BUILD/OpenModelica/OMCompiler/Compiler/Util/" -c -o DumpGraphviz_dump_records.o DumpGraphviz_dump_records.c
clang -single_module -dynamiclib -flat_namespace -o DumpGraphviz_dump.dylib DumpGraphviz_dump.o DumpGraphviz_dump_records.o "-L/Users/hudson/slave/workspace/OpenModelica_OSX_BUILD/OpenModelica/build/lib/x86_64-darwin15.4.0/omc" "-L/Users/hudson/slave/workspace/OpenModelica_OSX_BUILD/OpenModelica/build/lib/" "-L/Users/hudson/.openmodelica/binaries/System" "-L/Users/hudson/slave/workspace/OpenModelica_OSX_BUILD/OpenModelica/OMCompiler/Compiler/Util/Resources/Library/x86_64-darwin" "-L/Users/hudson/slave/workspace/OpenModelica_OSX_BUILD/OpenModelica/OMCompiler/Compiler/Util/Resources/Library/darwin64" "-L/Users/hudson/slave/workspace/OpenModelica_OSX_BUILD/OpenModelica/OMCompiler/Compiler/Util/Resources/Library" -lomcruntime -lexpat -lsqlite3 -llpsolve55 -lcolamd   -lomniORB4 -lomnithread -lpthread -lomcgc "-L/Users/hudson/.openmodelica/binaries/ErrorExt" "-L/Users/hudson/.openmodelica/binaries/Print" -g  -mfpmath=sse -fno-dollars-in-identifiers   -I"/Users/hudson/slave/workspace/OpenModelica_OSX_BUILD/OpenModelica/build/include/omc/c" "-I/Users/hudson/slave/workspace/OpenModelica_OSX_BUILD/OpenModelica/OMCompiler/Compiler/Util/" -L"/Users/hudson/slave/workspace/OpenModelica_OSX_BUILD/OpenModelica/build/lib/x86_64-darwin15.4.0/omc" -Wl,-rpath,'/Users/hudson/slave/workspace/OpenModelica_OSX_BUILD/OpenModelica/build/lib/x86_64-darwin15.4.0/omc'    -L/opt/openmodelica/lib -lOpenModelicaRuntimeC  -lopenblas   -lm -lm
ld: warning: directory not found for option '-L/Users/hudson/.openmodelica/binaries/System'
ld: warning: directory not found for option '-L/Users/hudson/slave/workspace/OpenModelica_OSX_BUILD/OpenModelica/OMCompiler/Compiler/Util/Resources/Library/x86_64-darwin'
ld: warning: directory not found for option '-L/Users/hudson/slave/workspace/OpenModelica_OSX_BUILD/OpenModelica/OMCompiler/Compiler/Util/Resources/Library/darwin64'
ld: warning: directory not found for option '-L/Users/hudson/slave/workspace/OpenModelica_OSX_BUILD/OpenModelica/OMCompiler/Compiler/Util/Resources/Library'
ld: warning: directory not found for option '-L/Users/hudson/.openmodelica/binaries/ErrorExt'
ld: warning: directory not found for option '-L/Users/hudson/.openmodelica/binaries/Print'
ld: file not found: @rpath/libzmq.dylib for architecture x86_64
clang: error: linker command failed with exit code 1 (use -v to see invocation)
make: *** [DumpGraphviz_dump] Error 1
"
"Dump.dump"

"Error: Error building simulator. Build log: clang -g  -mfpmath=sse -fno-dollars-in-identifiers   -I"/Users/hudson/slave/workspace/OpenModelica_OSX_BUILD/OpenModelica/build/include/omc/c" "-I/Users/hudson/slave/workspace/OpenModelica_OSX_BUILD/OpenModelica/OMCompiler/Compiler/Util/" -c -o DumpTest_dump.o DumpTest_dump.c
/Users/hudson/slave/workspace/OpenModelica_OSX_BUILD/OpenModelica/testsuite/openmodelica/bootstrapping/DumpTest.mos_temp9941/DumpTest_dump.c:10231:3: warning: implicit declaration of function 'omc_System_StringAllocator_destructor' is invalid in C99 [-Wimplicit-function-declaration]
  omc_System_StringAllocator_destructor(threadData,_sb);
  ^
/Users/hudson/slave/workspace/OpenModelica_OSX_BUILD/OpenModelica/testsuite/openmodelica/bootstrapping/DumpTest.mos_temp9941/DumpTest_dump.c:16777:3: warning: implicit declaration of function 'omc_File_File_destructor' is invalid in C99 [-Wimplicit-function-declaration]
  omc_File_File_destructor(threadData,_file);
  ^
2 warnings generated.
clang -g  -mfpmath=sse -fno-dollars-in-identifiers   -I"/Users/hudson/slave/workspace/OpenModelica_OSX_BUILD/OpenModelica/build/include/omc/c" "-I/Users/hudson/slave/workspace/OpenModelica_OSX_BUILD/OpenModelica/OMCompiler/Compiler/Util/" -c -o DumpTest_dump_records.o DumpTest_dump_records.c
clang -single_module -dynamiclib -flat_namespace -o DumpTest_dump.dylib DumpTest_dump.o DumpTest_dump_records.o "-L/Users/hudson/slave/workspace/OpenModelica_OSX_BUILD/OpenModelica/build/lib/x86_64-darwin15.4.0/omc" "-L/Users/hudson/slave/workspace/OpenModelica_OSX_BUILD/OpenModelica/build/lib/" "-L/Users/hudson/.openmodelica/binaries/Print" "-L/Users/hudson/slave/workspace/OpenModelica_OSX_BUILD/OpenModelica/OMCompiler/Compiler/Util/Resources/Library/x86_64-darwin" "-L/Users/hudson/slave/workspace/OpenModelica_OSX_BUILD/OpenModelica/OMCompiler/Compiler/Util/Resources/Library/darwin64" "-L/Users/hudson/slave/workspace/OpenModelica_OSX_BUILD/OpenModelica/OMCompiler/Compiler/Util/Resources/Library" -lomcruntime -lexpat -lsqlite3 -llpsolve55 -lcolamd   -lomniORB4 -lomnithread -lpthread -lomcgc "-L/Users/hudson/.openmodelica/binaries/System" "-L/Users/hudson/.openmodelica/binaries/ErrorExt" -g  -mfpmath=sse -fno-dollars-in-identifiers   -I"/Users/hudson/slave/workspace/OpenModelica_OSX_BUILD/OpenModelica/build/include/omc/c" "-I/Users/hudson/slave/workspace/OpenModelica_OSX_BUILD/OpenModelica/OMCompiler/Compiler/Util/" -L"/Users/hudson/slave/workspace/OpenModelica_OSX_BUILD/OpenModelica/build/lib/x86_64-darwin15.4.0/omc" -Wl,-rpath,'/Users/hudson/slave/workspace/OpenModelica_OSX_BUILD/OpenModelica/build/lib/x86_64-darwin15.4.0/omc'    -L/opt/openmodelica/lib -lOpenModelicaRuntimeC  -lopenblas   -lm -lm
ld: warning: directory not found for option '-L/Users/hudson/.openmodelica/binaries/Print'
ld: warning: directory not found for option '-L/Users/hudson/slave/workspace/OpenModelica_OSX_BUILD/OpenModelica/OMCompiler/Compiler/Util/Resources/Library/x86_64-darwin'
ld: warning: directory not found for option '-L/Users/hudson/slave/workspace/OpenModelica_OSX_BUILD/OpenModelica/OMCompiler/Compiler/Util/Resources/Library/darwin64'
ld: warning: directory not found for option '-L/Users/hudson/slave/workspace/OpenModelica_OSX_BUILD/OpenModelica/OMCompiler/Compiler/Util/Resources/Library'
ld: warning: directory not found for option '-L/Users/hudson/.openmodelica/binaries/System'
ld: warning: directory not found for option '-L/Users/hudson/.openmodelica/binaries/ErrorExt'
ld: file not found: @rpath/libzmq.dylib for architecture x86_64
clang: error: linker command failed with exit code 1 (use -v to see invocation)
make: *** [DumpTest_dump] Error 1
"
"Dump.unparseStr"

"Error: Error building simulator. Build log: clang -g  -mfpmath=sse -fno-dollars-in-identifiers   -I"/Users/hudson/slave/workspace/OpenModelica_OSX_BUILD/OpenModelica/build/include/omc/c" "-I/Users/hudson/slave/workspace/OpenModelica_OSX_BUILD/OpenModelica/OMCompiler/Compiler/Util/" -c -o Dump_unparseStr.o Dump_unparseStr.c
/Users/hudson/slave/workspace/OpenModelica_OSX_BUILD/OpenModelica/testsuite/openmodelica/bootstrapping/DumpTest.mos_temp9941/Dump_unparseStr.c:11911:3: warning: implicit declaration of function 'omc_File_File_destructor' is invalid in C99 [-Wimplicit-function-declaration]
  omc_File_File_destructor(threadData,_file);
  ^
1 warning generated.
clang -g  -mfpmath=sse -fno-dollars-in-identifiers   -I"/Users/hudson/slave/workspace/OpenModelica_OSX_BUILD/OpenModelica/build/include/omc/c" "-I/Users/hudson/slave/workspace/OpenModelica_OSX_BUILD/OpenModelica/OMCompiler/Compiler/Util/" -c -o Dump_unparseStr_records.o Dump_unparseStr_records.c
clang -single_module -dynamiclib -flat_namespace -o Dump_unparseStr.dylib Dump_unparseStr.o Dump_unparseStr_records.o "-L/Users/hudson/slave/workspace/OpenModelica_OSX_BUILD/OpenModelica/build/lib/x86_64-darwin15.4.0/omc" "-L/Users/hudson/slave/workspace/OpenModelica_OSX_BUILD/OpenModelica/build/lib/" "-L/Users/hudson/.openmodelica/binaries/System" "-L/Users/hudson/slave/workspace/OpenModelica_OSX_BUILD/OpenModelica/OMCompiler/Compiler/Util/Resources/Library/x86_64-darwin" "-L/Users/hudson/slave/workspace/OpenModelica_OSX_BUILD/OpenModelica/OMCompiler/Compiler/Util/Resources/Library/darwin64" "-L/Users/hudson/slave/workspace/OpenModelica_OSX_BUILD/OpenModelica/OMCompiler/Compiler/Util/Resources/Library" -lomcruntime -lexpat -lsqlite3 -llpsolve55 -lcolamd   -lomniORB4 -lomnithread -lpthread -lomcgc "-L/Users/hudson/.openmodelica/binaries/ErrorExt" "-L/Users/hudson/.openmodelica/binaries/Print" -g  -mfpmath=sse -fno-dollars-in-identifiers   -I"/Users/hudson/slave/workspace/OpenModelica_OSX_BUILD/OpenModelica/build/include/omc/c" "-I/Users/hudson/slave/workspace/OpenModelica_OSX_BUILD/OpenModelica/OMCompiler/Compiler/Util/" -L"/Users/hudson/slave/workspace/OpenModelica_OSX_BUILD/OpenModelica/build/lib/x86_64-darwin15.4.0/omc" -Wl,-rpath,'/Users/hudson/slave/workspace/OpenModelica_OSX_BUILD/OpenModelica/build/lib/x86_64-darwin15.4.0/omc'    -L/opt/openmodelica/lib -lOpenModelicaRuntimeC  -lopenblas   -lm -lm
ld: warning: directory not found for option '-L/Users/hudson/.openmodelica/binaries/System'
ld: warning: directory not found for option '-L/Users/hudson/slave/workspace/OpenModelica_OSX_BUILD/OpenModelica/OMCompiler/Compiler/Util/Resources/Library/x86_64-darwin'
ld: warning: directory not found for option '-L/Users/hudson/slave/workspace/OpenModelica_OSX_BUILD/OpenModelica/OMCompiler/Compiler/Util/Resources/Library/darwin64'
ld: warning: directory not found for option '-L/Users/hudson/slave/workspace/OpenModelica_OSX_BUILD/OpenModelica/OMCompiler/Compiler/Util/Resources/Library'
ld: warning: directory not found for option '-L/Users/hudson/.openmodelica/binaries/ErrorExt'
ld: warning: directory not found for option '-L/Users/hudson/.openmodelica/binaries/Print'
ld: file not found: @rpath/libzmq.dylib for architecture x86_64
clang: error: linker command failed with exit code 1 (use -v to see invocation)
make: *** [Dump_unparseStr] Error 1
"
"Dump.getAstAsCorbaString"

"Error: Error building simulator. Build log: clang -g  -mfpmath=sse -fno-dollars-in-identifiers   -I"/Users/hudson/slave/workspace/OpenModelica_OSX_BUILD/OpenModelica/build/include/omc/c"  -c -o DumpTest_getAstAsCorbaString.o DumpTest_getAstAsCorbaString.c
clang -g  -mfpmath=sse -fno-dollars-in-identifiers   -I"/Users/hudson/slave/workspace/OpenModelica_OSX_BUILD/OpenModelica/build/include/omc/c"  -c -o DumpTest_getAstAsCorbaString_records.o DumpTest_getAstAsCorbaString_records.c
clang -single_module -dynamiclib -flat_namespace -o DumpTest_getAstAsCorbaString.dylib DumpTest_getAstAsCorbaString.o DumpTest_getAstAsCorbaString_records.o "-L/Users/hudson/slave/workspace/OpenModelica_OSX_BUILD/OpenModelica/build/lib/x86_64-darwin15.4.0/omc" "-L/Users/hudson/slave/workspace/OpenModelica_OSX_BUILD/OpenModelica/build/lib/" "-L/Users/hudson/.openmodelica/binaries/System" "-L/Users/hudson/slave/workspace/OpenModelica_OSX_BUILD/OpenModelica/OMCompiler/Compiler/Util/Resources/Library/x86_64-darwin" "-L/Users/hudson/slave/workspace/OpenModelica_OSX_BUILD/OpenModelica/OMCompiler/Compiler/Util/Resources/Library/darwin64" "-L/Users/hudson/slave/workspace/OpenModelica_OSX_BUILD/OpenModelica/OMCompiler/Compiler/Util/Resources/Library" -lomcruntime -lexpat -lsqlite3 -llpsolve55 -lcolamd   -lomniORB4 -lomnithread -lpthread -lomcgc "-L/Users/hudson/.openmodelica/binaries/ErrorExt" "-L/Users/hudson/.openmodelica/binaries/Print" -g  -mfpmath=sse -fno-dollars-in-identifiers   -I"/Users/hudson/slave/workspace/OpenModelica_OSX_BUILD/OpenModelica/build/include/omc/c"  -L"/Users/hudson/slave/workspace/OpenModelica_OSX_BUILD/OpenModelica/build/lib/x86_64-darwin15.4.0/omc" -Wl,-rpath,'/Users/hudson/slave/workspace/OpenModelica_OSX_BUILD/OpenModelica/build/lib/x86_64-darwin15.4.0/omc'    -L/opt/openmodelica/lib -lOpenModelicaRuntimeC  -lopenblas   -lm -lm
ld: warning: directory not found for option '-L/Users/hudson/.openmodelica/binaries/System'
ld: warning: directory not found for option '-L/Users/hudson/slave/workspace/OpenModelica_OSX_BUILD/OpenModelica/OMCompiler/Compiler/Util/Resources/Library/x86_64-darwin'
ld: warning: directory not found for option '-L/Users/hudson/slave/workspace/OpenModelica_OSX_BUILD/OpenModelica/OMCompiler/Compiler/Util/Resources/Library/darwin64'
ld: warning: directory not found for option '-L/Users/hudson/slave/workspace/OpenModelica_OSX_BUILD/OpenModelica/OMCompiler/Compiler/Util/Resources/Library'
ld: warning: directory not found for option '-L/Users/hudson/.openmodelica/binaries/ErrorExt'
ld: warning: directory not found for option '-L/Users/hudson/.openmodelica/binaries/Print'
ld: file not found: @rpath/libzmq.dylib for architecture x86_64
clang: error: linker command failed with exit code 1 (use -v to see invocation)
make: *** [DumpTest_getAstAsCorbaString] Error 1
"
record DAE.Exp.ICONST
    integer = 42
end DAE.Exp.ICONST;
""
"ExpressionDump.printExpStr"

"Error: Error building simulator. Build log: clang -g  -mfpmath=sse -fno-dollars-in-identifiers   -I"/Users/hudson/slave/workspace/OpenModelica_OSX_BUILD/OpenModelica/build/include/omc/c" "-I/Users/hudson/slave/workspace/OpenModelica_OSX_BUILD/OpenModelica/OMCompiler/Compiler/Util/" -c -o ExpressionDump_printExpStr.o ExpressionDump_printExpStr.c
/Users/hudson/slave/workspace/OpenModelica_OSX_BUILD/OpenModelica/testsuite/openmodelica/bootstrapping/DumpTest.mos_temp9941/ExpressionDump_printExpStr.c:14455:3: warning: implicit declaration of function 'omc_File_File_destructor' is invalid in C99 [-Wimplicit-function-declaration]
  omc_File_File_destructor(threadData,_file);
  ^
/Users/hudson/slave/workspace/OpenModelica_OSX_BUILD/OpenModelica/testsuite/openmodelica/bootstrapping/DumpTest.mos_temp9941/ExpressionDump_printExpStr.c:41923:3: warning: implicit declaration of function 'omc_System_StringAllocator_destructor' is invalid in C99 [-Wimplicit-function-declaration]
  omc_System_StringAllocator_destructor(threadData,_sb);
  ^
2 warnings generated.
clang -g  -mfpmath=sse -fno-dollars-in-identifiers   -I"/Users/hudson/slave/workspace/OpenModelica_OSX_BUILD/OpenModelica/build/include/omc/c" "-I/Users/hudson/slave/workspace/OpenModelica_OSX_BUILD/OpenModelica/OMCompiler/Compiler/Util/" -c -o ExpressionDump_printExpStr_records.o ExpressionDump_printExpStr_records.c
clang -single_module -dynamiclib -flat_namespace -o ExpressionDump_printExpStr.dylib ExpressionDump_printExpStr.o ExpressionDump_printExpStr_records.o "-L/Users/hudson/slave/workspace/OpenModelica_OSX_BUILD/OpenModelica/build/lib/x86_64-darwin15.4.0/omc" "-L/Users/hudson/slave/workspace/OpenModelica_OSX_BUILD/OpenModelica/build/lib/" "-L/Users/hudson/.openmodelica/binaries/System" "-L/Users/hudson/slave/workspace/OpenModelica_OSX_BUILD/OpenModelica/OMCompiler/Compiler/Util/Resources/Library/x86_64-darwin" "-L/Users/hudson/slave/workspace/OpenModelica_OSX_BUILD/OpenModelica/OMCompiler/Compiler/Util/Resources/Library/darwin64" "-L/Users/hudson/slave/workspace/OpenModelica_OSX_BUILD/OpenModelica/OMCompiler/Compiler/Util/Resources/Library" -lomcruntime -lexpat -lsqlite3 -llpsolve55 -lcolamd   -lomniORB4 -lomnithread -lpthread -lomcgc "-L/Users/hudson/.openmodelica/binaries/ErrorExt" "-L/Users/hudson/.openmodelica/binaries/Print" -g  -mfpmath=sse -fno-dollars-in-identifiers   -I"/Users/hudson/slave/workspace/OpenModelica_OSX_BUILD/OpenModelica/build/include/omc/c" "-I/Users/hudson/slave/workspace/OpenModelica_OSX_BUILD/OpenModelica/OMCompiler/Compiler/Util/" -L"/Users/hudson/slave/workspace/OpenModelica_OSX_BUILD/OpenModelica/build/lib/x86_64-darwin15.4.0/omc" -Wl,-rpath,'/Users/hudson/slave/workspace/OpenModelica_OSX_BUILD/OpenModelica/build/lib/x86_64-darwin15.4.0/omc'    -L/opt/openmodelica/lib -lOpenModelicaRuntimeC  -lopenblas   -lm -lm
ld: warning: directory not found for option '-L/Users/hudson/.openmodelica/binaries/System'
ld: warning: directory not found for option '-L/Users/hudson/slave/workspace/OpenModelica_OSX_BUILD/OpenModelica/OMCompiler/Compiler/Util/Resources/Library/x86_64-darwin'
ld: warning: directory not found for option '-L/Users/hudson/slave/workspace/OpenModelica_OSX_BUILD/OpenModelica/OMCompiler/Compiler/Util/Resources/Library/darwin64'
ld: warning: directory not found for option '-L/Users/hudson/slave/workspace/OpenModelica_OSX_BUILD/OpenModelica/OMCompiler/Compiler/Util/Resources/Library'
ld: warning: directory not found for option '-L/Users/hudson/.openmodelica/binaries/ErrorExt'
ld: warning: directory not found for option '-L/Users/hudson/.openmodelica/binaries/Print'
ld: file not found: @rpath/libzmq.dylib for architecture x86_64
clang: error: linker command failed with exit code 1 (use -v to see invocation)
make: *** [ExpressionDump_printExpStr] Error 1
"
record DAE.DAElist.DAE
    elementLst = {}
end DAE.DAElist.DAE;
""
"DAEDump.dumpDebugDAE"

"Error: Error building simulator. Build log: clang -g  -mfpmath=sse -fno-dollars-in-identifiers   -I"/Users/hudson/slave/workspace/OpenModelica_OSX_BUILD/OpenModelica/build/include/omc/c" "-I/Users/hudson/slave/workspace/OpenModelica_OSX_BUILD/OpenModelica/OMCompiler/Compiler/Util/" -c -o DAEDump_dumpDebugDAE.o DAEDump_dumpDebugDAE.c
/Users/hudson/slave/workspace/OpenModelica_OSX_BUILD/OpenModelica/testsuite/openmodelica/bootstrapping/DumpTest.mos_temp9941/DAEDump_dumpDebugDAE.c:16190:3: warning: implicit declaration of function 'omc_File_File_destructor' is invalid in C99 [-Wimplicit-function-declaration]
  omc_File_File_destructor(threadData,_file);
  ^
/Users/hudson/slave/workspace/OpenModelica_OSX_BUILD/OpenModelica/testsuite/openmodelica/bootstrapping/DumpTest.mos_temp9941/DAEDump_dumpDebugDAE.c:43818:3: warning: implicit declaration of function 'omc_System_StringAllocator_destructor' is invalid in C99 [-Wimplicit-function-declaration]
  omc_System_StringAllocator_destructor(threadData,_sb);
  ^
2 warnings generated.
clang -g  -mfpmath=sse -fno-dollars-in-identifiers   -I"/Users/hudson/slave/workspace/OpenModelica_OSX_BUILD/OpenModelica/build/include/omc/c" "-I/Users/hudson/slave/workspace/OpenModelica_OSX_BUILD/OpenModelica/OMCompiler/Compiler/Util/" -c -o DAEDump_dumpDebugDAE_records.o DAEDump_dumpDebugDAE_records.c
clang -single_module -dynamiclib -flat_namespace -o DAEDump_dumpDebugDAE.dylib DAEDump_dumpDebugDAE.o DAEDump_dumpDebugDAE_records.o "-L/Users/hudson/slave/workspace/OpenModelica_OSX_BUILD/OpenModelica/build/lib/x86_64-darwin15.4.0/omc" "-L/Users/hudson/slave/workspace/OpenModelica_OSX_BUILD/OpenModelica/build/lib/" "-L/Users/hudson/.openmodelica/binaries/Print" "-L/Users/hudson/slave/workspace/OpenModelica_OSX_BUILD/OpenModelica/OMCompiler/Compiler/Util/Resources/Library/x86_64-darwin" "-L/Users/hudson/slave/workspace/OpenModelica_OSX_BUILD/OpenModelica/OMCompiler/Compiler/Util/Resources/Library/darwin64" "-L/Users/hudson/slave/workspace/OpenModelica_OSX_BUILD/OpenModelica/OMCompiler/Compiler/Util/Resources/Library" -lomcruntime -lexpat -lsqlite3 -llpsolve55 -lcolamd   -lomniORB4 -lomnithread -lpthread -lomcgc "-L/Users/hudson/.openmodelica/binaries/System" "-L/Users/hudson/.openmodelica/binaries/ErrorExt" -g  -mfpmath=sse -fno-dollars-in-identifiers   -I"/Users/hudson/slave/workspace/OpenModelica_OSX_BUILD/OpenModelica/build/include/omc/c" "-I/Users/hudson/slave/workspace/OpenModelica_OSX_BUILD/OpenModelica/OMCompiler/Compiler/Util/" -L"/Users/hudson/slave/workspace/OpenModelica_OSX_BUILD/OpenModelica/build/lib/x86_64-darwin15.4.0/omc" -Wl,-rpath,'/Users/hudson/slave/workspace/OpenModelica_OSX_BUILD/OpenModelica/build/lib/x86_64-darwin15.4.0/omc'    -L/opt/openmodelica/lib -lOpenModelicaRuntimeC  -lopenblas   -lm -lm
ld: warning: directory not found for option '-L/Users/hudson/.openmodelica/binaries/Print'
ld: warning: directory not found for option '-L/Users/hudson/slave/workspace/OpenModelica_OSX_BUILD/OpenModelica/OMCompiler/Compiler/Util/Resources/Library/x86_64-darwin'
ld: warning: directory not found for option '-L/Users/hudson/slave/workspace/OpenModelica_OSX_BUILD/OpenModelica/OMCompiler/Compiler/Util/Resources/Library/darwin64'
ld: warning: directory not found for option '-L/Users/hudson/slave/workspace/OpenModelica_OSX_BUILD/OpenModelica/OMCompiler/Compiler/Util/Resources/Library'
ld: warning: directory not found for option '-L/Users/hudson/.openmodelica/binaries/System'
ld: warning: directory not found for option '-L/Users/hudson/.openmodelica/binaries/ErrorExt'
ld: file not found: @rpath/libzmq.dylib for architecture x86_64
clang: error: linker command failed with exit code 1 (use -v to see invocation)
make: *** [DAEDump_dumpDebugDAE] Error 1
"
record Values.Value.INTEGER
    integer = 42
end Values.Value.INTEGER;
""
"ValuesUtil.valString"

"Error: Error building simulator. Build log: clang -g  -mfpmath=sse -fno-dollars-in-identifiers   -I"/Users/hudson/slave/workspace/OpenModelica_OSX_BUILD/OpenModelica/build/include/omc/c" "-I/Users/hudson/slave/workspace/OpenModelica_OSX_BUILD/OpenModelica/OMCompiler/Compiler/Util/" -c -o ValuesUtil_valString.o ValuesUtil_valString.c
/Users/hudson/slave/workspace/OpenModelica_OSX_BUILD/OpenModelica/testsuite/openmodelica/bootstrapping/DumpTest.mos_temp9941/ValuesUtil_valString.c:9598:3: warning: implicit declaration of function 'omc_System_StringAllocator_destructor' is invalid in C99 [-Wimplicit-function-declaration]
  omc_System_StringAllocator_destructor(threadData,_sb);
  ^
/Users/hudson/slave/workspace/OpenModelica_OSX_BUILD/OpenModelica/testsuite/openmodelica/bootstrapping/DumpTest.mos_temp9941/ValuesUtil_valString.c:13380:3: warning: implicit declaration of function 'omc_File_File_destructor' is invalid in C99 [-Wimplicit-function-declaration]
  omc_File_File_destructor(threadData,_file);
  ^
2 warnings generated.
clang -g  -mfpmath=sse -fno-dollars-in-identifiers   -I"/Users/hudson/slave/workspace/OpenModelica_OSX_BUILD/OpenModelica/build/include/omc/c" "-I/Users/hudson/slave/workspace/OpenModelica_OSX_BUILD/OpenModelica/OMCompiler/Compiler/Util/" -c -o ValuesUtil_valString_records.o ValuesUtil_valString_records.c
clang -single_module -dynamiclib -flat_namespace -o ValuesUtil_valString.dylib ValuesUtil_valString.o ValuesUtil_valString_records.o "-L/Users/hudson/slave/workspace/OpenModelica_OSX_BUILD/OpenModelica/build/lib/x86_64-darwin15.4.0/omc" "-L/Users/hudson/slave/workspace/OpenModelica_OSX_BUILD/OpenModelica/build/lib/" "-L/Users/hudson/.openmodelica/binaries/System" "-L/Users/hudson/slave/workspace/OpenModelica_OSX_BUILD/OpenModelica/OMCompiler/Compiler/Util/Resources/Library/x86_64-darwin" "-L/Users/hudson/slave/workspace/OpenModelica_OSX_BUILD/OpenModelica/OMCompiler/Compiler/Util/Resources/Library/darwin64" "-L/Users/hudson/slave/workspace/OpenModelica_OSX_BUILD/OpenModelica/OMCompiler/Compiler/Util/Resources/Library" -lomcruntime -lexpat -lsqlite3 -llpsolve55 -lcolamd   -lomniORB4 -lomnithread -lpthread -lomcgc "-L/Users/hudson/.openmodelica/binaries/ErrorExt" "-L/Users/hudson/.openmodelica/binaries/Print" -g  -mfpmath=sse -fno-dollars-in-identifiers   -I"/Users/hudson/slave/workspace/OpenModelica_OSX_BUILD/OpenModelica/build/include/omc/c" "-I/Users/hudson/slave/workspace/OpenModelica_OSX_BUILD/OpenModelica/OMCompiler/Compiler/Util/" -L"/Users/hudson/slave/workspace/OpenModelica_OSX_BUILD/OpenModelica/build/lib/x86_64-darwin15.4.0/omc" -Wl,-rpath,'/Users/hudson/slave/workspace/OpenModelica_OSX_BUILD/OpenModelica/build/lib/x86_64-darwin15.4.0/omc'    -L/opt/openmodelica/lib -lOpenModelicaRuntimeC  -lopenblas   -lm -lm
ld: warning: directory not found for option '-L/Users/hudson/.openmodelica/binaries/System'
ld: warning: directory not found for option '-L/Users/hudson/slave/workspace/OpenModelica_OSX_BUILD/OpenModelica/OMCompiler/Compiler/Util/Resources/Library/x86_64-darwin'
ld: warning: directory not found for option '-L/Users/hudson/slave/workspace/OpenModelica_OSX_BUILD/OpenModelica/OMCompiler/Compiler/Util/Resources/Library/darwin64'
ld: warning: directory not found for option '-L/Users/hudson/slave/workspace/OpenModelica_OSX_BUILD/OpenModelica/OMCompiler/Compiler/Util/Resources/Library'
ld: warning: directory not found for option '-L/Users/hudson/.openmodelica/binaries/ErrorExt'
ld: warning: directory not found for option '-L/Users/hudson/.openmodelica/binaries/Print'
ld: file not found: @rpath/libzmq.dylib for architecture x86_64
clang: error: linker command failed with exit code 1 (use -v to see invocation)
make: *** [ValuesUtil_valString] Error 1
"

Equation mismatch: diff says:
--- /tmp/omc-rtest-hudson/openmodelica/bootstrapping/DumpTest.mos_temp9941/equations-expected2019-05-16 21:10:56.000000000 +0200
+++ /tmp/omc-rtest-hudson/openmodelica/bootstrapping/DumpTest.mos_temp9941/equations-got2019-05-16 21:12:37.000000000 +0200
@@ -4,47 +4,160 @@
 true
 ""
 true
 true
 "DumpGraphviz.dump"
-graph AST {
-GVNOD0[label="ROOT"];GVNOD1[label="PURE FUNCTION"];GVNOD1 -- GVNOD0;
-}
 
-""
+"Error: Error building simulator. Build log: clang -g  -mfpmath=sse -fno-dollars-in-identifiers   -I"/Users/hudson/slave/workspace/OpenModelica_OSX_BUILD/OpenModelica/build/include/omc/c" "-I/Users/hudson/slave/workspace/OpenModelica_OSX_BUILD/OpenModelica/OMCompiler/Compiler/Util/" -c -o DumpGraphviz_dump.o DumpGraphviz_dump.c
+/Users/hudson/slave/workspace/OpenModelica_OSX_BUILD/OpenModelica/testsuite/openmodelica/bootstrapping/DumpTest.mos_temp9941/DumpGraphviz_dump.c:14440:3: warning: implicit declaration of function 'omc_File_File_destructor' is invalid in C99 [-Wimplicit-function-declaration]
+omc_File_File_destructor(threadData,_file);
+^
+/Users/hudson/slave/workspace/OpenModelica_OSX_BUILD/OpenModelica/testsuite/openmodelica/bootstrapping/DumpTest.mos_temp9941/DumpGraphviz_dump.c:36071:3: warning: implicit declaration of function 'omc_System_StringAllocator_destructor' is invalid in C99 [-Wimplicit-function-declaration]
+omc_System_StringAllocator_destructor(threadData,_sb);
+^
+2 warnings generated.
+clang -g  -mfpmath=sse -fno-dollars-in-identifiers   -I"/Users/hudson/slave/workspace/OpenModelica_OSX_BUILD/OpenModelica/build/include/omc/c" "-I/Users/hudson/slave/workspace/OpenModelica_OSX_BUILD/OpenModelica/OMCompiler/Compiler/Util/" -c -o DumpGraphviz_dump_records.o DumpGraphviz_dump_records.c
+clang -single_module -dynamiclib -flat_namespace -o DumpGraphviz_dump.dylib DumpGraphviz_dump.o DumpGraphviz_dump_records.o "-L/Users/hudson/slave/workspace/OpenModelica_OSX_BUILD/OpenModelica/build/lib/x86_64-darwin15.4.0/omc" "-L/Users/hudson/slave/workspace/OpenModelica_OSX_BUILD/OpenModelica/build/lib/" "-L/Users/hudson/.openmodelica/binaries/System" "-L/Users/hudson/slave/workspace/OpenModelica_OSX_BUILD/OpenModelica/OMCompiler/Compiler/Util/Resources/Library/x86_64-darwin" "-L/Users/hudson/slave/workspace/OpenModelica_OSX_BUILD/OpenModelica/OMCompiler/Compiler/Util/Resources/Library/darwin64" "-L/Users/hudson/slave/workspace/OpenModelica_OSX_BUILD/OpenModelica/OMCompiler/Compiler/Util/Resources/Library" -lomcruntime -lexpat -lsqlite3 -llpsolve55 -lcolamd   -lomniORB4 -lomnithread -lpthread -lomcgc "-L/Users/hudson/.openmodelica/binaries/ErrorExt" "-L/Users/hudson/.openmodelica/binaries/Print" -g  -mfpmath=sse -fno-dollars-in-identifiers   -I"/Users/hudson/slave/workspace/OpenModelica_OSX_BUILD/OpenModelica/build/include/omc/c" "-I/Users/hudson/slave/workspace/OpenModelica_OSX_BUILD/OpenModelica/OMCompiler/Compiler/Util/" -L"/Users/hudson/slave/workspace/OpenModelica_OSX_BUILD/OpenModelica/build/lib/x86_64-darwin15.4.0/omc" -Wl,-rpath,'/Users/hudson/slave/workspace/OpenModelica_OSX_BUILD/OpenModelica/build/lib/x86_64-darwin15.4.0/omc'    -L/opt/openmodelica/lib -lOpenModelicaRuntimeC  -lopenblas   -lm -lm
+ld: warning: directory not found for option '-L/Users/hudson/.openmodelica/binaries/System'
+ld: warning: directory not found for option '-L/Users/hudson/slave/workspace/OpenModelica_OSX_BUILD/OpenModelica/OMCompiler/Compiler/Util/Resources/Library/x86_64-darwin'
+ld: warning: directory not found for option '-L/Users/hudson/slave/workspace/OpenModelica_OSX_BUILD/OpenModelica/OMCompiler/Compiler/Util/Resources/Library/darwin64'
+ld: warning: directory not found for option '-L/Users/hudson/slave/workspace/OpenModelica_OSX_BUILD/OpenModelica/OMCompiler/Compiler/Util/Resources/Library'
+ld: warning: directory not found for option '-L/Users/hudson/.openmodelica/binaries/ErrorExt'
+ld: warning: directory not found for option '-L/Users/hudson/.openmodelica/binaries/Print'
+ld: file not found: @rpath/libzmq.dylib for architecture x86_64
+clang: error: linker command failed with exit code 1 (use -v to see invocation)
+make: *** [DumpGraphviz_dump] Error 1
+"
 "Dump.dump"
-"Absyn.PROGRAM([
-Absyn.CLASS(\"dummyClass\", true, true, true, Absyn.R_FUNCTION(Absyn.FR_NORMAL_FUNCTION(Absyn.PURE)), Absyn.PARTS([], NONE()), SOURCEINFO(\"\", false, 0, 0, 0, 0))
-],Absyn.TOP)
+
+"Error: Error building simulator. Build log: clang -g  -mfpmath=sse -fno-dollars-in-identifiers   -I"/Users/hudson/slave/workspace/OpenModelica_OSX_BUILD/OpenModelica/build/include/omc/c" "-I/Users/hudson/slave/workspace/OpenModelica_OSX_BUILD/OpenModelica/OMCompiler/Compiler/Util/" -c -o DumpTest_dump.o DumpTest_dump.c
+/Users/hudson/slave/workspace/OpenModelica_OSX_BUILD/OpenModelica/testsuite/openmodelica/bootstrapping/DumpTest.mos_temp9941/DumpTest_dump.c:10231:3: warning: implicit declaration of function 'omc_System_StringAllocator_destructor' is invalid in C99 [-Wimplicit-function-declaration]
+omc_System_StringAllocator_destructor(threadData,_sb);
+^
+/Users/hudson/slave/workspace/OpenModelica_OSX_BUILD/OpenModelica/testsuite/openmodelica/bootstrapping/DumpTest.mos_temp9941/DumpTest_dump.c:16777:3: warning: implicit declaration of function 'omc_File_File_destructor' is invalid in C99 [-Wimplicit-function-declaration]
+omc_File_File_destructor(threadData,_file);
+^
+2 warnings generated.
+clang -g  -mfpmath=sse -fno-dollars-in-identifiers   -I"/Users/hudson/slave/workspace/OpenModelica_OSX_BUILD/OpenModelica/build/include/omc/c" "-I/Users/hudson/slave/workspace/OpenModelica_OSX_BUILD/OpenModelica/OMCompiler/Compiler/Util/" -c -o DumpTest_dump_records.o DumpTest_dump_records.c
+clang -single_module -dynamiclib -flat_namespace -o DumpTest_dump.dylib DumpTest_dump.o DumpTest_dump_records.o "-L/Users/hudson/slave/workspace/OpenModelica_OSX_BUILD/OpenModelica/build/lib/x86_64-darwin15.4.0/omc" "-L/Users/hudson/slave/workspace/OpenModelica_OSX_BUILD/OpenModelica/build/lib/" "-L/Users/hudson/.openmodelica/binaries/Print" "-L/Users/hudson/slave/workspace/OpenModelica_OSX_BUILD/OpenModelica/OMCompiler/Compiler/Util/Resources/Library/x86_64-darwin" "-L/Users/hudson/slave/workspace/OpenModelica_OSX_BUILD/OpenModelica/OMCompiler/Compiler/Util/Resources/Library/darwin64" "-L/Users/hudson/slave/workspace/OpenModelica_OSX_BUILD/OpenModelica/OMCompiler/Compiler/Util/Resources/Library" -lomcruntime -lexpat -lsqlite3 -llpsolve55 -lcolamd   -lomniORB4 -lomnithread -lpthread -lomcgc "-L/Users/hudson/.openmodelica/binaries/System" "-L/Users/hudson/.openmodelica/binaries/ErrorExt" -g  -mfpmath=sse -fno-dollars-in-identifiers   -I"/Users/hudson/slave/workspace/OpenModelica_OSX_BUILD/OpenModelica/build/include/omc/c" "-I/Users/hudson/slave/workspace/OpenModelica_OSX_BUILD/OpenModelica/OMCompiler/Compiler/Util/" -L"/Users/hudson/slave/workspace/OpenModelica_OSX_BUILD/OpenModelica/build/lib/x86_64-darwin15.4.0/omc" -Wl,-rpath,'/Users/hudson/slave/workspace/OpenModelica_OSX_BUILD/OpenModelica/build/lib/x86_64-darwin15.4.0/omc'    -L/opt/openmodelica/lib -lOpenModelicaRuntimeC  -lopenblas   -lm -lm
+ld: warning: directory not found for option '-L/Users/hudson/.openmodelica/binaries/Print'
+ld: warning: directory not found for option '-L/Users/hudson/slave/workspace/OpenModelica_OSX_BUILD/OpenModelica/OMCompiler/Compiler/Util/Resources/Library/x86_64-darwin'
+ld: warning: directory not found for option '-L/Users/hudson/slave/workspace/OpenModelica_OSX_BUILD/OpenModelica/OMCompiler/Compiler/Util/Resources/Library/darwin64'
+ld: warning: directory not found for option '-L/Users/hudson/slave/workspace/OpenModelica_OSX_BUILD/OpenModelica/OMCompiler/Compiler/Util/Resources/Library'
+ld: warning: directory not found for option '-L/Users/hudson/.openmodelica/binaries/System'
+ld: warning: directory not found for option '-L/Users/hudson/.openmodelica/binaries/ErrorExt'
+ld: file not found: @rpath/libzmq.dylib for architecture x86_64
+clang: error: linker command failed with exit code 1 (use -v to see invocation)
+make: *** [DumpTest_dump] Error 1
 "
-""
 "Dump.unparseStr"
-"final encapsulated partial pure function dummyClass
-end dummyClass;"
-""
+
+"Error: Error building simulator. Build log: clang -g  -mfpmath=sse -fno-dollars-in-identifiers   -I"/Users/hudson/slave/workspace/OpenModelica_OSX_BUILD/OpenModelica/build/include/omc/c" "-I/Users/hudson/slave/workspace/OpenModelica_OSX_BUILD/OpenModelica/OMCompiler/Compiler/Util/" -c -o Dump_unparseStr.o Dump_unparseStr.c
+/Users/hudson/slave/workspace/OpenModelica_OSX_BUILD/OpenModelica/testsuite/openmodelica/bootstrapping/DumpTest.mos_temp9941/Dump_unparseStr.c:11911:3: warning: implicit declaration of function 'omc_File_File_destructor' is invalid in C99 [-Wimplicit-function-declaration]
+omc_File_File_destructor(threadData,_file);
+^
+1 warning generated.
+clang -g  -mfpmath=sse -fno-dollars-in-identifiers   -I"/Users/hudson/slave/workspace/OpenModelica_OSX_BUILD/OpenModelica/build/include/omc/c" "-I/Users/hudson/slave/workspace/OpenModelica_OSX_BUILD/OpenModelica/OMCompiler/Compiler/Util/" -c -o Dump_unparseStr_records.o Dump_unparseStr_records.c
+clang -single_module -dynamiclib -flat_namespace -o Dump_unparseStr.dylib Dump_unparseStr.o Dump_unparseStr_records.o "-L/Users/hudson/slave/workspace/OpenModelica_OSX_BUILD/OpenModelica/build/lib/x86_64-darwin15.4.0/omc" "-L/Users/hudson/slave/workspace/OpenModelica_OSX_BUILD/OpenModelica/build/lib/" "-L/Users/hudson/.openmodelica/binaries/System" "-L/Users/hudson/slave/workspace/OpenModelica_OSX_BUILD/OpenModelica/OMCompiler/Compiler/Util/Resources/Library/x86_64-darwin" "-L/Users/hudson/slave/workspace/OpenModelica_OSX_BUILD/OpenModelica/OMCompiler/Compiler/Util/Resources/Library/darwin64" "-L/Users/hudson/slave/workspace/OpenModelica_OSX_BUILD/OpenModelica/OMCompiler/Compiler/Util/Resources/Library" -lomcruntime -lexpat -lsqlite3 -llpsolve55 -lcolamd   -lomniORB4 -lomnithread -lpthread -lomcgc "-L/Users/hudson/.openmodelica/binaries/ErrorExt" "-L/Users/hudson/.openmodelica/binaries/Print" -g  -mfpmath=sse -fno-dollars-in-identifiers   -I"/Users/hudson/slave/workspace/OpenModelica_OSX_BUILD/OpenModelica/build/include/omc/c" "-I/Users/hudson/slave/workspace/OpenModelica_OSX_BUILD/OpenModelica/OMCompiler/Compiler/Util/" -L"/Users/hudson/slave/workspace/OpenModelica_OSX_BUILD/OpenModelica/build/lib/x86_64-darwin15.4.0/omc" -Wl,-rpath,'/Users/hudson/slave/workspace/OpenModelica_OSX_BUILD/OpenModelica/build/lib/x86_64-darwin15.4.0/omc'    -L/opt/openmodelica/lib -lOpenModelicaRuntimeC  -lopenblas   -lm -lm
+ld: warning: directory not found for option '-L/Users/hudson/.openmodelica/binaries/System'
+ld: warning: directory not found for option '-L/Users/hudson/slave/workspace/OpenModelica_OSX_BUILD/OpenModelica/OMCompiler/Compiler/Util/Resources/Library/x86_64-darwin'
+ld: warning: directory not found for option '-L/Users/hudson/slave/workspace/OpenModelica_OSX_BUILD/OpenModelica/OMCompiler/Compiler/Util/Resources/Library/darwin64'
+ld: warning: directory not found for option '-L/Users/hudson/slave/workspace/OpenModelica_OSX_BUILD/OpenModelica/OMCompiler/Compiler/Util/Resources/Library'
+ld: warning: directory not found for option '-L/Users/hudson/.openmodelica/binaries/ErrorExt'
+ld: warning: directory not found for option '-L/Users/hudson/.openmodelica/binaries/Print'
+ld: file not found: @rpath/libzmq.dylib for architecture x86_64
+clang: error: linker command failed with exit code 1 (use -v to see invocation)
+make: *** [Dump_unparseStr] Error 1
+"
 "Dump.getAstAsCorbaString"
-"record Absyn.PROGRAM
-classes = {record Absyn.CLASS name = \"dummyClass\", partialPrefix = true, finalPrefix = true, encapsulatedPrefix = true, restriction = record Absyn.R_FUNCTION functionRestriction = record Absyn.FR_NORMAL_FUNCTION purity = record Absyn.PURE end Absyn.PURE; end Absyn.FR_NORMAL_FUNCTION;end Absyn.R_FUNCTION;, body = record Absyn.PARTS typeVars = {}, classParts = {}, ann = {}, comment = NONE() end Absyn.PARTS;, info = record SOURCEINFO fileName = \"\", isReadOnly = false, lineNumberStart = 0, columnNumberStart = 0, lineNumberEnd = 0, columnNumberEnd = 0, lastModified = 0.0 end SOURCEINFO; end Absyn.CLASS;},
-within_ = record Absyn.TOP end Absyn.TOP;
-end Absyn.PROGRAM;"
-""
+
+"Error: Error building simulator. Build log: clang -g  -mfpmath=sse -fno-dollars-in-identifiers   -I"/Users/hudson/slave/workspace/OpenModelica_OSX_BUILD/OpenModelica/build/include/omc/c"  -c -o DumpTest_getAstAsCorbaString.o DumpTest_getAstAsCorbaString.c
+clang -g  -mfpmath=sse -fno-dollars-in-identifiers   -I"/Users/hudson/slave/workspace/OpenModelica_OSX_BUILD/OpenModelica/build/include/omc/c"  -c -o DumpTest_getAstAsCorbaString_records.o DumpTest_getAstAsCorbaString_records.c
+clang -single_module -dynamiclib -flat_namespace -o DumpTest_getAstAsCorbaString.dylib DumpTest_getAstAsCorbaString.o DumpTest_getAstAsCorbaString_records.o "-L/Users/hudson/slave/workspace/OpenModelica_OSX_BUILD/OpenModelica/build/lib/x86_64-darwin15.4.0/omc" "-L/Users/hudson/slave/workspace/OpenModelica_OSX_BUILD/OpenModelica/build/lib/" "-L/Users/hudson/.openmodelica/binaries/System" "-L/Users/hudson/slave/workspace/OpenModelica_OSX_BUILD/OpenModelica/OMCompiler/Compiler/Util/Resources/Library/x86_64-darwin" "-L/Users/hudson/slave/workspace/OpenModelica_OSX_BUILD/OpenModelica/OMCompiler/Compiler/Util/Resources/Library/darwin64" "-L/Users/hudson/slave/workspace/OpenModelica_OSX_BUILD/OpenModelica/OMCompiler/Compiler/Util/Resources/Library" -lomcruntime -lexpat -lsqlite3 -llpsolve55 -lcolamd   -lomniORB4 -lomnithread -lpthread -lomcgc "-L/Users/hudson/.openmodelica/binaries/ErrorExt" "-L/Users/hudson/.openmodelica/binaries/Print" -g  -mfpmath=sse -fno-dollars-in-identifiers   -I"/Users/hudson/slave/workspace/OpenModelica_OSX_BUILD/OpenModelica/build/include/omc/c"  -L"/Users/hudson/slave/workspace/OpenModelica_OSX_BUILD/OpenModelica/build/lib/x86_64-darwin15.4.0/omc" -Wl,-rpath,'/Users/hudson/slave/workspace/OpenModelica_OSX_BUILD/OpenModelica/build/lib/x86_64-darwin15.4.0/omc'    -L/opt/openmodelica/lib -lOpenModelicaRuntimeC  -lopenblas   -lm -lm
+ld: warning: directory not found for option '-L/Users/hudson/.openmodelica/binaries/System'
+ld: warning: directory not found for option '-L/Users/hudson/slave/workspace/OpenModelica_OSX_BUILD/OpenModelica/OMCompiler/Compiler/Util/Resources/Library/x86_64-darwin'
+ld: warning: directory not found for option '-L/Users/hudson/slave/workspace/OpenModelica_OSX_BUILD/OpenModelica/OMCompiler/Compiler/Util/Resources/Library/darwin64'
+ld: warning: directory not found for option '-L/Users/hudson/slave/workspace/OpenModelica_OSX_BUILD/OpenModelica/OMCompiler/Compiler/Util/Resources/Library'
+ld: warning: directory not found for option '-L/Users/hudson/.openmodelica/binaries/ErrorExt'
+ld: warning: directory not found for option '-L/Users/hudson/.openmodelica/binaries/Print'
+ld: file not found: @rpath/libzmq.dylib for architecture x86_64
+clang: error: linker command failed with exit code 1 (use -v to see invocation)
+make: *** [DumpTest_getAstAsCorbaString] Error 1
+"
 record DAE.Exp.ICONST
 integer = 42
 end DAE.Exp.ICONST;
 ""
 "ExpressionDump.printExpStr"
-"42"
-""
+
+"Error: Error building simulator. Build log: clang -g  -mfpmath=sse -fno-dollars-in-identifiers   -I"/Users/hudson/slave/workspace/OpenModelica_OSX_BUILD/OpenModelica/build/include/omc/c" "-I/Users/hudson/slave/workspace/OpenModelica_OSX_BUILD/OpenModelica/OMCompiler/Compiler/Util/" -c -o ExpressionDump_printExpStr.o ExpressionDump_printExpStr.c
+/Users/hudson/slave/workspace/OpenModelica_OSX_BUILD/OpenModelica/testsuite/openmodelica/bootstrapping/DumpTest.mos_temp9941/ExpressionDump_printExpStr.c:14455:3: warning: implicit declaration of function 'omc_File_File_destructor' is invalid in C99 [-Wimplicit-function-declaration]
+omc_File_File_destructor(threadData,_file);
+^
+/Users/hudson/slave/workspace/OpenModelica_OSX_BUILD/OpenModelica/testsuite/openmodelica/bootstrapping/DumpTest.mos_temp9941/ExpressionDump_printExpStr.c:41923:3: warning: implicit declaration of function 'omc_System_StringAllocator_destructor' is invalid in C99 [-Wimplicit-function-declaration]
+omc_System_StringAllocator_destructor(threadData,_sb);
+^
+2 warnings generated.
+clang -g  -mfpmath=sse -fno-dollars-in-identifiers   -I"/Users/hudson/slave/workspace/OpenModelica_OSX_BUILD/OpenModelica/build/include/omc/c" "-I/Users/hudson/slave/workspace/OpenModelica_OSX_BUILD/OpenModelica/OMCompiler/Compiler/Util/" -c -o ExpressionDump_printExpStr_records.o ExpressionDump_printExpStr_records.c
+clang -single_module -dynamiclib -flat_namespace -o ExpressionDump_printExpStr.dylib ExpressionDump_printExpStr.o ExpressionDump_printExpStr_records.o "-L/Users/hudson/slave/workspace/OpenModelica_OSX_BUILD/OpenModelica/build/lib/x86_64-darwin15.4.0/omc" "-L/Users/hudson/slave/workspace/OpenModelica_OSX_BUILD/OpenModelica/build/lib/" "-L/Users/hudson/.openmodelica/binaries/System" "-L/Users/hudson/slave/workspace/OpenModelica_OSX_BUILD/OpenModelica/OMCompiler/Compiler/Util/Resources/Library/x86_64-darwin" "-L/Users/hudson/slave/workspace/OpenModelica_OSX_BUILD/OpenModelica/OMCompiler/Compiler/Util/Resources/Library/darwin64" "-L/Users/hudson/slave/workspace/OpenModelica_OSX_BUILD/OpenModelica/OMCompiler/Compiler/Util/Resources/Library" -lomcruntime -lexpat -lsqlite3 -llpsolve55 -lcolamd   -lomniORB4 -lomnithread -lpthread -lomcgc "-L/Users/hudson/.openmodelica/binaries/ErrorExt" "-L/Users/hudson/.openmodelica/binaries/Print" -g  -mfpmath=sse -fno-dollars-in-identifiers   -I"/Users/hudson/slave/workspace/OpenModelica_OSX_BUILD/OpenModelica/build/include/omc/c" "-I/Users/hudson/slave/workspace/OpenModelica_OSX_BUILD/OpenModelica/OMCompiler/Compiler/Util/" -L"/Users/hudson/slave/workspace/OpenModelica_OSX_BUILD/OpenModelica/build/lib/x86_64-darwin15.4.0/omc" -Wl,-rpath,'/Users/hudson/slave/workspace/OpenModelica_OSX_BUILD/OpenModelica/build/lib/x86_64-darwin15.4.0/omc'    -L/opt/openmodelica/lib -lOpenModelicaRuntimeC  -lopenblas   -lm -lm
+ld: warning: directory not found for option '-L/Users/hudson/.openmodelica/binaries/System'
+ld: warning: directory not found for option '-L/Users/hudson/slave/workspace/OpenModelica_OSX_BUILD/OpenModelica/OMCompiler/Compiler/Util/Resources/Library/x86_64-darwin'
+ld: warning: directory not found for option '-L/Users/hudson/slave/workspace/OpenModelica_OSX_BUILD/OpenModelica/OMCompiler/Compiler/Util/Resources/Library/darwin64'
+ld: warning: directory not found for option '-L/Users/hudson/slave/workspace/OpenModelica_OSX_BUILD/OpenModelica/OMCompiler/Compiler/Util/Resources/Library'
+ld: warning: directory not found for option '-L/Users/hudson/.openmodelica/binaries/ErrorExt'
+ld: warning: directory not found for option '-L/Users/hudson/.openmodelica/binaries/Print'
+ld: file not found: @rpath/libzmq.dylib for architecture x86_64
+clang: error: linker command failed with exit code 1 (use -v to see invocation)
+make: *** [ExpressionDump_printExpStr] Error 1
+"
 record DAE.DAElist.DAE
 elementLst = {}
 end DAE.DAElist.DAE;
 ""
 "DAEDump.dumpDebugDAE"
-""
-""
+
+"Error: Error building simulator. Build log: clang -g  -mfpmath=sse -fno-dollars-in-identifiers   -I"/Users/hudson/slave/workspace/OpenModelica_OSX_BUILD/OpenModelica/build/include/omc/c" "-I/Users/hudson/slave/workspace/OpenModelica_OSX_BUILD/OpenModelica/OMCompiler/Compiler/Util/" -c -o DAEDump_dumpDebugDAE.o DAEDump_dumpDebugDAE.c
+/Users/hudson/slave/workspace/OpenModelica_OSX_BUILD/OpenModelica/testsuite/openmodelica/bootstrapping/DumpTest.mos_temp9941/DAEDump_dumpDebugDAE.c:16190:3: warning: implicit declaration of function 'omc_File_File_destructor' is invalid in C99 [-Wimplicit-function-declaration]
+omc_File_File_destructor(threadData,_file);
+^
+/Users/hudson/slave/workspace/OpenModelica_OSX_BUILD/OpenModelica/testsuite/openmodelica/bootstrapping/DumpTest.mos_temp9941/DAEDump_dumpDebugDAE.c:43818:3: warning: implicit declaration of function 'omc_System_StringAllocator_destructor' is invalid in C99 [-Wimplicit-function-declaration]
+omc_System_StringAllocator_destructor(threadData,_sb);
+^
+2 warnings generated.
+clang -g  -mfpmath=sse -fno-dollars-in-identifiers   -I"/Users/hudson/slave/workspace/OpenModelica_OSX_BUILD/OpenModelica/build/include/omc/c" "-I/Users/hudson/slave/workspace/OpenModelica_OSX_BUILD/OpenModelica/OMCompiler/Compiler/Util/" -c -o DAEDump_dumpDebugDAE_records.o DAEDump_dumpDebugDAE_records.c
+clang -single_module -dynamiclib -flat_namespace -o DAEDump_dumpDebugDAE.dylib DAEDump_dumpDebugDAE.o DAEDump_dumpDebugDAE_records.o "-L/Users/hudson/slave/workspace/OpenModelica_OSX_BUILD/OpenModelica/build/lib/x86_64-darwin15.4.0/omc" "-L/Users/hudson/slave/workspace/OpenModelica_OSX_BUILD/OpenModelica/build/lib/" "-L/Users/hudson/.openmodelica/binaries/Print" "-L/Users/hudson/slave/workspace/OpenModelica_OSX_BUILD/OpenModelica/OMCompiler/Compiler/Util/Resources/Library/x86_64-darwin" "-L/Users/hudson/slave/workspace/OpenModelica_OSX_BUILD/OpenModelica/OMCompiler/Compiler/Util/Resources/Library/darwin64" "-L/Users/hudson/slave/workspace/OpenModelica_OSX_BUILD/OpenModelica/OMCompiler/Compiler/Util/Resources/Library" -lomcruntime -lexpat -lsqlite3 -llpsolve55 -lcolamd   -lomniORB4 -lomnithread -lpthread -lomcgc "-L/Users/hudson/.openmodelica/binaries/System" "-L/Users/hudson/.openmodelica/binaries/ErrorExt" -g  -mfpmath=sse -fno-dollars-in-identifiers   -I"/Users/hudson/slave/workspace/OpenModelica_OSX_BUILD/OpenModelica/build/include/omc/c" "-I/Users/hudson/slave/workspace/OpenModelica_OSX_BUILD/OpenModelica/OMCompiler/Compiler/Util/" -L"/Users/hudson/slave/workspace/OpenModelica_OSX_BUILD/OpenModelica/build/lib/x86_64-darwin15.4.0/omc" -Wl,-rpath,'/Users/hudson/slave/workspace/OpenModelica_OSX_BUILD/OpenModelica/build/lib/x86_64-darwin15.4.0/omc'    -L/opt/openmodelica/lib -lOpenModelicaRuntimeC  -lopenblas   -lm -lm
+ld: warning: directory not found for option '-L/Users/hudson/.openmodelica/binaries/Print'
+ld: warning: directory not found for option '-L/Users/hudson/slave/workspace/OpenModelica_OSX_BUILD/OpenModelica/OMCompiler/Compiler/Util/Resources/Library/x86_64-darwin'
+ld: warning: directory not found for option '-L/Users/hudson/slave/workspace/OpenModelica_OSX_BUILD/OpenModelica/OMCompiler/Compiler/Util/Resources/Library/darwin64'
+ld: warning: directory not found for option '-L/Users/hudson/slave/workspace/OpenModelica_OSX_BUILD/OpenModelica/OMCompiler/Compiler/Util/Resources/Library'
+ld: warning: directory not found for option '-L/Users/hudson/.openmodelica/binaries/System'
+ld: warning: directory not found for option '-L/Users/hudson/.openmodelica/binaries/ErrorExt'
+ld: file not found: @rpath/libzmq.dylib for architecture x86_64
+clang: error: linker command failed with exit code 1 (use -v to see invocation)
+make: *** [DAEDump_dumpDebugDAE] Error 1
+"
 record Values.Value.INTEGER
 integer = 42
 end Values.Value.INTEGER;
 ""
 "ValuesUtil.valString"
-"42"
-""
+
+"Error: Error building simulator. Build log: clang -g  -mfpmath=sse -fno-dollars-in-identifiers   -I"/Users/hudson/slave/workspace/OpenModelica_OSX_BUILD/OpenModelica/build/include/omc/c" "-I/Users/hudson/slave/workspace/OpenModelica_OSX_BUILD/OpenModelica/OMCompiler/Compiler/Util/" -c -o ValuesUtil_valString.o ValuesUtil_valString.c
+/Users/hudson/slave/workspace/OpenModelica_OSX_BUILD/OpenModelica/testsuite/openmodelica/bootstrapping/DumpTest.mos_temp9941/ValuesUtil_valString.c:9598:3: warning: implicit declaration of function 'omc_System_StringAllocator_destructor' is invalid in C99 [-Wimplicit-function-declaration]
+omc_System_StringAllocator_destructor(threadData,_sb);
+^
+/Users/hudson/slave/workspace/OpenModelica_OSX_BUILD/OpenModelica/testsuite/openmodelica/bootstrapping/DumpTest.mos_temp9941/ValuesUtil_valString.c:13380:3: warning: implicit declaration of function 'omc_File_File_destructor' is invalid in C99 [-Wimplicit-function-declaration]
+omc_File_File_destructor(threadData,_file);
+^
+2 warnings generated.
+clang -g  -mfpmath=sse -fno-dollars-in-identifiers   -I"/Users/hudson/slave/workspace/OpenModelica_OSX_BUILD/OpenModelica/build/include/omc/c" "-I/Users/hudson/slave/workspace/OpenModelica_OSX_BUILD/OpenModelica/OMCompiler/Compiler/Util/" -c -o ValuesUtil_valString_records.o ValuesUtil_valString_records.c
+clang -single_module -dynamiclib -flat_namespace -o ValuesUtil_valString.dylib ValuesUtil_valString.o ValuesUtil_valString_records.o "-L/Users/hudson/slave/workspace/OpenModelica_OSX_BUILD/OpenModelica/build/lib/x86_64-darwin15.4.0/omc" "-L/Users/hudson/slave/workspace/OpenModelica_OSX_BUILD/OpenModelica/build/lib/" "-L/Users/hudson/.openmodelica/binaries/System" "-L/Users/hudson/slave/workspace/OpenModelica_OSX_BUILD/OpenModelica/OMCompiler/Compiler/Util/Resources/Library/x86_64-darwin" "-L/Users/hudson/slave/workspace/OpenModelica_OSX_BUILD/OpenModelica/OMCompiler/Compiler/Util/Resources/Library/darwin64" "-L/Users/hudson/slave/workspace/OpenModelica_OSX_BUILD/OpenModelica/OMCompiler/Compiler/Util/Resources/Library" -lomcruntime -lexpat -lsqlite3 -llpsolve55 -lcolamd   -lomniORB4 -lomnithread -lpthread -lomcgc "-L/Users/hudson/.openmodelica/binaries/ErrorExt" "-L/Users/hudson/.openmodelica/binaries/Print" -g  -mfpmath=sse -fno-dollars-in-identifiers   -I"/Users/hudson/slave/workspace/OpenModelica_OSX_BUILD/OpenModelica/build/include/omc/c" "-I/Users/hudson/slave/workspace/OpenModelica_OSX_BUILD/OpenModelica/OMCompiler/Compiler/Util/" -L"/Users/hudson/slave/workspace/OpenModelica_OSX_BUILD/OpenModelica/build/lib/x86_64-darwin15.4.0/omc" -Wl,-rpath,'/Users/hudson/slave/workspace/OpenModelica_OSX_BUILD/OpenModelica/build/lib/x86_64-darwin15.4.0/omc'    -L/opt/openmodelica/lib -lOpenModelicaRuntimeC  -lopenblas   -lm -lm
+ld: warning: directory not found for option '-L/Users/hudson/.openmodelica/binaries/System'
+ld: warning: directory not found for option '-L/Users/hudson/slave/workspace/OpenModelica_OSX_BUILD/OpenModelica/OMCompiler/Compiler/Util/Resources/Library/x86_64-darwin'
+ld: warning: directory not found for option '-L/Users/hudson/slave/workspace/OpenModelica_OSX_BUILD/OpenModelica/OMCompiler/Compiler/Util/Resources/Library/darwin64'
+ld: warning: directory not found for option '-L/Users/hudson/slave/workspace/OpenModelica_OSX_BUILD/OpenModelica/OMCompiler/Compiler/Util/Resources/Library'
+ld: warning: directory not found for option '-L/Users/hudson/.openmodelica/binaries/ErrorExt'
+ld: warning: directory not found for option '-L/Users/hudson/.openmodelica/binaries/Print'
+ld: file not found: @rpath/libzmq.dylib for architecture x86_64
+clang: error: linker command failed with exit code 1 (use -v to see invocation)
+make: *** [ValuesUtil_valString] Error 1
+"

Equation mismatch: omc-diff says:
Line 9: Lexical token differs:
expected: graph AST {
got:      


== 1 out of 1 tests failed [openmodelica/bootstrapping/DumpTest.mos_temp9941, time: 101]

Powered by Hudson Open Source Continuous Integration Server from the Eclipse Foundation