Hudson logo

Failed

openmodelica_bootstrapping.DiffAlgorithm.mos (from (result.xml))

Failing for the past 711 builds (Since #6660 )

Stacktrace

Output mismatch (see stdout for details)

Standard Output

 + DiffAlgorithm.mos                                                                 ... equation mismatch [time: 1]

==== Log /tmp/omc-rtest-hudson/openmodelica/bootstrapping/DiffAlgorithm.mos_temp1020/log-DiffAlgorithm.mos
true
true
true
""
true
""
true
false
"Error: Error building simulator. Build log: clang -g  -mfpmath=sse -fno-dollars-in-identifiers   -I"/Users/hudson/slave/workspace/OpenModelica_OSX_BUILD/OpenModelica/build/include/omc/c"  -c -o TestDiffAlgorithm.o TestDiffAlgorithm.c
clang -g  -mfpmath=sse -fno-dollars-in-identifiers   -I"/Users/hudson/slave/workspace/OpenModelica_OSX_BUILD/OpenModelica/build/include/omc/c"  -c -o TestDiffAlgorithm_records.o TestDiffAlgorithm_records.c
clang -single_module -dynamiclib -flat_namespace -o TestDiffAlgorithm.dylib TestDiffAlgorithm.o TestDiffAlgorithm_records.o "-L/Users/hudson/slave/workspace/OpenModelica_OSX_BUILD/OpenModelica/build/lib/x86_64-darwin15.4.0/omc" "-L/Users/hudson/slave/workspace/OpenModelica_OSX_BUILD/OpenModelica/build/lib/" "-L/Users/hudson/.openmodelica/binaries/Print" "-L/Users/hudson/slave/workspace/OpenModelica_OSX_BUILD/OpenModelica/OMCompiler/Compiler/Util/Resources/Library/x86_64-darwin" "-L/Users/hudson/slave/workspace/OpenModelica_OSX_BUILD/OpenModelica/OMCompiler/Compiler/Util/Resources/Library/darwin64" "-L/Users/hudson/slave/workspace/OpenModelica_OSX_BUILD/OpenModelica/OMCompiler/Compiler/Util/Resources/Library" -lomcruntime -lexpat -lsqlite3 -llpsolve55 -lcolamd   -lomniORB4 -lomnithread -lpthread -lomcgc -g  -mfpmath=sse -fno-dollars-in-identifiers   -I"/Users/hudson/slave/workspace/OpenModelica_OSX_BUILD/OpenModelica/build/include/omc/c"  -L"/Users/hudson/slave/workspace/OpenModelica_OSX_BUILD/OpenModelica/build/lib/x86_64-darwin15.4.0/omc" -Wl,-rpath,'/Users/hudson/slave/workspace/OpenModelica_OSX_BUILD/OpenModelica/build/lib/x86_64-darwin15.4.0/omc'    -L/opt/openmodelica/lib -lOpenModelicaRuntimeC  -lopenblas   -lm -lm
ld: warning: directory not found for option '-L/Users/hudson/.openmodelica/binaries/Print'
ld: warning: directory not found for option '-L/Users/hudson/slave/workspace/OpenModelica_OSX_BUILD/OpenModelica/OMCompiler/Compiler/Util/Resources/Library/x86_64-darwin'
ld: warning: directory not found for option '-L/Users/hudson/slave/workspace/OpenModelica_OSX_BUILD/OpenModelica/OMCompiler/Compiler/Util/Resources/Library/darwin64'
ld: warning: directory not found for option '-L/Users/hudson/slave/workspace/OpenModelica_OSX_BUILD/OpenModelica/OMCompiler/Compiler/Util/Resources/Library'
ld: file not found: @rpath/libzmq.dylib for architecture x86_64
clang: error: linker command failed with exit code 1 (use -v to see invocation)
make: *** [TestDiffAlgorithm] Error 1
"

"Error: Error building simulator. Build log: clang -g  -mfpmath=sse -fno-dollars-in-identifiers   -I"/Users/hudson/slave/workspace/OpenModelica_OSX_BUILD/OpenModelica/build/include/omc/c"  -c -o TestDiffAlgorithm.o TestDiffAlgorithm.c
clang -g  -mfpmath=sse -fno-dollars-in-identifiers   -I"/Users/hudson/slave/workspace/OpenModelica_OSX_BUILD/OpenModelica/build/include/omc/c"  -c -o TestDiffAlgorithm_records.o TestDiffAlgorithm_records.c
clang -single_module -dynamiclib -flat_namespace -o TestDiffAlgorithm.dylib TestDiffAlgorithm.o TestDiffAlgorithm_records.o "-L/Users/hudson/slave/workspace/OpenModelica_OSX_BUILD/OpenModelica/build/lib/x86_64-darwin15.4.0/omc" "-L/Users/hudson/slave/workspace/OpenModelica_OSX_BUILD/OpenModelica/build/lib/" "-L/Users/hudson/.openmodelica/binaries/Print" "-L/Users/hudson/slave/workspace/OpenModelica_OSX_BUILD/OpenModelica/OMCompiler/Compiler/Util/Resources/Library/x86_64-darwin" "-L/Users/hudson/slave/workspace/OpenModelica_OSX_BUILD/OpenModelica/OMCompiler/Compiler/Util/Resources/Library/darwin64" "-L/Users/hudson/slave/workspace/OpenModelica_OSX_BUILD/OpenModelica/OMCompiler/Compiler/Util/Resources/Library" -lomcruntime -lexpat -lsqlite3 -llpsolve55 -lcolamd   -lomniORB4 -lomnithread -lpthread -lomcgc -g  -mfpmath=sse -fno-dollars-in-identifiers   -I"/Users/hudson/slave/workspace/OpenModelica_OSX_BUILD/OpenModelica/build/include/omc/c"  -L"/Users/hudson/slave/workspace/OpenModelica_OSX_BUILD/OpenModelica/build/lib/x86_64-darwin15.4.0/omc" -Wl,-rpath,'/Users/hudson/slave/workspace/OpenModelica_OSX_BUILD/OpenModelica/build/lib/x86_64-darwin15.4.0/omc'    -L/opt/openmodelica/lib -lOpenModelicaRuntimeC  -lopenblas   -lm -lm
ld: warning: directory not found for option '-L/Users/hudson/.openmodelica/binaries/Print'
ld: warning: directory not found for option '-L/Users/hudson/slave/workspace/OpenModelica_OSX_BUILD/OpenModelica/OMCompiler/Compiler/Util/Resources/Library/x86_64-darwin'
ld: warning: directory not found for option '-L/Users/hudson/slave/workspace/OpenModelica_OSX_BUILD/OpenModelica/OMCompiler/Compiler/Util/Resources/Library/darwin64'
ld: warning: directory not found for option '-L/Users/hudson/slave/workspace/OpenModelica_OSX_BUILD/OpenModelica/OMCompiler/Compiler/Util/Resources/Library'
ld: file not found: @rpath/libzmq.dylib for architecture x86_64
clang: error: linker command failed with exit code 1 (use -v to see invocation)
make: *** [TestDiffAlgorithm] Error 1
"

Equation mismatch: diff says:
--- /tmp/omc-rtest-hudson/openmodelica/bootstrapping/DiffAlgorithm.mos_temp1020/equations-expected2019-05-16 21:37:46.000000000 +0200
+++ /tmp/omc-rtest-hudson/openmodelica/bootstrapping/DiffAlgorithm.mos_temp1020/equations-got2019-05-16 21:37:47.000000000 +0200
@@ -3,43 +3,29 @@
 true
 ""
 true
 ""
 true
-true
-""
-Calling diff(
-seq1={1, 2, 3},
-seq2={1, 2, 3}
-)
-123
-Calling diff(
-seq1={1, 2, 3},
-seq2={1, 2, 3, 4, 5, 6}
-)
-123[4;32m456[0m
-Calling diff(
-seq1={1, 2, 3, 4, 5, 6},
-seq2={1, 2, 3}
-)
-123[9;31m456[0m
-Calling diff(
-seq1={1, 2, 3, 4, 5, 6},
-seq2={1, 2, 3, 6}
-)
-123[9;31m45[0m6
-Calling diff(
-seq1={1},
-seq2={2}
-)
-[9;31m1[0m[4;32m2[0m
-Calling diff(
-seq1={1, 2, 3, 4, 5, 6, 7, 8, 9, 10},
-seq2={1, 2, 6, 4, 5, 7, 3, 8, 9, 10}
-)
-12[9;31m3[0m[4;32m6[0m45[9;31m6[0m7[4;32m3[0m8910
-Calling diff(
-seq1={1, 2, 3},
-seq2={1, 2, 3}
-)
-123
-""
+false
+"Error: Error building simulator. Build log: clang -g  -mfpmath=sse -fno-dollars-in-identifiers   -I"/Users/hudson/slave/workspace/OpenModelica_OSX_BUILD/OpenModelica/build/include/omc/c"  -c -o TestDiffAlgorithm.o TestDiffAlgorithm.c
+clang -g  -mfpmath=sse -fno-dollars-in-identifiers   -I"/Users/hudson/slave/workspace/OpenModelica_OSX_BUILD/OpenModelica/build/include/omc/c"  -c -o TestDiffAlgorithm_records.o TestDiffAlgorithm_records.c
+clang -single_module -dynamiclib -flat_namespace -o TestDiffAlgorithm.dylib TestDiffAlgorithm.o TestDiffAlgorithm_records.o "-L/Users/hudson/slave/workspace/OpenModelica_OSX_BUILD/OpenModelica/build/lib/x86_64-darwin15.4.0/omc" "-L/Users/hudson/slave/workspace/OpenModelica_OSX_BUILD/OpenModelica/build/lib/" "-L/Users/hudson/.openmodelica/binaries/Print" "-L/Users/hudson/slave/workspace/OpenModelica_OSX_BUILD/OpenModelica/OMCompiler/Compiler/Util/Resources/Library/x86_64-darwin" "-L/Users/hudson/slave/workspace/OpenModelica_OSX_BUILD/OpenModelica/OMCompiler/Compiler/Util/Resources/Library/darwin64" "-L/Users/hudson/slave/workspace/OpenModelica_OSX_BUILD/OpenModelica/OMCompiler/Compiler/Util/Resources/Library" -lomcruntime -lexpat -lsqlite3 -llpsolve55 -lcolamd   -lomniORB4 -lomnithread -lpthread -lomcgc -g  -mfpmath=sse -fno-dollars-in-identifiers   -I"/Users/hudson/slave/workspace/OpenModelica_OSX_BUILD/OpenModelica/build/include/omc/c"  -L"/Users/hudson/slave/workspace/OpenModelica_OSX_BUILD/OpenModelica/build/lib/x86_64-darwin15.4.0/omc" -Wl,-rpath,'/Users/hudson/slave/workspace/OpenModelica_OSX_BUILD/OpenModelica/build/lib/x86_64-darwin15.4.0/omc'    -L/opt/openmodelica/lib -lOpenModelicaRuntimeC  -lopenblas   -lm -lm
+ld: warning: directory not found for option '-L/Users/hudson/.openmodelica/binaries/Print'
+ld: warning: directory not found for option '-L/Users/hudson/slave/workspace/OpenModelica_OSX_BUILD/OpenModelica/OMCompiler/Compiler/Util/Resources/Library/x86_64-darwin'
+ld: warning: directory not found for option '-L/Users/hudson/slave/workspace/OpenModelica_OSX_BUILD/OpenModelica/OMCompiler/Compiler/Util/Resources/Library/darwin64'
+ld: warning: directory not found for option '-L/Users/hudson/slave/workspace/OpenModelica_OSX_BUILD/OpenModelica/OMCompiler/Compiler/Util/Resources/Library'
+ld: file not found: @rpath/libzmq.dylib for architecture x86_64
+clang: error: linker command failed with exit code 1 (use -v to see invocation)
+make: *** [TestDiffAlgorithm] Error 1
+"
+
+"Error: Error building simulator. Build log: clang -g  -mfpmath=sse -fno-dollars-in-identifiers   -I"/Users/hudson/slave/workspace/OpenModelica_OSX_BUILD/OpenModelica/build/include/omc/c"  -c -o TestDiffAlgorithm.o TestDiffAlgorithm.c
+clang -g  -mfpmath=sse -fno-dollars-in-identifiers   -I"/Users/hudson/slave/workspace/OpenModelica_OSX_BUILD/OpenModelica/build/include/omc/c"  -c -o TestDiffAlgorithm_records.o TestDiffAlgorithm_records.c
+clang -single_module -dynamiclib -flat_namespace -o TestDiffAlgorithm.dylib TestDiffAlgorithm.o TestDiffAlgorithm_records.o "-L/Users/hudson/slave/workspace/OpenModelica_OSX_BUILD/OpenModelica/build/lib/x86_64-darwin15.4.0/omc" "-L/Users/hudson/slave/workspace/OpenModelica_OSX_BUILD/OpenModelica/build/lib/" "-L/Users/hudson/.openmodelica/binaries/Print" "-L/Users/hudson/slave/workspace/OpenModelica_OSX_BUILD/OpenModelica/OMCompiler/Compiler/Util/Resources/Library/x86_64-darwin" "-L/Users/hudson/slave/workspace/OpenModelica_OSX_BUILD/OpenModelica/OMCompiler/Compiler/Util/Resources/Library/darwin64" "-L/Users/hudson/slave/workspace/OpenModelica_OSX_BUILD/OpenModelica/OMCompiler/Compiler/Util/Resources/Library" -lomcruntime -lexpat -lsqlite3 -llpsolve55 -lcolamd   -lomniORB4 -lomnithread -lpthread -lomcgc -g  -mfpmath=sse -fno-dollars-in-identifiers   -I"/Users/hudson/slave/workspace/OpenModelica_OSX_BUILD/OpenModelica/build/include/omc/c"  -L"/Users/hudson/slave/workspace/OpenModelica_OSX_BUILD/OpenModelica/build/lib/x86_64-darwin15.4.0/omc" -Wl,-rpath,'/Users/hudson/slave/workspace/OpenModelica_OSX_BUILD/OpenModelica/build/lib/x86_64-darwin15.4.0/omc'    -L/opt/openmodelica/lib -lOpenModelicaRuntimeC  -lopenblas   -lm -lm
+ld: warning: directory not found for option '-L/Users/hudson/.openmodelica/binaries/Print'
+ld: warning: directory not found for option '-L/Users/hudson/slave/workspace/OpenModelica_OSX_BUILD/OpenModelica/OMCompiler/Compiler/Util/Resources/Library/x86_64-darwin'
+ld: warning: directory not found for option '-L/Users/hudson/slave/workspace/OpenModelica_OSX_BUILD/OpenModelica/OMCompiler/Compiler/Util/Resources/Library/darwin64'
+ld: warning: directory not found for option '-L/Users/hudson/slave/workspace/OpenModelica_OSX_BUILD/OpenModelica/OMCompiler/Compiler/Util/Resources/Library'
+ld: file not found: @rpath/libzmq.dylib for architecture x86_64
+clang: error: linker command failed with exit code 1 (use -v to see invocation)
+make: *** [TestDiffAlgorithm] Error 1
+"

Equation mismatch: omc-diff says:
Failed 't' 'f'
Line 8: Text differs:
expected: true
got:      false

== 1 out of 1 tests failed [openmodelica/bootstrapping/DiffAlgorithm.mos_temp1020, time: 1]

Powered by Hudson Open Source Continuous Integration Server from the Eclipse Foundation