Hudson logo

Failed

flattening_modelica_mosfiles.LeastSquares.mos (from (result.xml))

Failing for the past 711 builds (Since #6660 )

Stacktrace

Output mismatch (see stdout for details)

Standard Output

 + LeastSquares.mos                                                                  ... equation mismatch [time: 5]

==== Log /tmp/omc-rtest-hudson/flattening/modelica/mosfiles/LeastSquares.mos_temp4120/log-LeastSquares.mos
true
""

"Error: Error building simulator. Build log: clang   -mfpmath=sse -fno-dollars-in-identifiers   -I"/Users/hudson/slave/workspace/OpenModelica_OSX_BUILD/OpenModelica/build/include/omc/c"  -c -o Modelica_Math_Matrices_leastSquares.o Modelica_Math_Matrices_leastSquares.c
clang   -mfpmath=sse -fno-dollars-in-identifiers   -I"/Users/hudson/slave/workspace/OpenModelica_OSX_BUILD/OpenModelica/build/include/omc/c"  -c -o Modelica_Math_Matrices_leastSquares_records.o Modelica_Math_Matrices_leastSquares_records.c
clang -single_module -dynamiclib -flat_namespace -o Modelica_Math_Matrices_leastSquares.dylib Modelica_Math_Matrices_leastSquares.o Modelica_Math_Matrices_leastSquares_records.o    -mfpmath=sse -fno-dollars-in-identifiers   -I"/Users/hudson/slave/workspace/OpenModelica_OSX_BUILD/OpenModelica/build/include/omc/c"  -L"/Users/hudson/slave/workspace/OpenModelica_OSX_BUILD/OpenModelica/build/lib/x86_64-darwin15.4.0/omc" -Wl,-rpath,'/Users/hudson/slave/workspace/OpenModelica_OSX_BUILD/OpenModelica/build/lib/x86_64-darwin15.4.0/omc'    -L/opt/openmodelica/lib -lOpenModelicaRuntimeC  -lopenblas   -lm -lm
Undefined symbols for architecture x86_64:
  "_omc_assert", referenced from:
      _omc_Modelica_Math_Matrices_leastSquares in Modelica_Math_Matrices_leastSquares.o
ld: symbol(s) not found for architecture x86_64
clang: error: linker command failed with exit code 1 (use -v to see invocation)
make: *** [Modelica_Math_Matrices_leastSquares] Error 1
"

Equation mismatch: diff says:
--- /tmp/omc-rtest-hudson/flattening/modelica/mosfiles/LeastSquares.mos_temp4120/equations-expected2019-05-16 21:58:21.000000000 +0200
+++ /tmp/omc-rtest-hudson/flattening/modelica/mosfiles/LeastSquares.mos_temp4120/equations-got2019-05-16 21:58:26.000000000 +0200
@@ -1,4 +1,13 @@
 true
 ""
-({0.0000000000000004535958399146134,0.49999999999999967},2)
-""
+
+"Error: Error building simulator. Build log: clang   -mfpmath=sse -fno-dollars-in-identifiers   -I"/Users/hudson/slave/workspace/OpenModelica_OSX_BUILD/OpenModelica/build/include/omc/c"  -c -o Modelica_Math_Matrices_leastSquares.o Modelica_Math_Matrices_leastSquares.c
+clang -mfpmath=sse -fno-dollars-in-identifiers   -I"/Users/hudson/slave/workspace/OpenModelica_OSX_BUILD/OpenModelica/build/include/omc/c"  -c -o Modelica_Math_Matrices_leastSquares_records.o Modelica_Math_Matrices_leastSquares_records.c
+clang -single_module -dynamiclib -flat_namespace -o Modelica_Math_Matrices_leastSquares.dylib Modelica_Math_Matrices_leastSquares.o Modelica_Math_Matrices_leastSquares_records.o    -mfpmath=sse -fno-dollars-in-identifiers   -I"/Users/hudson/slave/workspace/OpenModelica_OSX_BUILD/OpenModelica/build/include/omc/c"  -L"/Users/hudson/slave/workspace/OpenModelica_OSX_BUILD/OpenModelica/build/lib/x86_64-darwin15.4.0/omc" -Wl,-rpath,'/Users/hudson/slave/workspace/OpenModelica_OSX_BUILD/OpenModelica/build/lib/x86_64-darwin15.4.0/omc'    -L/opt/openmodelica/lib -lOpenModelicaRuntimeC  -lopenblas   -lm -lm
+Undefined symbols for architecture x86_64:
+"_omc_assert", referenced from:
+_omc_Modelica_Math_Matrices_leastSquares in Modelica_Math_Matrices_leastSquares.o
+ld: symbol(s) not found for architecture x86_64
+clang: error: linker command failed with exit code 1 (use -v to see invocation)
+make: *** [Modelica_Math_Matrices_leastSquares] Error 1
+"

Equation mismatch: omc-diff says:
Line 3: Lexical token differs:
expected: ({
got:      


== 1 out of 1 tests failed [flattening/modelica/mosfiles/LeastSquares.mos_temp4120, time: 5]

Powered by Hudson Open Source Continuous Integration Server from the Eclipse Foundation