Hudson logo

FailedConsole Output

Skipping 2,680 KB.. Full Log
ication: stmts:=listAppend(stmts, _) has the first argument in the "wrong" order.
  It is very slow to keep appending a linked list (scales like O(N²)).
  Consider building the list in the reverse order in order to improve performance (scales like O(N) even if you need to reverse a lot of lists). Use annotation __OpenModelica_DisableListAppendWarning=true to disable this message for a certain assignment.
[/var/lib/hudson/slave/workspace/OpenModelica_BUILD_GCC_4.9/OpenModelica/OMCompiler/Compiler/FrontEnd/DAEUtil.mo:6526:11-6526:41:writable] Notification: istmts:=listAppend(istmts, _) has the first argument in the "wrong" order.
  It is very slow to keep appending a linked list (scales like O(N²)).
  Consider building the list in the reverse order in order to improve performance (scales like O(N) even if you need to reverse a lot of lists). Use annotation __OpenModelica_DisableListAppendWarning=true to disable this message for a certain assignment.
[/var/lib/hudson/slave/workspace/OpenModelica_BUILD_GCC_4.9/OpenModelica/OMCompiler/Compiler/FrontEnd/DAEUtil.mo:6536:5-6536:94:writable] Notification: newEls:=listAppend(newEls, _) has the first argument in the "wrong" order.
  It is very slow to keep appending a linked list (scales like O(N²)).
  Consider building the list in the reverse order in order to improve performance (scales like O(N) even if you need to reverse a lot of lists). Use annotation __OpenModelica_DisableListAppendWarning=true to disable this message for a certain assignment.
[/var/lib/hudson/slave/workspace/OpenModelica_BUILD_GCC_4.9/OpenModelica/OMCompiler/Compiler/FrontEnd/DAEUtil.mo:6539:5-6539:86:writable] Notification: newEls:=listAppend(newEls, _) has the first argument in the "wrong" order.
  It is very slow to keep appending a linked list (scales like O(N²)).
  Consider building the list in the reverse order in order to improve performance (scales like O(N) even if you need to reverse a lot of lists). Use annotation __OpenModelica_DisableListAppendWarning=true to disable this message for a certain assignment.
We could not find any of:
	/var/lib/hudson/slave/workspace/OpenModelica_BUILD_GCC_4.9/OpenModelica/build/MinGW/bin and /var/lib/hudson/slave/workspace/OpenModelica_BUILD_GCC_4.9/OpenModelica/build/MinGW/libexec/gcc/mingw32/4.4.0
	$OMDEV/tools/MinGW/bin and $OMDEV/tools/MinGW/libexec/gcc/mingw32/4.4.0
We could not find any of:
	/var/lib/hudson/slave/workspace/OpenModelica_BUILD_GCC_4.9/OpenModelica/build/MinGW/bin and /var/lib/hudson/slave/workspace/OpenModelica_BUILD_GCC_4.9/OpenModelica/build/MinGW/libexec/gcc/mingw32/4.4.0
	$OMDEV/tools/MinGW/bin and $OMDEV/tools/MinGW/libexec/gcc/mingw32/4.4.0
 annotation(__OpenModelica_DisableListAppendWarning = true) annotation(__OpenModelica_DisableListAppendWarning = true)0 errors out of 4 messages:
[/var/lib/hudson/slave/workspace/OpenModelica_BUILD_GCC_4.9/OpenModelica/OMCompiler/Compiler/FrontEnd/ComponentReference.mo:1624:9-1624:41:writable] Notification: subs:=listAppend(subs, _) has the first argument in the "wrong" order.
  It is very slow to keep appending a linked list (scales like O(N²)).
  Consider building the list in the reverse order in order to improve performance (scales like O(N) even if you need to reverse a lot of lists). Use annotation __OpenModelica_DisableListAppendWarning=true to disable this message for a certain assignment.
[/var/lib/hudson/slave/workspace/OpenModelica_BUILD_GCC_4.9/OpenModelica/OMCompiler/Compiler/FrontEnd/ComponentReference.mo:1633:9-1633:41:writable] Notification: subs:=listAppend(subs, _) has the first argument in the "wrong" order.
  It is very slow to keep appending a linked list (scales like O(N²)).
  Consider building the list in the reverse order in order to improve performance (scales like O(N) even if you need to reverse a lot of lists). Use annotation __OpenModelica_DisableListAppendWarning=true to disable this message for a certain assignment.
We could not find any of:
	/var/lib/hudson/slave/workspace/OpenModelica_BUILD_GCC_4.9/OpenModelica/build/MinGW/bin and /var/lib/hudson/slave/workspace/OpenModelica_BUILD_GCC_4.9/OpenModelica/build/MinGW/libexec/gcc/mingw32/4.4.0
	$OMDEV/tools/MinGW/bin and $OMDEV/tools/MinGW/libexec/gcc/mingw32/4.4.0
We could not find any of:
	/var/lib/hudson/slave/workspace/OpenModelica_BUILD_GCC_4.9/OpenModelica/build/MinGW/bin and /var/lib/hudson/slave/workspace/OpenModelica_BUILD_GCC_4.9/OpenModelica/build/MinGW/libexec/gcc/mingw32/4.4.0
	$OMDEV/tools/MinGW/bin and $OMDEV/tools/MinGW/libexec/gcc/mingw32/4.4.0
We could not find any of:
	/var/lib/hudson/slave/workspace/OpenModelica_BUILD_GCC_4.9/OpenModelica/build/MinGW/bin and /var/lib/hudson/slave/workspace/OpenModelica_BUILD_GCC_4.9/OpenModelica/build/MinGW/libexec/gcc/mingw32/4.4.0
	$OMDEV/tools/MinGW/bin and $OMDEV/tools/MinGW/libexec/gcc/mingw32/4.4.0
We could not find any of:
	/var/lib/hudson/slave/workspace/OpenModelica_BUILD_GCC_4.9/OpenModelica/build/MinGW/bin and /var/lib/hudson/slave/workspace/OpenModelica_BUILD_GCC_4.9/OpenModelica/build/MinGW/libexec/gcc/mingw32/4.4.0
	$OMDEV/tools/MinGW/bin and $OMDEV/tools/MinGW/libexec/gcc/mingw32/4.4.0
We could not find any of:
	/var/lib/hudson/slave/workspace/OpenModelica_BUILD_GCC_4.9/OpenModelica/build/MinGW/bin and /var/lib/hudson/slave/workspace/OpenModelica_BUILD_GCC_4.9/OpenModelica/build/MinGW/libexec/gcc/mingw32/4.4.0
	$OMDEV/tools/MinGW/bin and $OMDEV/tools/MinGW/libexec/gcc/mingw32/4.4.0
make[6]: Leaving directory '/var/lib/hudson/slave/workspace/OpenModelica_BUILD_GCC_4.9/OpenModelica/OMCompiler/Compiler/boot'
make[5]: Leaving directory '/var/lib/hudson/slave/workspace/OpenModelica_BUILD_GCC_4.9/OpenModelica/OMCompiler/Compiler/boot'
# Patch _main.c to avoid a new tarball
sed -i=.bak 's/ = omc_assert_function/__attribute__((noreturn)) = omc_assert_function/' build/_main.c
echo '#include "Patternm.h"' >> build/SimCodeFunctionUtil_includes.h
# We have not compiled OpenModelicaScriptingAPI.mo yet
touch build/OpenModelicaScriptingAPI.h
make -f Makefile install INCLUDESOURCES=1 OMC="/var/lib/hudson/slave/workspace/OpenModelica_BUILD_GCC_4.9/OpenModelica/build/bin/omc" CPPFLAGS="-I"/var/lib/hudson/slave/workspace/OpenModelica_BUILD_GCC_4.9/OpenModelica/build/include/omc/c" -I../Util/  -DADD_METARECORD_DEFINITIONS= -DOMC_BOOTSTRAPPING_STAGE_2" BOOTSTRAP_OMHOME=1
make[5]: Entering directory '/var/lib/hudson/slave/workspace/OpenModelica_BUILD_GCC_4.9/OpenModelica/OMCompiler/Compiler/boot'
gcc-4.9 -O2 -march=native -fno-stack-protector -fPIC  -Wno-parentheses-equality -Wno-unused-variable -Werror=implicit-function-declaration -I/var/lib/hudson/slave/workspace/OpenModelica_BUILD_GCC_4.9/OpenModelica/build/include/omc/c -I../Util/  -DADD_METARECORD_DEFINITIONS= -DOMC_BOOTSTRAPPING_STAGE_2  -c -o build/ZeroCrossings.o build/ZeroCrossings.c
gcc-4.9 -O2 -march=native -fno-stack-protector -fPIC  -Wno-parentheses-equality -Wno-unused-variable -Werror=implicit-function-declaration -I/var/lib/hudson/slave/workspace/OpenModelica_BUILD_GCC_4.9/OpenModelica/build/include/omc/c -I../Util/  -DADD_METARECORD_DEFINITIONS= -DOMC_BOOTSTRAPPING_STAGE_2  -c -o build/UnitChecker.o build/UnitChecker.c
gcc-4.9 -O2 -march=native -fno-stack-protector -fPIC  -Wno-parentheses-equality -Wno-unused-variable -Werror=implicit-function-declaration -I/var/lib/hudson/slave/workspace/OpenModelica_BUILD_GCC_4.9/OpenModelica/build/include/omc/c -I../Util/  -DADD_METARECORD_DEFINITIONS= -DOMC_BOOTSTRAPPING_STAGE_2  -c -o build/UnitAbsynBuilder.o build/UnitAbsynBuilder.c
gcc-4.9 -O2 -march=native -fno-stack-protector -fPIC  -Wno-parentheses-equality -Wno-unused-variable -Werror=implicit-function-declaration -I/var/lib/hudson/slave/workspace/OpenModelica_BUILD_GCC_4.9/OpenModelica/build/include/omc/c -I../Util/  -DADD_METARECORD_DEFINITIONS= -DOMC_BOOTSTRAPPING_STAGE_2  -c -o build/SimCodeUtil.o build/SimCodeUtil.c
gcc-4.9 -O2 -march=native -fno-stack-protector -fPIC  -Wno-parentheses-equality -Wno-unused-variable -Werror=implicit-function-declaration -I/var/lib/hudson/slave/workspace/OpenModelica_BUILD_GCC_4.9/OpenModelica/build/include/omc/c -I../Util/  -DADD_METARECORD_DEFINITIONS= -DOMC_BOOTSTRAPPING_STAGE_2  -c -o build/SimCodeMain.o build/SimCodeMain.c
gcc-4.9 -O2 -march=native -fno-stack-protector -fPIC  -Wno-parentheses-equality -Wno-unused-variable -Werror=implicit-function-declaration -I/var/lib/hudson/slave/workspace/OpenModelica_BUILD_GCC_4.9/OpenModelica/build/include/omc/c -I../Util/  -DADD_METARECORD_DEFINITIONS= -DOMC_BOOTSTRAPPING_STAGE_2  -c -o build/SimCode.o build/SimCode.c
gcc-4.9 -O2 -march=native -fno-stack-protector -fPIC  -Wno-parentheses-equality -Wno-unused-variable -Werror=implicit-function-declaration -I/var/lib/hudson/slave/workspace/OpenModelica_BUILD_GCC_4.9/OpenModelica/build/include/omc/c -I../Util/  -DADD_METARECORD_DEFINITIONS= -DOMC_BOOTSTRAPPING_STAGE_2  -c -o build/RewriteRules.o build/RewriteRules.c
gcc-4.9 -O2 -march=native -fno-stack-protector -fPIC  -Wno-parentheses-equality -Wno-unused-variable -Werror=implicit-function-declaration -I/var/lib/hudson/slave/workspace/OpenModelica_BUILD_GCC_4.9/OpenModelica/build/include/omc/c -I../Util/  -DADD_METARECORD_DEFINITIONS= -DOMC_BOOTSTRAPPING_STAGE_2  -c -o build/Refactor.o build/Refactor.c
gcc-4.9 -O2 -march=native -fno-stack-protector -fPIC  -Wno-parentheses-equality -Wno-unused-variable -Werror=implicit-function-declaration -I/var/lib/hudson/slave/workspace/OpenModelica_BUILD_GCC_4.9/OpenModelica/build/include/omc/c -I../Util/  -DADD_METARECORD_DEFINITIONS= -DOMC_BOOTSTRAPPING_STAGE_2  -c -o build/NFUnitCheck.o build/NFUnitCheck.c
gcc-4.9 -O2 -march=native -fno-stack-protector -fPIC  -Wno-parentheses-equality -Wno-unused-variable -Werror=implicit-function-declaration -I/var/lib/hudson/slave/workspace/OpenModelica_BUILD_GCC_4.9/OpenModelica/build/include/omc/c -I../Util/  -DADD_METARECORD_DEFINITIONS= -DOMC_BOOTSTRAPPING_STAGE_2  -c -o build/NFInstDump.o build/NFInstDump.c
gcc-4.9 -O2 -march=native -fno-stack-protector -fPIC  -Wno-parentheses-equality -Wno-unused-variable -Werror=implicit-function-declaration -I/var/lib/hudson/slave/workspace/OpenModelica_BUILD_GCC_4.9/OpenModelica/build/include/omc/c -I../Util/  -DADD_METARECORD_DEFINITIONS= -DOMC_BOOTSTRAPPING_STAGE_2  -c -o build/MidCode.o build/MidCode.c
gcc-4.9 -O2 -march=native -fno-stack-protector -fPIC  -Wno-parentheses-equality -Wno-unused-variable -Werror=implicit-function-declaration -I/var/lib/hudson/slave/workspace/OpenModelica_BUILD_GCC_4.9/OpenModelica/build/include/omc/c -I../Util/  -DADD_METARECORD_DEFINITIONS= -DOMC_BOOTSTRAPPING_STAGE_2  -c -o build/FGraphStream.o build/FGraphStream.c
gcc-4.9 -O2 -march=native -fno-stack-protector -fPIC  -Wno-parentheses-equality -Wno-unused-variable -Werror=implicit-function-declaration -I/var/lib/hudson/slave/workspace/OpenModelica_BUILD_GCC_4.9/OpenModelica/build/include/omc/c -I../Util/  -DADD_METARECORD_DEFINITIONS= -DOMC_BOOTSTRAPPING_STAGE_2  -c -o build/DumpGraphviz.o build/DumpGraphviz.c
gcc-4.9 -O2 -march=native -fno-stack-protector -fPIC  -Wno-parentheses-equality -Wno-unused-variable -Werror=implicit-function-declaration -I/var/lib/hudson/slave/workspace/OpenModelica_BUILD_GCC_4.9/OpenModelica/build/include/omc/c -I../Util/  -DADD_METARECORD_DEFINITIONS= -DOMC_BOOTSTRAPPING_STAGE_2  -c -o build/DAEToMid.o build/DAEToMid.c
gcc-4.9 -O2 -march=native -fno-stack-protector -fPIC  -Wno-parentheses-equality -Wno-unused-variable -Werror=implicit-function-declaration -I/var/lib/hudson/slave/workspace/OpenModelica_BUILD_GCC_4.9/OpenModelica/build/include/omc/c -I../Util/  -DADD_METARECORD_DEFINITIONS= -DOMC_BOOTSTRAPPING_STAGE_2  -c -o build/CodegenMidToC.o build/CodegenMidToC.c
gcc-4.9 -O2 -march=native -fno-stack-protector -fPIC  -Wno-parentheses-equality -Wno-unused-variable -Werror=implicit-function-declaration -I/var/lib/hudson/slave/workspace/OpenModelica_BUILD_GCC_4.9/OpenModelica/build/include/omc/c -I../Util/  -DADD_METARECORD_DEFINITIONS= -DOMC_BOOTSTRAPPING_STAGE_2  -c -o build/CevalScriptBackend.o build/CevalScriptBackend.c
gcc-4.9 -O2 -march=native -fno-stack-protector -fPIC  -Wno-parentheses-equality -Wno-unused-variable -Werror=implicit-function-declaration -I/var/lib/hudson/slave/workspace/OpenModelica_BUILD_GCC_4.9/OpenModelica/build/include/omc/c -I../Util/  -DADD_METARECORD_DEFINITIONS= -DOMC_BOOTSTRAPPING_STAGE_2  -c -o build/BackendDAEUtil.o build/BackendDAEUtil.c
gcc-4.9 -O2 -march=native -fno-stack-protector -fPIC  -Wno-parentheses-equality -Wno-unused-variable -Werror=implicit-function-declaration -I/var/lib/hudson/slave/workspace/OpenModelica_BUILD_GCC_4.9/OpenModelica/build/include/omc/c -I../Util/  -DADD_METARECORD_DEFINITIONS= -DOMC_BOOTSTRAPPING_STAGE_2  -c -o build/BackendDAECreate.o build/BackendDAECreate.c
gcc-4.9 -O2 -march=native -fno-stack-protector -fPIC  -Wno-parentheses-equality -Wno-unused-variable -Werror=implicit-function-declaration -I/var/lib/hudson/slave/workspace/OpenModelica_BUILD_GCC_4.9/OpenModelica/build/include/omc/c -I../Util/  -DADD_METARECORD_DEFINITIONS= -DOMC_BOOTSTRAPPING_STAGE_2  -c -o build/ZeroMQ.o build/ZeroMQ.c
gcc-4.9 -O2 -march=native -fno-stack-protector -fPIC  -Wno-parentheses-equality -Wno-unused-variable -Werror=implicit-function-declaration -I/var/lib/hudson/slave/workspace/OpenModelica_BUILD_GCC_4.9/OpenModelica/build/include/omc/c -I../Util/  -DADD_METARECORD_DEFINITIONS= -DOMC_BOOTSTRAPPING_STAGE_2  -c -o build/VarTransform.o build/VarTransform.c
gcc-4.9 -O2 -march=native -fno-stack-protector -fPIC  -Wno-parentheses-equality -Wno-unused-variable -Werror=implicit-function-declaration -I/var/lib/hudson/slave/workspace/OpenModelica_BUILD_GCC_4.9/OpenModelica/build/include/omc/c -I../Util/  -DADD_METARECORD_DEFINITIONS= -DOMC_BOOTSTRAPPING_STAGE_2  -c -o build/Util.o build/Util.c
gcc-4.9 -O2 -march=native -fno-stack-protector -fPIC  -Wno-parentheses-equality -Wno-unused-variable -Werror=implicit-function-declaration -I/var/lib/hudson/slave/workspace/OpenModelica_BUILD_GCC_4.9/OpenModelica/build/include/omc/c -I../Util/  -DADD_METARECORD_DEFINITIONS= -DOMC_BOOTSTRAPPING_STAGE_2  -c -o build/System.o build/System.c
gcc-4.9 -O2 -march=native -fno-stack-protector -fPIC  -Wno-parentheses-equality -Wno-unused-variable -Werror=implicit-function-declaration -I/var/lib/hudson/slave/workspace/OpenModelica_BUILD_GCC_4.9/OpenModelica/build/include/omc/c -I../Util/  -DADD_METARECORD_DEFINITIONS= -DOMC_BOOTSTRAPPING_STAGE_2  -c -o build/Socket.o build/Socket.c
gcc-4.9 -O2 -march=native -fno-stack-protector -fPIC  -Wno-parentheses-equality -Wno-unused-variable -Werror=implicit-function-declaration -I/var/lib/hudson/slave/workspace/OpenModelica_BUILD_GCC_4.9/OpenModelica/build/include/omc/c -I../Util/  -DADD_METARECORD_DEFINITIONS= -DOMC_BOOTSTRAPPING_STAGE_2  -c -o build/StringUtil.o build/StringUtil.c
gcc-4.9 -O2 -march=native -fno-stack-protector -fPIC  -Wno-parentheses-equality -Wno-unused-variable -Werror=implicit-function-declaration -I/var/lib/hudson/slave/workspace/OpenModelica_BUILD_GCC_4.9/OpenModelica/build/include/omc/c -I../Util/  -DADD_METARECORD_DEFINITIONS= -DOMC_BOOTSTRAPPING_STAGE_2  -c -o build/StackOverflow.o build/StackOverflow.c
gcc-4.9 -O2 -march=native -fno-stack-protector -fPIC  -Wno-parentheses-equality -Wno-unused-variable -Werror=implicit-function-declaration -I/var/lib/hudson/slave/workspace/OpenModelica_BUILD_GCC_4.9/OpenModelica/build/include/omc/c -I../Util/  -DADD_METARECORD_DEFINITIONS= -DOMC_BOOTSTRAPPING_STAGE_2  -c -o build/Settings.o build/Settings.c
gcc-4.9 -O2 -march=native -fno-stack-protector -fPIC  -Wno-parentheses-equality -Wno-unused-variable -Werror=implicit-function-declaration -I/var/lib/hudson/slave/workspace/OpenModelica_BUILD_GCC_4.9/OpenModelica/build/include/omc/c -I../Util/  -DADD_METARECORD_DEFINITIONS= -DOMC_BOOTSTRAPPING_STAGE_2  -c -o build/Print.o build/Print.c
gcc-4.9 -O2 -march=native -fno-stack-protector -fPIC  -Wno-parentheses-equality -Wno-unused-variable -Werror=implicit-function-declaration -I/var/lib/hudson/slave/workspace/OpenModelica_BUILD_GCC_4.9/OpenModelica/build/include/omc/c -I../Util/  -DADD_METARECORD_DEFINITIONS= -DOMC_BOOTSTRAPPING_STAGE_2  -c -o build/Pointer.o build/Pointer.c
gcc-4.9 -O2 -march=native -fno-stack-protector -fPIC  -Wno-parentheses-equality -Wno-unused-variable -Werror=implicit-function-declaration -I/var/lib/hudson/slave/workspace/OpenModelica_BUILD_GCC_4.9/OpenModelica/build/include/omc/c -I../Util/  -DADD_METARECORD_DEFINITIONS= -DOMC_BOOTSTRAPPING_STAGE_2  -c -o build/Mutable.o build/Mutable.c
gcc-4.9 -O2 -march=native -fno-stack-protector -fPIC  -Wno-parentheses-equality -Wno-unused-variable -Werror=implicit-function-declaration -I/var/lib/hudson/slave/workspace/OpenModelica_BUILD_GCC_4.9/OpenModelica/build/include/omc/c -I../Util/  -DADD_METARECORD_DEFINITIONS= -DOMC_BOOTSTRAPPING_STAGE_2  -c -o build/ModelicaExternalC.o build/ModelicaExternalC.c
gcc-4.9 -O2 -march=native -fno-stack-protector -fPIC  -Wno-parentheses-equality -Wno-unused-variable -Werror=implicit-function-declaration -I/var/lib/hudson/slave/workspace/OpenModelica_BUILD_GCC_4.9/OpenModelica/build/include/omc/c -I../Util/  -DADD_METARECORD_DEFINITIONS= -DOMC_BOOTSTRAPPING_STAGE_2  -c -o build/List.o build/List.c
gcc-4.9 -O2 -march=native -fno-stack-protector -fPIC  -Wno-parentheses-equality -Wno-unused-variable -Werror=implicit-function-declaration -I/var/lib/hudson/slave/workspace/OpenModelica_BUILD_GCC_4.9/OpenModelica/build/include/omc/c -I../Util/  -DADD_METARECORD_DEFINITIONS= -DOMC_BOOTSTRAPPING_STAGE_2  -c -o build/Lapack.o build/Lapack.c
gcc-4.9 -O2 -march=native -fno-stack-protector -fPIC  -Wno-parentheses-equality -Wno-unused-variable -Werror=implicit-function-declaration -I/var/lib/hudson/slave/workspace/OpenModelica_BUILD_GCC_4.9/OpenModelica/build/include/omc/c -I../Util/  -DADD_METARECORD_DEFINITIONS= -DOMC_BOOTSTRAPPING_STAGE_2  -c -o build/IOStream.o build/IOStream.c
gcc-4.9 -O2 -march=native -fno-stack-protector -fPIC  -Wno-parentheses-equality -Wno-unused-variable -Werror=implicit-function-declaration -I/var/lib/hudson/slave/workspace/OpenModelica_BUILD_GCC_4.9/OpenModelica/build/include/omc/c -I../Util/  -DADD_METARECORD_DEFINITIONS= -DOMC_BOOTSTRAPPING_STAGE_2  -c -o build/IOStreamExt.o build/IOStreamExt.c
gcc-4.9 -O2 -march=native -fno-stack-protector -fPIC  -Wno-parentheses-equality -Wno-unused-variable -Werror=implicit-function-declaration -I/var/lib/hudson/slave/workspace/OpenModelica_BUILD_GCC_4.9/OpenModelica/build/include/omc/c -I../Util/  -DADD_METARECORD_DEFINITIONS= -DOMC_BOOTSTRAPPING_STAGE_2  -c -o build/HashTableStringToProgram.o build/HashTableStringToProgram.c
gcc-4.9 -O2 -march=native -fno-stack-protector -fPIC  -Wno-parentheses-equality -Wno-unused-variable -Werror=implicit-function-declaration -I/var/lib/hudson/slave/workspace/OpenModelica_BUILD_GCC_4.9/OpenModelica/build/include/omc/c -I../Util/  -DADD_METARECORD_DEFINITIONS= -DOMC_BOOTSTRAPPING_STAGE_2  -c -o build/HashTableStringToPath.o build/HashTableStringToPath.c
gcc-4.9 -O2 -march=native -fno-stack-protector -fPIC  -Wno-parentheses-equality -Wno-unused-variable -Werror=implicit-function-declaration -I/var/lib/hudson/slave/workspace/OpenModelica_BUILD_GCC_4.9/OpenModelica/build/include/omc/c -I../Util/  -DADD_METARECORD_DEFINITIONS= -DOMC_BOOTSTRAPPING_STAGE_2  -c -o build/HashTableSM1.o build/HashTableSM1.c
gcc-4.9 -O2 -march=native -fno-stack-protector -fPIC  -Wno-parentheses-equality -Wno-unused-variable -Werror=implicit-function-declaration -I/var/lib/hudson/slave/workspace/OpenModelica_BUILD_GCC_4.9/OpenModelica/build/include/omc/c -I../Util/  -DADD_METARECORD_DEFINITIONS= -DOMC_BOOTSTRAPPING_STAGE_2  -c -o build/HashTableExpToIndex.o build/HashTableExpToIndex.c
gcc-4.9 -O2 -march=native -fno-stack-protector -fPIC  -Wno-parentheses-equality -Wno-unused-variable -Werror=implicit-function-declaration -I/var/lib/hudson/slave/workspace/OpenModelica_BUILD_GCC_4.9/OpenModelica/build/include/omc/c -I../Util/  -DADD_METARECORD_DEFINITIONS= -DOMC_BOOTSTRAPPING_STAGE_2  -c -o build/HashTable.o build/HashTable.c
gcc-4.9 -O2 -march=native -fno-stack-protector -fPIC  -Wno-parentheses-equality -Wno-unused-variable -Werror=implicit-function-declaration -I/var/lib/hudson/slave/workspace/OpenModelica_BUILD_GCC_4.9/OpenModelica/build/include/omc/c -I../Util/  -DADD_METARECORD_DEFINITIONS= -DOMC_BOOTSTRAPPING_STAGE_2  -c -o build/HashTableCrToExpOption.o build/HashTableCrToExpOption.c
gcc-4.9 -O2 -march=native -fno-stack-protector -fPIC  -Wno-parentheses-equality -Wno-unused-variable -Werror=implicit-function-declaration -I/var/lib/hudson/slave/workspace/OpenModelica_BUILD_GCC_4.9/OpenModelica/build/include/omc/c -I../Util/  -DADD_METARECORD_DEFINITIONS= -DOMC_BOOTSTRAPPING_STAGE_2  -c -o build/HashTableCrIListArray.o build/HashTableCrIListArray.c
gcc-4.9 -O2 -march=native -fno-stack-protector -fPIC  -Wno-parentheses-equality -Wno-unused-variable -Werror=implicit-function-declaration -I/var/lib/hudson/slave/workspace/OpenModelica_BUILD_GCC_4.9/OpenModelica/build/include/omc/c -I../Util/  -DADD_METARECORD_DEFINITIONS= -DOMC_BOOTSTRAPPING_STAGE_2  -c -o build/HashTableCrILst.o build/HashTableCrILst.c
gcc-4.9 -O2 -march=native -fno-stack-protector -fPIC  -Wno-parentheses-equality -Wno-unused-variable -Werror=implicit-function-declaration -I/var/lib/hudson/slave/workspace/OpenModelica_BUILD_GCC_4.9/OpenModelica/build/include/omc/c -I../Util/  -DADD_METARECORD_DEFINITIONS= -DOMC_BOOTSTRAPPING_STAGE_2  -c -o build/HashTableCrefSimVar.o build/HashTableCrefSimVar.c
gcc-4.9 -O2 -march=native -fno-stack-protector -fPIC  -Wno-parentheses-equality -Wno-unused-variable -Werror=implicit-function-declaration -I/var/lib/hudson/slave/workspace/OpenModelica_BUILD_GCC_4.9/OpenModelica/build/include/omc/c -I../Util/  -DADD_METARECORD_DEFINITIONS= -DOMC_BOOTSTRAPPING_STAGE_2  -c -o build/HashTableCG.o build/HashTableCG.c
gcc-4.9 -O2 -march=native -fno-stack-protector -fPIC  -Wno-parentheses-equality -Wno-unused-variable -Werror=implicit-function-declaration -I/var/lib/hudson/slave/workspace/OpenModelica_BUILD_GCC_4.9/OpenModelica/build/include/omc/c -I../Util/  -DADD_METARECORD_DEFINITIONS= -DOMC_BOOTSTRAPPING_STAGE_2  -c -o build/HashTable5.o build/HashTable5.c
gcc-4.9 -O2 -march=native -fno-stack-protector -fPIC  -Wno-parentheses-equality -Wno-unused-variable -Werror=implicit-function-declaration -I/var/lib/hudson/slave/workspace/OpenModelica_BUILD_GCC_4.9/OpenModelica/build/include/omc/c -I../Util/  -DADD_METARECORD_DEFINITIONS= -DOMC_BOOTSTRAPPING_STAGE_2  -c -o build/HashTable3.o build/HashTable3.c
gcc-4.9 -O2 -march=native -fno-stack-protector -fPIC  -Wno-parentheses-equality -Wno-unused-variable -Werror=implicit-function-declaration -I/var/lib/hudson/slave/workspace/OpenModelica_BUILD_GCC_4.9/OpenModelica/build/include/omc/c -I../Util/  -DADD_METARECORD_DEFINITIONS= -DOMC_BOOTSTRAPPING_STAGE_2  -c -o build/HashTable2.o build/HashTable2.c
gcc-4.9 -O2 -march=native -fno-stack-protector -fPIC  -Wno-parentheses-equality -Wno-unused-variable -Werror=implicit-function-declaration -I/var/lib/hudson/slave/workspace/OpenModelica_BUILD_GCC_4.9/OpenModelica/build/include/omc/c -I../Util/  -DADD_METARECORD_DEFINITIONS= -DOMC_BOOTSTRAPPING_STAGE_2  -c -o build/HashSetString.o build/HashSetString.c
gcc-4.9 -O2 -march=native -fno-stack-protector -fPIC  -Wno-parentheses-equality -Wno-unused-variable -Werror=implicit-function-declaration -I/var/lib/hudson/slave/workspace/OpenModelica_BUILD_GCC_4.9/OpenModelica/build/include/omc/c -I../Util/  -DADD_METARECORD_DEFINITIONS= -DOMC_BOOTSTRAPPING_STAGE_2  -c -o build/HashSetExp.o build/HashSetExp.c
gcc-4.9 -O2 -march=native -fno-stack-protector -fPIC  -Wno-parentheses-equality -Wno-unused-variable -Werror=implicit-function-declaration -I/var/lib/hudson/slave/workspace/OpenModelica_BUILD_GCC_4.9/OpenModelica/build/include/omc/c -I../Util/  -DADD_METARECORD_DEFINITIONS= -DOMC_BOOTSTRAPPING_STAGE_2  -c -o build/HashSet.o build/HashSet.c
gcc-4.9 -O2 -march=native -fno-stack-protector -fPIC  -Wno-parentheses-equality -Wno-unused-variable -Werror=implicit-function-declaration -I/var/lib/hudson/slave/workspace/OpenModelica_BUILD_GCC_4.9/OpenModelica/build/include/omc/c -I../Util/  -DADD_METARECORD_DEFINITIONS= -DOMC_BOOTSTRAPPING_STAGE_2  -c -o build/GraphStreamExt.o build/GraphStreamExt.c
gcc-4.9 -O2 -march=native -fno-stack-protector -fPIC  -Wno-parentheses-equality -Wno-unused-variable -Werror=implicit-function-declaration -I/var/lib/hudson/slave/workspace/OpenModelica_BUILD_GCC_4.9/OpenModelica/build/include/omc/c -I../Util/  -DADD_METARECORD_DEFINITIONS= -DOMC_BOOTSTRAPPING_STAGE_2  -c -o build/GraphStream.o build/GraphStream.c
gcc-4.9 -O2 -march=native -fno-stack-protector -fPIC  -Wno-parentheses-equality -Wno-unused-variable -Werror=implicit-function-declaration -I/var/lib/hudson/slave/workspace/OpenModelica_BUILD_GCC_4.9/OpenModelica/build/include/omc/c -I../Util/  -DADD_METARECORD_DEFINITIONS= -DOMC_BOOTSTRAPPING_STAGE_2  -c -o build/Graph.o build/Graph.c
gcc-4.9 -O2 -march=native -fno-stack-protector -fPIC  -Wno-parentheses-equality -Wno-unused-variable -Werror=implicit-function-declaration -I/var/lib/hudson/slave/workspace/OpenModelica_BUILD_GCC_4.9/OpenModelica/build/include/omc/c -I../Util/  -DADD_METARECORD_DEFINITIONS= -DOMC_BOOTSTRAPPING_STAGE_2  -c -o build/GC.o build/GC.c
gcc-4.9 -O2 -march=native -fno-stack-protector -fPIC  -Wno-parentheses-equality -Wno-unused-variable -Werror=implicit-function-declaration -I/var/lib/hudson/slave/workspace/OpenModelica_BUILD_GCC_4.9/OpenModelica/build/include/omc/c -I../Util/  -DADD_METARECORD_DEFINITIONS= -DOMC_BOOTSTRAPPING_STAGE_2  -c -o build/Flags.o build/Flags.c
gcc-4.9 -O2 -march=native -fno-stack-protector -fPIC  -Wno-parentheses-equality -Wno-unused-variable -Werror=implicit-function-declaration -I/var/lib/hudson/slave/workspace/OpenModelica_BUILD_GCC_4.9/OpenModelica/build/include/omc/c -I../Util/  -DADD_METARECORD_DEFINITIONS= -DOMC_BOOTSTRAPPING_STAGE_2  -c -o build/ExpandableArray.o build/ExpandableArray.c
gcc-4.9 -O2 -march=native -fno-stack-protector -fPIC  -Wno-parentheses-equality -Wno-unused-variable -Werror=implicit-function-declaration -I/var/lib/hudson/slave/workspace/OpenModelica_BUILD_GCC_4.9/OpenModelica/build/include/omc/c -I../Util/  -DADD_METARECORD_DEFINITIONS= -DOMC_BOOTSTRAPPING_STAGE_2  -c -o build/ExecStat.o build/ExecStat.c
gcc-4.9 -O2 -march=native -fno-stack-protector -fPIC  -Wno-parentheses-equality -Wno-unused-variable -Werror=implicit-function-declaration -I/var/lib/hudson/slave/workspace/OpenModelica_BUILD_GCC_4.9/OpenModelica/build/include/omc/c -I../Util/  -DADD_METARECORD_DEFINITIONS= -DOMC_BOOTSTRAPPING_STAGE_2  -c -o build/Error.o build/Error.c
gcc-4.9 -O2 -march=native -fno-stack-protector -fPIC  -Wno-parentheses-equality -Wno-unused-variable -Werror=implicit-function-declaration -I/var/lib/hudson/slave/workspace/OpenModelica_BUILD_GCC_4.9/OpenModelica/build/include/omc/c -I../Util/  -DADD_METARECORD_DEFINITIONS= -DOMC_BOOTSTRAPPING_STAGE_2  -c -o build/ErrorExt.o build/ErrorExt.c
gcc-4.9 -O2 -march=native -fno-stack-protector -fPIC  -Wno-parentheses-equality -Wno-unused-variable -Werror=implicit-function-declaration -I/var/lib/hudson/slave/workspace/OpenModelica_BUILD_GCC_4.9/OpenModelica/build/include/omc/c -I../Util/  -DADD_METARECORD_DEFINITIONS= -DOMC_BOOTSTRAPPING_STAGE_2  -c -o build/DynLoad.o build/DynLoad.c
gcc-4.9 -O2 -march=native -fno-stack-protector -fPIC  -Wno-parentheses-equality -Wno-unused-variable -Werror=implicit-function-declaration -I/var/lib/hudson/slave/workspace/OpenModelica_BUILD_GCC_4.9/OpenModelica/build/include/omc/c -I../Util/  -DADD_METARECORD_DEFINITIONS= -DOMC_BOOTSTRAPPING_STAGE_2  -c -o build/DoubleEndedList.o build/DoubleEndedList.c
gcc-4.9 -O2 -march=native -fno-stack-protector -fPIC  -Wno-parentheses-equality -Wno-unused-variable -Werror=implicit-function-declaration -I/var/lib/hudson/slave/workspace/OpenModelica_BUILD_GCC_4.9/OpenModelica/build/include/omc/c -I../Util/  -DADD_METARECORD_DEFINITIONS= -DOMC_BOOTSTRAPPING_STAGE_2  -c -o build/DisjointSets.o build/DisjointSets.c
gcc-4.9 -O2 -march=native -fno-stack-protector -fPIC  -Wno-parentheses-equality -Wno-unused-variable -Werror=implicit-function-declaration -I/var/lib/hudson/slave/workspace/OpenModelica_BUILD_GCC_4.9/OpenModelica/build/include/omc/c -I../Util/  -DADD_METARECORD_DEFINITIONS= -DOMC_BOOTSTRAPPING_STAGE_2  -c -o build/Debug.o build/Debug.c
gcc-4.9 -O2 -march=native -fno-stack-protector -fPIC  -Wno-parentheses-equality -Wno-unused-variable -Werror=implicit-function-declaration -I/var/lib/hudson/slave/workspace/OpenModelica_BUILD_GCC_4.9/OpenModelica/build/include/omc/c -I../Util/  -DADD_METARECORD_DEFINITIONS= -DOMC_BOOTSTRAPPING_STAGE_2  -c -o build/Corba.o build/Corba.c
gcc-4.9 -O2 -march=native -fno-stack-protector -fPIC  -Wno-parentheses-equality -Wno-unused-variable -Werror=implicit-function-declaration -I/var/lib/hudson/slave/workspace/OpenModelica_BUILD_GCC_4.9/OpenModelica/build/include/omc/c -I../Util/  -DADD_METARECORD_DEFINITIONS= -DOMC_BOOTSTRAPPING_STAGE_2  -c -o build/Config.o build/Config.c
gcc-4.9 -O2 -march=native -fno-stack-protector -fPIC  -Wno-parentheses-equality -Wno-unused-variable -Werror=implicit-function-declaration -I/var/lib/hudson/slave/workspace/OpenModelica_BUILD_GCC_4.9/OpenModelica/build/include/omc/c -I../Util/  -DADD_METARECORD_DEFINITIONS= -DOMC_BOOTSTRAPPING_STAGE_2  -c -o build/ClockIndexes.o build/ClockIndexes.c
gcc-4.9 -O2 -march=native -fno-stack-protector -fPIC  -Wno-parentheses-equality -Wno-unused-variable -Werror=implicit-function-declaration -I/var/lib/hudson/slave/workspace/OpenModelica_BUILD_GCC_4.9/OpenModelica/build/include/omc/c -I../Util/  -DADD_METARECORD_DEFINITIONS= -DOMC_BOOTSTRAPPING_STAGE_2  -c -o build/BasePVector.o build/BasePVector.c
gcc-4.9 -O2 -march=native -fno-stack-protector -fPIC  -Wno-parentheses-equality -Wno-unused-variable -Werror=implicit-function-declaration -I/var/lib/hudson/slave/workspace/OpenModelica_BUILD_GCC_4.9/OpenModelica/build/include/omc/c -I../Util/  -DADD_METARECORD_DEFINITIONS= -DOMC_BOOTSTRAPPING_STAGE_2  -c -o build/BaseHashSet.o build/BaseHashSet.c
gcc-4.9 -O2 -march=native -fno-stack-protector -fPIC  -Wno-parentheses-equality -Wno-unused-variable -Werror=implicit-function-declaration -I/var/lib/hudson/slave/workspace/OpenModelica_BUILD_GCC_4.9/OpenModelica/build/include/omc/c -I../Util/  -DADD_METARECORD_DEFINITIONS= -DOMC_BOOTSTRAPPING_STAGE_2  -c -o build/BaseHashTable.o build/BaseHashTable.c
gcc-4.9 -O2 -march=native -fno-stack-protector -fPIC  -Wno-parentheses-equality -Wno-unused-variable -Werror=implicit-function-declaration -I/var/lib/hudson/slave/workspace/OpenModelica_BUILD_GCC_4.9/OpenModelica/build/include/omc/c -I../Util/  -DADD_METARECORD_DEFINITIONS= -DOMC_BOOTSTRAPPING_STAGE_2  -c -o build/BaseAvlSet.o build/BaseAvlSet.c
gcc-4.9 -O2 -march=native -fno-stack-protector -fPIC  -Wno-parentheses-equality -Wno-unused-variable -Werror=implicit-function-declaration -I/var/lib/hudson/slave/workspace/OpenModelica_BUILD_GCC_4.9/OpenModelica/build/include/omc/c -I../Util/  -DADD_METARECORD_DEFINITIONS= -DOMC_BOOTSTRAPPING_STAGE_2  -c -o build/BaseAvlTree.o build/BaseAvlTree.c
gcc-4.9 -O2 -march=native -fno-stack-protector -fPIC  -Wno-parentheses-equality -Wno-unused-variable -Werror=implicit-function-declaration -I/var/lib/hudson/slave/workspace/OpenModelica_BUILD_GCC_4.9/OpenModelica/build/include/omc/c -I../Util/  -DADD_METARECORD_DEFINITIONS= -DOMC_BOOTSTRAPPING_STAGE_2  -c -o build/AvlTreeCRToInt.o build/AvlTreeCRToInt.c
gcc-4.9 -O2 -march=native -fno-stack-protector -fPIC  -Wno-parentheses-equality -Wno-unused-variable -Werror=implicit-function-declaration -I/var/lib/hudson/slave/workspace/OpenModelica_BUILD_GCC_4.9/OpenModelica/build/include/omc/c -I../Util/  -DADD_METARECORD_DEFINITIONS= -DOMC_BOOTSTRAPPING_STAGE_2  -c -o build/AvlTreeStringString.o build/AvlTreeStringString.c
gcc-4.9 -O2 -march=native -fno-stack-protector -fPIC  -Wno-parentheses-equality -Wno-unused-variable -Werror=implicit-function-declaration -I/var/lib/hudson/slave/workspace/OpenModelica_BUILD_GCC_4.9/OpenModelica/build/include/omc/c -I../Util/  -DADD_METARECORD_DEFINITIONS= -DOMC_BOOTSTRAPPING_STAGE_2  -c -o build/AvlSetString.o build/AvlSetString.c
gcc-4.9 -O2 -march=native -fno-stack-protector -fPIC  -Wno-parentheses-equality -Wno-unused-variable -Werror=implicit-function-declaration -I/var/lib/hudson/slave/workspace/OpenModelica_BUILD_GCC_4.9/OpenModelica/build/include/omc/c -I../Util/  -DADD_METARECORD_DEFINITIONS= -DOMC_BOOTSTRAPPING_STAGE_2  -c -o build/AvlSetPath.o build/AvlSetPath.c
gcc-4.9 -O2 -march=native -fno-stack-protector -fPIC  -Wno-parentheses-equality -Wno-unused-variable -Werror=implicit-function-declaration -I/var/lib/hudson/slave/workspace/OpenModelica_BUILD_GCC_4.9/OpenModelica/build/include/omc/c -I../Util/  -DADD_METARECORD_DEFINITIONS= -DOMC_BOOTSTRAPPING_STAGE_2  -c -o build/AvlSetCR.o build/AvlSetCR.c
gcc-4.9 -O2 -march=native -fno-stack-protector -fPIC  -Wno-parentheses-equality -Wno-unused-variable -Werror=implicit-function-declaration -I/var/lib/hudson/slave/workspace/OpenModelica_BUILD_GCC_4.9/OpenModelica/build/include/omc/c -I../Util/  -DADD_METARECORD_DEFINITIONS= -DOMC_BOOTSTRAPPING_STAGE_2  -c -o build/Autoconf.o build/Autoconf.c
gcc-4.9 -O2 -march=native -fno-stack-protector -fPIC  -Wno-parentheses-equality -Wno-unused-variable -Werror=implicit-function-declaration -I/var/lib/hudson/slave/workspace/OpenModelica_BUILD_GCC_4.9/OpenModelica/build/include/omc/c -I../Util/  -DADD_METARECORD_DEFINITIONS= -DOMC_BOOTSTRAPPING_STAGE_2  -c -o build/Array.o build/Array.c
gcc-4.9 -O2 -march=native -fno-stack-protector -fPIC  -Wno-parentheses-equality -Wno-unused-variable -Werror=implicit-function-declaration -I/var/lib/hudson/slave/workspace/OpenModelica_BUILD_GCC_4.9/OpenModelica/build/include/omc/c -I../Util/  -DADD_METARECORD_DEFINITIONS= -DOMC_BOOTSTRAPPING_STAGE_2  -c -o build/Main.o build/Main.c
gcc-4.9 -O2 -march=native -fno-stack-protector -fPIC  -Wno-parentheses-equality -Wno-unused-variable -Werror=implicit-function-declaration -I/var/lib/hudson/slave/workspace/OpenModelica_BUILD_GCC_4.9/OpenModelica/build/include/omc/c -I../Util/  -DADD_METARECORD_DEFINITIONS= -DOMC_BOOTSTRAPPING_STAGE_2  -c -o build/Global.o build/Global.c
gcc-4.9 -O2 -march=native -fno-stack-protector -fPIC  -Wno-parentheses-equality -Wno-unused-variable -Werror=implicit-function-declaration -I/var/lib/hudson/slave/workspace/OpenModelica_BUILD_GCC_4.9/OpenModelica/build/include/omc/c -I../Util/  -DADD_METARECORD_DEFINITIONS= -DOMC_BOOTSTRAPPING_STAGE_2  -c -o build/Unparsing.o build/Unparsing.c
gcc-4.9 -O2 -march=native -fno-stack-protector -fPIC  -Wno-parentheses-equality -Wno-unused-variable -Werror=implicit-function-declaration -I/var/lib/hudson/slave/workspace/OpenModelica_BUILD_GCC_4.9/OpenModelica/build/include/omc/c -I../Util/  -DADD_METARECORD_DEFINITIONS= -DOMC_BOOTSTRAPPING_STAGE_2  -c -o build/TplParser.o build/TplParser.c
gcc-4.9 -O2 -march=native -fno-stack-protector -fPIC  -Wno-parentheses-equality -Wno-unused-variable -Werror=implicit-function-declaration -I/var/lib/hudson/slave/workspace/OpenModelica_BUILD_GCC_4.9/OpenModelica/build/include/omc/c -I../Util/  -DADD_METARECORD_DEFINITIONS= -DOMC_BOOTSTRAPPING_STAGE_2  -c -o build/Tpl.o build/Tpl.c
gcc-4.9 -O2 -march=native -fno-stack-protector -fPIC  -Wno-parentheses-equality -Wno-unused-variable -Werror=implicit-function-declaration -I/var/lib/hudson/slave/workspace/OpenModelica_BUILD_GCC_4.9/OpenModelica/build/include/omc/c -I../Util/  -DADD_METARECORD_DEFINITIONS= -DOMC_BOOTSTRAPPING_STAGE_2  -c -o build/TplMain.o build/TplMain.c
gcc-4.9 -O2 -march=native -fno-stack-protector -fPIC  -Wno-parentheses-equality -Wno-unused-variable -Werror=implicit-function-declaration -I/var/lib/hudson/slave/workspace/OpenModelica_BUILD_GCC_4.9/OpenModelica/build/include/omc/c -I../Util/  -DADD_METARECORD_DEFINITIONS= -DOMC_BOOTSTRAPPING_STAGE_2  -c -o build/TplCodegen.o build/TplCodegen.c
gcc-4.9 -O2 -march=native -fno-stack-protector -fPIC  -Wno-parentheses-equality -Wno-unused-variable -Werror=implicit-function-declaration -I/var/lib/hudson/slave/workspace/OpenModelica_BUILD_GCC_4.9/OpenModelica/build/include/omc/c -I../Util/  -DADD_METARECORD_DEFINITIONS= -DOMC_BOOTSTRAPPING_STAGE_2  -c -o build/TplAbsyn.o build/TplAbsyn.c
gcc-4.9 -O2 -march=native -fno-stack-protector -fPIC  -Wno-parentheses-equality -Wno-unused-variable -Werror=implicit-function-declaration -I/var/lib/hudson/slave/workspace/OpenModelica_BUILD_GCC_4.9/OpenModelica/build/include/omc/c -I../Util/  -DADD_METARECORD_DEFINITIONS= -DOMC_BOOTSTRAPPING_STAGE_2  -c -o build/SCodeDumpTpl.o build/SCodeDumpTpl.c
gcc-4.9 -O2 -march=native -fno-stack-protector -fPIC  -Wno-parentheses-equality -Wno-unused-variable -Werror=implicit-function-declaration -I/var/lib/hudson/slave/workspace/OpenModelica_BUILD_GCC_4.9/OpenModelica/build/include/omc/c -I../Util/  -DADD_METARECORD_DEFINITIONS= -DOMC_BOOTSTRAPPING_STAGE_2  -c -o build/GenerateAPIFunctionsTpl.o build/GenerateAPIFunctionsTpl.c
gcc-4.9 -O2 -march=native -fno-stack-protector -fPIC  -Wno-parentheses-equality -Wno-unused-variable -Werror=implicit-function-declaration -I/var/lib/hudson/slave/workspace/OpenModelica_BUILD_GCC_4.9/OpenModelica/build/include/omc/c -I../Util/  -DADD_METARECORD_DEFINITIONS= -DOMC_BOOTSTRAPPING_STAGE_2  -c -o build/ExpressionDumpTpl.o build/ExpressionDumpTpl.c
gcc-4.9 -O2 -march=native -fno-stack-protector -fPIC  -Wno-parentheses-equality -Wno-unused-variable -Werror=implicit-function-declaration -I/var/lib/hudson/slave/workspace/OpenModelica_BUILD_GCC_4.9/OpenModelica/build/include/omc/c -I../Util/  -DADD_METARECORD_DEFINITIONS= -DOMC_BOOTSTRAPPING_STAGE_2  -c -o build/DAEDumpTpl.o build/DAEDumpTpl.c
gcc-4.9 -O2 -march=native -fno-stack-protector -fPIC  -Wno-parentheses-equality -Wno-unused-variable -Werror=implicit-function-declaration -I/var/lib/hudson/slave/workspace/OpenModelica_BUILD_GCC_4.9/OpenModelica/build/include/omc/c -I../Util/  -DADD_METARECORD_DEFINITIONS= -DOMC_BOOTSTRAPPING_STAGE_2  -c -o build/CodegenUtil.o build/CodegenUtil.c
gcc-4.9 -O2 -march=native -fno-stack-protector -fPIC  -Wno-parentheses-equality -Wno-unused-variable -Werror=implicit-function-declaration -I/var/lib/hudson/slave/workspace/OpenModelica_BUILD_GCC_4.9/OpenModelica/build/include/omc/c -I../Util/  -DADD_METARECORD_DEFINITIONS= -DOMC_BOOTSTRAPPING_STAGE_2  -c -o build/CodegenCFunctions.o build/CodegenCFunctions.c
gcc-4.9 -O2 -march=native -fno-stack-protector -fPIC  -Wno-parentheses-equality -Wno-unused-variable -Werror=implicit-function-declaration -I/var/lib/hudson/slave/workspace/OpenModelica_BUILD_GCC_4.9/OpenModelica/build/include/omc/c -I../Util/  -DADD_METARECORD_DEFINITIONS= -DOMC_BOOTSTRAPPING_STAGE_2  -c -o build/AbsynDumpTpl.o build/AbsynDumpTpl.c
gcc-4.9 -O2 -march=native -fno-stack-protector -fPIC  -Wno-parentheses-equality -Wno-unused-variable -Werror=implicit-function-declaration -I/var/lib/hudson/slave/workspace/OpenModelica_BUILD_GCC_4.9/OpenModelica/build/include/omc/c -I../Util/  -DADD_METARECORD_DEFINITIONS= -DOMC_BOOTSTRAPPING_STAGE_2  -c -o build/SymbolTable.o build/SymbolTable.c
gcc-4.9 -O2 -march=native -fno-stack-protector -fPIC  -Wno-parentheses-equality -Wno-unused-variable -Werror=implicit-function-declaration -I/var/lib/hudson/slave/workspace/OpenModelica_BUILD_GCC_4.9/OpenModelica/build/include/omc/c -I../Util/  -DADD_METARECORD_DEFINITIONS= -DOMC_BOOTSTRAPPING_STAGE_2  -c -o build/StaticScript.o build/StaticScript.c
gcc-4.9 -O2 -march=native -fno-stack-protector -fPIC  -Wno-parentheses-equality -Wno-unused-variable -Werror=implicit-function-declaration -I/var/lib/hudson/slave/workspace/OpenModelica_BUILD_GCC_4.9/OpenModelica/build/include/omc/c -I../Util/  -DADD_METARECORD_DEFINITIONS= -DOMC_BOOTSTRAPPING_STAGE_2  -c -o build/Interactive.o build/Interactive.c
gcc-4.9 -O2 -march=native -fno-stack-protector -fPIC  -Wno-parentheses-equality -Wno-unused-variable -Werror=implicit-function-declaration -I/var/lib/hudson/slave/workspace/OpenModelica_BUILD_GCC_4.9/OpenModelica/build/include/omc/c -I../Util/  -DADD_METARECORD_DEFINITIONS= -DOMC_BOOTSTRAPPING_STAGE_2  -c -o build/GlobalScriptUtil.o build/GlobalScriptUtil.c
gcc-4.9 -O2 -march=native -fno-stack-protector -fPIC  -Wno-parentheses-equality -Wno-unused-variable -Werror=implicit-function-declaration -I/var/lib/hudson/slave/workspace/OpenModelica_BUILD_GCC_4.9/OpenModelica/build/include/omc/c -I../Util/  -DADD_METARECORD_DEFINITIONS= -DOMC_BOOTSTRAPPING_STAGE_2  -c -o build/GlobalScriptDump.o build/GlobalScriptDump.c
gcc-4.9 -O2 -march=native -fno-stack-protector -fPIC  -Wno-parentheses-equality -Wno-unused-variable -Werror=implicit-function-declaration -I/var/lib/hudson/slave/workspace/OpenModelica_BUILD_GCC_4.9/OpenModelica/build/include/omc/c -I../Util/  -DADD_METARECORD_DEFINITIONS= -DOMC_BOOTSTRAPPING_STAGE_2  -c -o build/GlobalScript.o build/GlobalScript.c
gcc-4.9 -O2 -march=native -fno-stack-protector -fPIC  -Wno-parentheses-equality -Wno-unused-variable -Werror=implicit-function-declaration -I/var/lib/hudson/slave/workspace/OpenModelica_BUILD_GCC_4.9/OpenModelica/build/include/omc/c -I../Util/  -DADD_METARECORD_DEFINITIONS= -DOMC_BOOTSTRAPPING_STAGE_2  -c -o build/CevalScript.o build/CevalScript.c
gcc-4.9 -O2 -march=native -fno-stack-protector -fPIC  -Wno-parentheses-equality -Wno-unused-variable -Werror=implicit-function-declaration -I/var/lib/hudson/slave/workspace/OpenModelica_BUILD_GCC_4.9/OpenModelica/build/include/omc/c -I../Util/  -DADD_METARECORD_DEFINITIONS= -DOMC_BOOTSTRAPPING_STAGE_2  -c -o build/SimCodeVar.o build/SimCodeVar.c
gcc-4.9 -O2 -march=native -fno-stack-protector -fPIC  -Wno-parentheses-equality -Wno-unused-variable -Werror=implicit-function-declaration -I/var/lib/hudson/slave/workspace/OpenModelica_BUILD_GCC_4.9/OpenModelica/build/include/omc/c -I../Util/  -DADD_METARECORD_DEFINITIONS= -DOMC_BOOTSTRAPPING_STAGE_2  -c -o build/SimCodeFunctionUtil.o build/SimCodeFunctionUtil.c
gcc-4.9 -O2 -march=native -fno-stack-protector -fPIC  -Wno-parentheses-equality -Wno-unused-variable -Werror=implicit-function-declaration -I/var/lib/hudson/slave/workspace/OpenModelica_BUILD_GCC_4.9/OpenModelica/build/include/omc/c -I../Util/  -DADD_METARECORD_DEFINITIONS= -DOMC_BOOTSTRAPPING_STAGE_2  -c -o build/SimCodeFunction.o build/SimCodeFunction.c
gcc-4.9 -O2 -march=native -fno-stack-protector -fPIC  -Wno-parentheses-equality -Wno-unused-variable -Werror=implicit-function-declaration -I/var/lib/hudson/slave/workspace/OpenModelica_BUILD_GCC_4.9/OpenModelica/build/include/omc/c -I../Util/  -DADD_METARECORD_DEFINITIONS= -DOMC_BOOTSTRAPPING_STAGE_2  -c -o build/HpcOmSimCode.o build/HpcOmSimCode.c
gcc-4.9 -O2 -march=native -fno-stack-protector -fPIC  -Wno-parentheses-equality -Wno-unused-variable -Werror=implicit-function-declaration -I/var/lib/hudson/slave/workspace/OpenModelica_BUILD_GCC_4.9/OpenModelica/build/include/omc/c -I../Util/  -DADD_METARECORD_DEFINITIONS= -DOMC_BOOTSTRAPPING_STAGE_2  -c -o build/BackendDAE.o build/BackendDAE.c
gcc-4.9 -O2 -march=native -fno-stack-protector -fPIC  -Wno-parentheses-equality -Wno-unused-variable -Werror=implicit-function-declaration -I/var/lib/hudson/slave/workspace/OpenModelica_BUILD_GCC_4.9/OpenModelica/build/include/omc/c -I../Util/  -DADD_METARECORD_DEFINITIONS= -DOMC_BOOTSTRAPPING_STAGE_2  -c -o build/FVisit.o build/FVisit.c
gcc-4.9 -O2 -march=native -fno-stack-protector -fPIC  -Wno-parentheses-equality -Wno-unused-variable -Werror=implicit-function-declaration -I/var/lib/hudson/slave/workspace/OpenModelica_BUILD_GCC_4.9/OpenModelica/build/include/omc/c -I../Util/  -DADD_METARECORD_DEFINITIONS= -DOMC_BOOTSTRAPPING_STAGE_2  -c -o build/FTraverse.o build/FTraverse.c
gcc-4.9 -O2 -march=native -fno-stack-protector -fPIC  -Wno-parentheses-equality -Wno-unused-variable -Werror=implicit-function-declaration -I/var/lib/hudson/slave/workspace/OpenModelica_BUILD_GCC_4.9/OpenModelica/build/include/omc/c -I../Util/  -DADD_METARECORD_DEFINITIONS= -DOMC_BOOTSTRAPPING_STAGE_2  -c -o build/FResolve.o build/FResolve.c
gcc-4.9 -O2 -march=native -fno-stack-protector -fPIC  -Wno-parentheses-equality -Wno-unused-variable -Werror=implicit-function-declaration -I/var/lib/hudson/slave/workspace/OpenModelica_BUILD_GCC_4.9/OpenModelica/build/include/omc/c -I../Util/  -DADD_METARECORD_DEFINITIONS= -DOMC_BOOTSTRAPPING_STAGE_2  -c -o build/FNode.o build/FNode.c
gcc-4.9 -O2 -march=native -fno-stack-protector -fPIC  -Wno-parentheses-equality -Wno-unused-variable -Werror=implicit-function-declaration -I/var/lib/hudson/slave/workspace/OpenModelica_BUILD_GCC_4.9/OpenModelica/build/include/omc/c -I../Util/  -DADD_METARECORD_DEFINITIONS= -DOMC_BOOTSTRAPPING_STAGE_2  -c -o build/FMod.o build/FMod.c
gcc-4.9 -O2 -march=native -fno-stack-protector -fPIC  -Wno-parentheses-equality -Wno-unused-variable -Werror=implicit-function-declaration -I/var/lib/hudson/slave/workspace/OpenModelica_BUILD_GCC_4.9/OpenModelica/build/include/omc/c -I../Util/  -DADD_METARECORD_DEFINITIONS= -DOMC_BOOTSTRAPPING_STAGE_2  -c -o build/FLookup.o build/FLookup.c
gcc-4.9 -O2 -march=native -fno-stack-protector -fPIC  -Wno-parentheses-equality -Wno-unused-variable -Werror=implicit-function-declaration -I/var/lib/hudson/slave/workspace/OpenModelica_BUILD_GCC_4.9/OpenModelica/build/include/omc/c -I../Util/  -DADD_METARECORD_DEFINITIONS= -DOMC_BOOTSTRAPPING_STAGE_2  -c -o build/FGraphBuildEnv.o build/FGraphBuildEnv.c
gcc-4.9 -O2 -march=native -fno-stack-protector -fPIC  -Wno-parentheses-equality -Wno-unused-variable -Werror=implicit-function-declaration -I/var/lib/hudson/slave/workspace/OpenModelica_BUILD_GCC_4.9/OpenModelica/build/include/omc/c -I../Util/  -DADD_METARECORD_DEFINITIONS= -DOMC_BOOTSTRAPPING_STAGE_2  -c -o build/FGraphBuild.o build/FGraphBuild.c
gcc-4.9 -O2 -march=native -fno-stack-protector -fPIC  -Wno-parentheses-equality -Wno-unused-variable -Werror=implicit-function-declaration -I/var/lib/hudson/slave/workspace/OpenModelica_BUILD_GCC_4.9/OpenModelica/build/include/omc/c -I../Util/  -DADD_METARECORD_DEFINITIONS= -DOMC_BOOTSTRAPPING_STAGE_2  -c -o build/FGraph.o build/FGraph.c
gcc-4.9 -O2 -march=native -fno-stack-protector -fPIC  -Wno-parentheses-equality -Wno-unused-variable -Werror=implicit-function-declaration -I/var/lib/hudson/slave/workspace/OpenModelica_BUILD_GCC_4.9/OpenModelica/build/include/omc/c -I../Util/  -DADD_METARECORD_DEFINITIONS= -DOMC_BOOTSTRAPPING_STAGE_2  -c -o build/FExpand.o build/FExpand.c
gcc-4.9 -O2 -march=native -fno-stack-protector -fPIC  -Wno-parentheses-equality -Wno-unused-variable -Werror=implicit-function-declaration -I/var/lib/hudson/slave/workspace/OpenModelica_BUILD_GCC_4.9/OpenModelica/build/include/omc/c -I../Util/  -DADD_METARECORD_DEFINITIONS= -DOMC_BOOTSTRAPPING_STAGE_2  -c -o build/FCore.o build/FCore.c
gcc-4.9 -O2 -march=native -fno-stack-protector -fPIC  -Wno-parentheses-equality -Wno-unused-variable -Werror=implicit-function-declaration -I/var/lib/hudson/slave/workspace/OpenModelica_BUILD_GCC_4.9/OpenModelica/build/include/omc/c -I../Util/  -DADD_METARECORD_DEFINITIONS= -DOMC_BOOTSTRAPPING_STAGE_2  -c -o build/FBuiltin.o build/FBuiltin.c
gcc-4.9 -O2 -march=native -fno-stack-protector -fPIC  -Wno-parentheses-equality -Wno-unused-variable -Werror=implicit-function-declaration -I/var/lib/hudson/slave/workspace/OpenModelica_BUILD_GCC_4.9/OpenModelica/build/include/omc/c -I../Util/  -DADD_METARECORD_DEFINITIONS= -DOMC_BOOTSTRAPPING_STAGE_2  -c -o build/ValuesUtil.o build/ValuesUtil.c
gcc-4.9 -O2 -march=native -fno-stack-protector -fPIC  -Wno-parentheses-equality -Wno-unused-variable -Werror=implicit-function-declaration -I/var/lib/hudson/slave/workspace/OpenModelica_BUILD_GCC_4.9/OpenModelica/build/include/omc/c -I../Util/  -DADD_METARECORD_DEFINITIONS= -DOMC_BOOTSTRAPPING_STAGE_2  -c -o build/Values.o build/Values.c
gcc-4.9 -O2 -march=native -fno-stack-protector -fPIC  -Wno-parentheses-equality -Wno-unused-variable -Werror=implicit-function-declaration -I/var/lib/hudson/slave/workspace/OpenModelica_BUILD_GCC_4.9/OpenModelica/build/include/omc/c -I../Util/  -DADD_METARECORD_DEFINITIONS= -DOMC_BOOTSTRAPPING_STAGE_2  -c -o build/UnitParserExt.o build/UnitParserExt.c
gcc-4.9 -O2 -march=native -fno-stack-protector -fPIC  -Wno-parentheses-equality -Wno-unused-variable -Werror=implicit-function-declaration -I/var/lib/hudson/slave/workspace/OpenModelica_BUILD_GCC_4.9/OpenModelica/build/include/omc/c -I../Util/  -DADD_METARECORD_DEFINITIONS= -DOMC_BOOTSTRAPPING_STAGE_2  -c -o build/UnitAbsyn.o build/UnitAbsyn.c
gcc-4.9 -O2 -march=native -fno-stack-protector -fPIC  -Wno-parentheses-equality -Wno-unused-variable -Werror=implicit-function-declaration -I/var/lib/hudson/slave/workspace/OpenModelica_BUILD_GCC_4.9/OpenModelica/build/include/omc/c -I../Util/  -DADD_METARECORD_DEFINITIONS= -DOMC_BOOTSTRAPPING_STAGE_2  -c -o build/Types.o build/Types.c
gcc-4.9 -O2 -march=native -fno-stack-protector -fPIC  -Wno-parentheses-equality -Wno-unused-variable -Werror=implicit-function-declaration -I/var/lib/hudson/slave/workspace/OpenModelica_BUILD_GCC_4.9/OpenModelica/build/include/omc/c -I../Util/  -DADD_METARECORD_DEFINITIONS= -DOMC_BOOTSTRAPPING_STAGE_2  -c -o build/StateMachineFlatten.o build/StateMachineFlatten.c
gcc-4.9 -O2 -march=native -fno-stack-protector -fPIC  -Wno-parentheses-equality -Wno-unused-variable -Werror=implicit-function-declaration -I/var/lib/hudson/slave/workspace/OpenModelica_BUILD_GCC_4.9/OpenModelica/build/include/omc/c -I../Util/  -DADD_METARECORD_DEFINITIONS= -DOMC_BOOTSTRAPPING_STAGE_2  -c -o build/NFSCodeCheck.o build/NFSCodeCheck.c
gcc-4.9 -O2 -march=native -fno-stack-protector -fPIC  -Wno-parentheses-equality -Wno-unused-variable -Werror=implicit-function-declaration -I/var/lib/hudson/slave/workspace/OpenModelica_BUILD_GCC_4.9/OpenModelica/build/include/omc/c -I../Util/  -DADD_METARECORD_DEFINITIONS= -DOMC_BOOTSTRAPPING_STAGE_2  -c -o build/NFSCodeLookup.o build/NFSCodeLookup.c
gcc-4.9 -O2 -march=native -fno-stack-protector -fPIC  -Wno-parentheses-equality -Wno-unused-variable -Werror=implicit-function-declaration -I/var/lib/hudson/slave/workspace/OpenModelica_BUILD_GCC_4.9/OpenModelica/build/include/omc/c -I../Util/  -DADD_METARECORD_DEFINITIONS= -DOMC_BOOTSTRAPPING_STAGE_2  -c -o build/NFSCodeFlattenRedeclare.o build/NFSCodeFlattenRedeclare.c
gcc-4.9 -O2 -march=native -fno-stack-protector -fPIC  -Wno-parentheses-equality -Wno-unused-variable -Werror=implicit-function-declaration -I/var/lib/hudson/slave/workspace/OpenModelica_BUILD_GCC_4.9/OpenModelica/build/include/omc/c -I../Util/  -DADD_METARECORD_DEFINITIONS= -DOMC_BOOTSTRAPPING_STAGE_2  -c -o build/NFSCodeFlatten.o build/NFSCodeFlatten.c
gcc-4.9 -O2 -march=native -fno-stack-protector -fPIC  -Wno-parentheses-equality -Wno-unused-variable -Werror=implicit-function-declaration -I/var/lib/hudson/slave/workspace/OpenModelica_BUILD_GCC_4.9/OpenModelica/build/include/omc/c -I../Util/  -DADD_METARECORD_DEFINITIONS= -DOMC_BOOTSTRAPPING_STAGE_2  -c -o build/NFSCodeFlattenImports.o build/NFSCodeFlattenImports.c
gcc-4.9 -O2 -march=native -fno-stack-protector -fPIC  -Wno-parentheses-equality -Wno-unused-variable -Werror=implicit-function-declaration -I/var/lib/hudson/slave/workspace/OpenModelica_BUILD_GCC_4.9/OpenModelica/build/include/omc/c -I../Util/  -DADD_METARECORD_DEFINITIONS= -DOMC_BOOTSTRAPPING_STAGE_2  -c -o build/NFSCodeEnv.o build/NFSCodeEnv.c
gcc-4.9 -O2 -march=native -fno-stack-protector -fPIC  -Wno-parentheses-equality -Wno-unused-variable -Werror=implicit-function-declaration -I/var/lib/hudson/slave/workspace/OpenModelica_BUILD_GCC_4.9/OpenModelica/build/include/omc/c -I../Util/  -DADD_METARECORD_DEFINITIONS= -DOMC_BOOTSTRAPPING_STAGE_2  -c -o build/NFSCodeDependency.o build/NFSCodeDependency.c
gcc-4.9 -O2 -march=native -fno-stack-protector -fPIC  -Wno-parentheses-equality -Wno-unused-variable -Werror=implicit-function-declaration -I/var/lib/hudson/slave/workspace/OpenModelica_BUILD_GCC_4.9/OpenModelica/build/include/omc/c -I../Util/  -DADD_METARECORD_DEFINITIONS= -DOMC_BOOTSTRAPPING_STAGE_2  -c -o build/NFInstUtil.o build/NFInstUtil.c
gcc-4.9 -O2 -march=native -fno-stack-protector -fPIC  -Wno-parentheses-equality -Wno-unused-variable -Werror=implicit-function-declaration -I/var/lib/hudson/slave/workspace/OpenModelica_BUILD_GCC_4.9/OpenModelica/build/include/omc/c -I../Util/  -DADD_METARECORD_DEFINITIONS= -DOMC_BOOTSTRAPPING_STAGE_2  -c -o build/NFInstTypes.o build/NFInstTypes.c
gcc-4.9 -O2 -march=native -fno-stack-protector -fPIC  -Wno-parentheses-equality -Wno-unused-variable -Werror=implicit-function-declaration -I/var/lib/hudson/slave/workspace/OpenModelica_BUILD_GCC_4.9/OpenModelica/build/include/omc/c -I../Util/  -DADD_METARECORD_DEFINITIONS= -DOMC_BOOTSTRAPPING_STAGE_2  -c -o build/NFInstPrefix.o build/NFInstPrefix.c
gcc-4.9 -O2 -march=native -fno-stack-protector -fPIC  -Wno-parentheses-equality -Wno-unused-variable -Werror=implicit-function-declaration -I/var/lib/hudson/slave/workspace/OpenModelica_BUILD_GCC_4.9/OpenModelica/build/include/omc/c -I../Util/  -DADD_METARECORD_DEFINITIONS= -DOMC_BOOTSTRAPPING_STAGE_2  -c -o build/NFEnvExtends.o build/NFEnvExtends.c
gcc-4.9 -O2 -march=native -fno-stack-protector -fPIC  -Wno-parentheses-equality -Wno-unused-variable -Werror=implicit-function-declaration -I/var/lib/hudson/slave/workspace/OpenModelica_BUILD_GCC_4.9/OpenModelica/build/include/omc/c -I../Util/  -DADD_METARECORD_DEFINITIONS= -DOMC_BOOTSTRAPPING_STAGE_2  -c -o build/Static.o build/Static.c
gcc-4.9 -O2 -march=native -fno-stack-protector -fPIC  -Wno-parentheses-equality -Wno-unused-variable -Werror=implicit-function-declaration -I/var/lib/hudson/slave/workspace/OpenModelica_BUILD_GCC_4.9/OpenModelica/build/include/omc/c -I../Util/  -DADD_METARECORD_DEFINITIONS= -DOMC_BOOTSTRAPPING_STAGE_2  -c -o build/SCodeUtil.o build/SCodeUtil.c
gcc-4.9 -O2 -march=native -fno-stack-protector -fPIC  -Wno-parentheses-equality -Wno-unused-variable -Werror=implicit-function-declaration -I/var/lib/hudson/slave/workspace/OpenModelica_BUILD_GCC_4.9/OpenModelica/build/include/omc/c -I../Util/  -DADD_METARECORD_DEFINITIONS= -DOMC_BOOTSTRAPPING_STAGE_2  -c -o build/SCodeDump.o build/SCodeDump.c
gcc-4.9 -O2 -march=native -fno-stack-protector -fPIC  -Wno-parentheses-equality -Wno-unused-variable -Werror=implicit-function-declaration -I/var/lib/hudson/slave/workspace/OpenModelica_BUILD_GCC_4.9/OpenModelica/build/include/omc/c -I../Util/  -DADD_METARECORD_DEFINITIONS= -DOMC_BOOTSTRAPPING_STAGE_2  -c -o build/SCode.o build/SCode.c
gcc-4.9 -O2 -march=native -fno-stack-protector -fPIC  -Wno-parentheses-equality -Wno-unused-variable -Werror=implicit-function-declaration -I/var/lib/hudson/slave/workspace/OpenModelica_BUILD_GCC_4.9/OpenModelica/build/include/omc/c -I../Util/  -DADD_METARECORD_DEFINITIONS= -DOMC_BOOTSTRAPPING_STAGE_2  -c -o build/PrefixUtil.o build/PrefixUtil.c
gcc-4.9 -O2 -march=native -fno-stack-protector -fPIC  -Wno-parentheses-equality -Wno-unused-variable -Werror=implicit-function-declaration -I/var/lib/hudson/slave/workspace/OpenModelica_BUILD_GCC_4.9/OpenModelica/build/include/omc/c -I../Util/  -DADD_METARECORD_DEFINITIONS= -DOMC_BOOTSTRAPPING_STAGE_2  -c -o build/Prefix.o build/Prefix.c
gcc-4.9 -O2 -march=native -fno-stack-protector -fPIC  -Wno-parentheses-equality -Wno-unused-variable -Werror=implicit-function-declaration -I/var/lib/hudson/slave/workspace/OpenModelica_BUILD_GCC_4.9/OpenModelica/build/include/omc/c -I../Util/  -DADD_METARECORD_DEFINITIONS= -DOMC_BOOTSTRAPPING_STAGE_2  -c -o build/Patternm.o build/Patternm.c
gcc-4.9 -O2 -march=native -fno-stack-protector -fPIC  -Wno-parentheses-equality -Wno-unused-variable -Werror=implicit-function-declaration -I/var/lib/hudson/slave/workspace/OpenModelica_BUILD_GCC_4.9/OpenModelica/build/include/omc/c -I../Util/  -DADD_METARECORD_DEFINITIONS= -DOMC_BOOTSTRAPPING_STAGE_2  -c -o build/ParserExt.o build/ParserExt.c
gcc-4.9 -O2 -march=native -fno-stack-protector -fPIC  -Wno-parentheses-equality -Wno-unused-variable -Werror=implicit-function-declaration -I/var/lib/hudson/slave/workspace/OpenModelica_BUILD_GCC_4.9/OpenModelica/build/include/omc/c -I../Util/  -DADD_METARECORD_DEFINITIONS= -DOMC_BOOTSTRAPPING_STAGE_2  -c -o build/Parser.o build/Parser.c
gcc-4.9 -O2 -march=native -fno-stack-protector -fPIC  -Wno-parentheses-equality -Wno-unused-variable -Werror=implicit-function-declaration -I/var/lib/hudson/slave/workspace/OpenModelica_BUILD_GCC_4.9/OpenModelica/build/include/omc/c -I../Util/  -DADD_METARECORD_DEFINITIONS= -DOMC_BOOTSTRAPPING_STAGE_2  -c -o build/OperatorOverloading.o build/OperatorOverloading.c
gcc-4.9 -O2 -march=native -fno-stack-protector -fPIC  -Wno-parentheses-equality -Wno-unused-variable -Werror=implicit-function-declaration -I/var/lib/hudson/slave/workspace/OpenModelica_BUILD_GCC_4.9/OpenModelica/build/include/omc/c -I../Util/  -DADD_METARECORD_DEFINITIONS= -DOMC_BOOTSTRAPPING_STAGE_2  -c -o build/Mod.o build/Mod.c
gcc-4.9 -O2 -march=native -fno-stack-protector -fPIC  -Wno-parentheses-equality -Wno-unused-variable -Werror=implicit-function-declaration -I/var/lib/hudson/slave/workspace/OpenModelica_BUILD_GCC_4.9/OpenModelica/build/include/omc/c -I../Util/  -DADD_METARECORD_DEFINITIONS= -DOMC_BOOTSTRAPPING_STAGE_2  -c -o build/MMath.o build/MMath.c
gcc-4.9 -O2 -march=native -fno-stack-protector -fPIC  -Wno-parentheses-equality -Wno-unused-variable -Werror=implicit-function-declaration -I/var/lib/hudson/slave/workspace/OpenModelica_BUILD_GCC_4.9/OpenModelica/build/include/omc/c -I../Util/  -DADD_METARECORD_DEFINITIONS= -DOMC_BOOTSTRAPPING_STAGE_2  -c -o build/MetaUtil.o build/MetaUtil.c
gcc-4.9 -O2 -march=native -fno-stack-protector -fPIC  -Wno-parentheses-equality -Wno-unused-variable -Werror=implicit-function-declaration -I/var/lib/hudson/slave/workspace/OpenModelica_BUILD_GCC_4.9/OpenModelica/build/include/omc/c -I../Util/  -DADD_METARECORD_DEFINITIONS= -DOMC_BOOTSTRAPPING_STAGE_2  -c -o build/Lookup.o build/Lookup.c
gcc-4.9 -O2 -march=native -fno-stack-protector -fPIC  -Wno-parentheses-equality -Wno-unused-variable -Werror=implicit-function-declaration -I/var/lib/hudson/slave/workspace/OpenModelica_BUILD_GCC_4.9/OpenModelica/build/include/omc/c -I../Util/  -DADD_METARECORD_DEFINITIONS= -DOMC_BOOTSTRAPPING_STAGE_2  -c -o build/InstTypes.o build/InstTypes.c
gcc-4.9 -O2 -march=native -fno-stack-protector -fPIC  -Wno-parentheses-equality -Wno-unused-variable -Werror=implicit-function-declaration -I/var/lib/hudson/slave/workspace/OpenModelica_BUILD_GCC_4.9/OpenModelica/build/include/omc/c -I../Util/  -DADD_METARECORD_DEFINITIONS= -DOMC_BOOTSTRAPPING_STAGE_2  -c -o build/InstStateMachineUtil.o build/InstStateMachineUtil.c
gcc-4.9 -O2 -march=native -fno-stack-protector -fPIC  -Wno-parentheses-equality -Wno-unused-variable -Werror=implicit-function-declaration -I/var/lib/hudson/slave/workspace/OpenModelica_BUILD_GCC_4.9/OpenModelica/build/include/omc/c -I../Util/  -DADD_METARECORD_DEFINITIONS= -DOMC_BOOTSTRAPPING_STAGE_2  -c -o build/InstSection.o build/InstSection.c
gcc-4.9 -O2 -march=native -fno-stack-protector -fPIC  -Wno-parentheses-equality -Wno-unused-variable -Werror=implicit-function-declaration -I/var/lib/hudson/slave/workspace/OpenModelica_BUILD_GCC_4.9/OpenModelica/build/include/omc/c -I../Util/  -DADD_METARECORD_DEFINITIONS= -DOMC_BOOTSTRAPPING_STAGE_2  -c -o build/InstExtends.o build/InstExtends.c
gcc-4.9 -O2 -march=native -fno-stack-protector -fPIC  -Wno-parentheses-equality -Wno-unused-variable -Werror=implicit-function-declaration -I/var/lib/hudson/slave/workspace/OpenModelica_BUILD_GCC_4.9/OpenModelica/build/include/omc/c -I../Util/  -DADD_METARECORD_DEFINITIONS= -DOMC_BOOTSTRAPPING_STAGE_2  -c -o build/InstUtil.o build/InstUtil.c
gcc-4.9 -O2 -march=native -fno-stack-protector -fPIC  -Wno-parentheses-equality -Wno-unused-variable -Werror=implicit-function-declaration -I/var/lib/hudson/slave/workspace/OpenModelica_BUILD_GCC_4.9/OpenModelica/build/include/omc/c -I../Util/  -DADD_METARECORD_DEFINITIONS= -DOMC_BOOTSTRAPPING_STAGE_2  -c -o build/InstBinding.o build/InstBinding.c
gcc-4.9 -O2 -march=native -fno-stack-protector -fPIC  -Wno-parentheses-equality -Wno-unused-variable -Werror=implicit-function-declaration -I/var/lib/hudson/slave/workspace/OpenModelica_BUILD_GCC_4.9/OpenModelica/build/include/omc/c -I../Util/  -DADD_METARECORD_DEFINITIONS= -DOMC_BOOTSTRAPPING_STAGE_2  -c -o build/InstFunction.o build/InstFunction.c
gcc-4.9 -O2 -march=native -fno-stack-protector -fPIC  -Wno-parentheses-equality -Wno-unused-variable -Werror=implicit-function-declaration -I/var/lib/hudson/slave/workspace/OpenModelica_BUILD_GCC_4.9/OpenModelica/build/include/omc/c -I../Util/  -DADD_METARECORD_DEFINITIONS= -DOMC_BOOTSTRAPPING_STAGE_2  -c -o build/InstDAE.o build/InstDAE.c
gcc-4.9 -O2 -march=native -fno-stack-protector -fPIC  -Wno-parentheses-equality -Wno-unused-variable -Werror=implicit-function-declaration -I/var/lib/hudson/slave/workspace/OpenModelica_BUILD_GCC_4.9/OpenModelica/build/include/omc/c -I../Util/  -DADD_METARECORD_DEFINITIONS= -DOMC_BOOTSTRAPPING_STAGE_2  -c -o build/InstVar.o build/InstVar.c
gcc-4.9 -O2 -march=native -fno-stack-protector -fPIC  -Wno-parentheses-equality -Wno-unused-variable -Werror=implicit-function-declaration -I/var/lib/hudson/slave/workspace/OpenModelica_BUILD_GCC_4.9/OpenModelica/build/include/omc/c -I../Util/  -DADD_METARECORD_DEFINITIONS= -DOMC_BOOTSTRAPPING_STAGE_2  -c -o build/Inst.o build/Inst.c
gcc-4.9 -O2 -march=native -fno-stack-protector -fPIC  -Wno-parentheses-equality -Wno-unused-variable -Werror=implicit-function-declaration -I/var/lib/hudson/slave/workspace/OpenModelica_BUILD_GCC_4.9/OpenModelica/build/include/omc/c -I../Util/  -DADD_METARECORD_DEFINITIONS= -DOMC_BOOTSTRAPPING_STAGE_2  -c -o build/InnerOuter.o build/InnerOuter.c
gcc-4.9 -O2 -march=native -fno-stack-protector -fPIC  -Wno-parentheses-equality -Wno-unused-variable -Werror=implicit-function-declaration -I/var/lib/hudson/slave/workspace/OpenModelica_BUILD_GCC_4.9/OpenModelica/build/include/omc/c -I../Util/  -DADD_METARECORD_DEFINITIONS= -DOMC_BOOTSTRAPPING_STAGE_2  -c -o build/Inline.o build/Inline.c
gcc-4.9 -O2 -march=native -fno-stack-protector -fPIC  -Wno-parentheses-equality -Wno-unused-variable -Werror=implicit-function-declaration -I/var/lib/hudson/slave/workspace/OpenModelica_BUILD_GCC_4.9/OpenModelica/build/include/omc/c -I../Util/  -DADD_METARECORD_DEFINITIONS= -DOMC_BOOTSTRAPPING_STAGE_2  -c -o build/Graphviz.o build/Graphviz.c
gcc-4.9 -O2 -march=native -fno-stack-protector -fPIC  -Wno-parentheses-equality -Wno-unused-variable -Werror=implicit-function-declaration -I/var/lib/hudson/slave/workspace/OpenModelica_BUILD_GCC_4.9/OpenModelica/build/include/omc/c -I../Util/  -DADD_METARECORD_DEFINITIONS= -DOMC_BOOTSTRAPPING_STAGE_2  -c -o build/ExpressionSimplifyTypes.o build/ExpressionSimplifyTypes.c
gcc-4.9 -O2 -march=native -fno-stack-protector -fPIC  -Wno-parentheses-equality -Wno-unused-variable -Werror=implicit-function-declaration -I/var/lib/hudson/slave/workspace/OpenModelica_BUILD_GCC_4.9/OpenModelica/build/include/omc/c -I../Util/  -DADD_METARECORD_DEFINITIONS= -DOMC_BOOTSTRAPPING_STAGE_2  -c -o build/ExpressionSimplify.o build/ExpressionSimplify.c
gcc-4.9 -O2 -march=native -fno-stack-protector -fPIC  -Wno-parentheses-equality -Wno-unused-variable -Werror=implicit-function-declaration -I/var/lib/hudson/slave/workspace/OpenModelica_BUILD_GCC_4.9/OpenModelica/build/include/omc/c -I../Util/  -DADD_METARECORD_DEFINITIONS= -DOMC_BOOTSTRAPPING_STAGE_2  -c -o build/Expression.o build/Expression.c
gcc-4.9 -O2 -march=native -fno-stack-protector -fPIC  -Wno-parentheses-equality -Wno-unused-variable -Werror=implicit-function-declaration -I/var/lib/hudson/slave/workspace/OpenModelica_BUILD_GCC_4.9/OpenModelica/build/include/omc/c -I../Util/  -DADD_METARECORD_DEFINITIONS= -DOMC_BOOTSTRAPPING_STAGE_2  -c -o build/ExpressionDump.o build/ExpressionDump.c
gcc-4.9 -O2 -march=native -fno-stack-protector -fPIC  -Wno-parentheses-equality -Wno-unused-variable -Werror=implicit-function-declaration -I/var/lib/hudson/slave/workspace/OpenModelica_BUILD_GCC_4.9/OpenModelica/build/include/omc/c -I../Util/  -DADD_METARECORD_DEFINITIONS= -DOMC_BOOTSTRAPPING_STAGE_2  -c -o build/ElementSource.o build/ElementSource.c
gcc-4.9 -O2 -march=native -fno-stack-protector -fPIC  -Wno-parentheses-equality -Wno-unused-variable -Werror=implicit-function-declaration -I/var/lib/hudson/slave/workspace/OpenModelica_BUILD_GCC_4.9/OpenModelica/build/include/omc/c -I../Util/  -DADD_METARECORD_DEFINITIONS= -DOMC_BOOTSTRAPPING_STAGE_2  -c -o build/Dump.o build/Dump.c
gcc-4.9 -O2 -march=native -fno-stack-protector -fPIC  -Wno-parentheses-equality -Wno-unused-variable -Werror=implicit-function-declaration -I/var/lib/hudson/slave/workspace/OpenModelica_BUILD_GCC_4.9/OpenModelica/build/include/omc/c -I../Util/  -DADD_METARECORD_DEFINITIONS= -DOMC_BOOTSTRAPPING_STAGE_2  -c -o build/DAEUtil.o build/DAEUtil.c
gcc-4.9 -O2 -march=native -fno-stack-protector -fPIC  -Wno-parentheses-equality -Wno-unused-variable -Werror=implicit-function-declaration -I/var/lib/hudson/slave/workspace/OpenModelica_BUILD_GCC_4.9/OpenModelica/build/include/omc/c -I../Util/  -DADD_METARECORD_DEFINITIONS= -DOMC_BOOTSTRAPPING_STAGE_2  -c -o build/DAE.o build/DAE.c
gcc-4.9 -O2 -march=native -fno-stack-protector -fPIC  -Wno-parentheses-equality -Wno-unused-variable -Werror=implicit-function-declaration -I/var/lib/hudson/slave/workspace/OpenModelica_BUILD_GCC_4.9/OpenModelica/build/include/omc/c -I../Util/  -DADD_METARECORD_DEFINITIONS= -DOMC_BOOTSTRAPPING_STAGE_2  -c -o build/DAEDump.o build/DAEDump.c
gcc-4.9 -O2 -march=native -fno-stack-protector -fPIC  -Wno-parentheses-equality -Wno-unused-variable -Werror=implicit-function-declaration -I/var/lib/hudson/slave/workspace/OpenModelica_BUILD_GCC_4.9/OpenModelica/build/include/omc/c -I../Util/  -DADD_METARECORD_DEFINITIONS= -DOMC_BOOTSTRAPPING_STAGE_2  -c -o build/Constants.o build/Constants.c
gcc-4.9 -O2 -march=native -fno-stack-protector -fPIC  -Wno-parentheses-equality -Wno-unused-variable -Werror=implicit-function-declaration -I/var/lib/hudson/slave/workspace/OpenModelica_BUILD_GCC_4.9/OpenModelica/build/include/omc/c -I../Util/  -DADD_METARECORD_DEFINITIONS= -DOMC_BOOTSTRAPPING_STAGE_2  -c -o build/ConnectUtil.o build/ConnectUtil.c
gcc-4.9 -O2 -march=native -fno-stack-protector -fPIC  -Wno-parentheses-equality -Wno-unused-variable -Werror=implicit-function-declaration -I/var/lib/hudson/slave/workspace/OpenModelica_BUILD_GCC_4.9/OpenModelica/build/include/omc/c -I../Util/  -DADD_METARECORD_DEFINITIONS= -DOMC_BOOTSTRAPPING_STAGE_2  -c -o build/Connect.o build/Connect.c
gcc-4.9 -O2 -march=native -fno-stack-protector -fPIC  -Wno-parentheses-equality -Wno-unused-variable -Werror=implicit-function-declaration -I/var/lib/hudson/slave/workspace/OpenModelica_BUILD_GCC_4.9/OpenModelica/build/include/omc/c -I../Util/  -DADD_METARECORD_DEFINITIONS= -DOMC_BOOTSTRAPPING_STAGE_2  -c -o build/ConnectionGraph.o build/ConnectionGraph.c
gcc-4.9 -O2 -march=native -fno-stack-protector -fPIC  -Wno-parentheses-equality -Wno-unused-variable -Werror=implicit-function-declaration -I/var/lib/hudson/slave/workspace/OpenModelica_BUILD_GCC_4.9/OpenModelica/build/include/omc/c -I../Util/  -DADD_METARECORD_DEFINITIONS= -DOMC_BOOTSTRAPPING_STAGE_2  -c -o build/ComponentReference.o build/ComponentReference.c
gcc-4.9 -O2 -march=native -fno-stack-protector -fPIC  -Wno-parentheses-equality -Wno-unused-variable -Werror=implicit-function-declaration -I/var/lib/hudson/slave/workspace/OpenModelica_BUILD_GCC_4.9/OpenModelica/build/include/omc/c -I../Util/  -DADD_METARECORD_DEFINITIONS= -DOMC_BOOTSTRAPPING_STAGE_2  -c -o build/ClassLoader.o build/ClassLoader.c
gcc-4.9 -O2 -march=native -fno-stack-protector -fPIC  -Wno-parentheses-equality -Wno-unused-variable -Werror=implicit-function-declaration -I/var/lib/hudson/slave/workspace/OpenModelica_BUILD_GCC_4.9/OpenModelica/build/include/omc/c -I../Util/  -DADD_METARECORD_DEFINITIONS= -DOMC_BOOTSTRAPPING_STAGE_2  -c -o build/ClassInf.o build/ClassInf.c
gcc-4.9 -O2 -march=native -fno-stack-protector -fPIC  -Wno-parentheses-equality -Wno-unused-variable -Werror=implicit-function-declaration -I/var/lib/hudson/slave/workspace/OpenModelica_BUILD_GCC_4.9/OpenModelica/build/include/omc/c -I../Util/  -DADD_METARECORD_DEFINITIONS= -DOMC_BOOTSTRAPPING_STAGE_2  -c -o build/Ceval.o build/Ceval.c
gcc-4.9 -O2 -march=native -fno-stack-protector -fPIC  -Wno-parentheses-equality -Wno-unused-variable -Werror=implicit-function-declaration -I/var/lib/hudson/slave/workspace/OpenModelica_BUILD_GCC_4.9/OpenModelica/build/include/omc/c -I../Util/  -DADD_METARECORD_DEFINITIONS= -DOMC_BOOTSTRAPPING_STAGE_2  -c -o build/CevalFunction.o build/CevalFunction.c
gcc-4.9 -O2 -march=native -fno-stack-protector -fPIC  -Wno-parentheses-equality -Wno-unused-variable -Werror=implicit-function-declaration -I/var/lib/hudson/slave/workspace/OpenModelica_BUILD_GCC_4.9/OpenModelica/build/include/omc/c -I../Util/  -DADD_METARECORD_DEFINITIONS= -DOMC_BOOTSTRAPPING_STAGE_2  -c -o build/Builtin.o build/Builtin.c
gcc-4.9 -O2 -march=native -fno-stack-protector -fPIC  -Wno-parentheses-equality -Wno-unused-variable -Werror=implicit-function-declaration -I/var/lib/hudson/slave/workspace/OpenModelica_BUILD_GCC_4.9/OpenModelica/build/include/omc/c -I../Util/  -DADD_METARECORD_DEFINITIONS= -DOMC_BOOTSTRAPPING_STAGE_2  -c -o build/BackendInterface.o build/BackendInterface.c
gcc-4.9 -O2 -march=native -fno-stack-protector -fPIC  -Wno-parentheses-equality -Wno-unused-variable -Werror=implicit-function-declaration -I/var/lib/hudson/slave/workspace/OpenModelica_BUILD_GCC_4.9/OpenModelica/build/include/omc/c -I../Util/  -DADD_METARECORD_DEFINITIONS= -DOMC_BOOTSTRAPPING_STAGE_2  -c -o build/Algorithm.o build/Algorithm.c
gcc-4.9 -O2 -march=native -fno-stack-protector -fPIC  -Wno-parentheses-equality -Wno-unused-variable -Werror=implicit-function-declaration -I/var/lib/hudson/slave/workspace/OpenModelica_BUILD_GCC_4.9/OpenModelica/build/include/omc/c -I../Util/  -DADD_METARECORD_DEFINITIONS= -DOMC_BOOTSTRAPPING_STAGE_2  -c -o build/AbsynUtil.o build/AbsynUtil.c
gcc-4.9 -O2 -march=native -fno-stack-protector -fPIC  -Wno-parentheses-equality -Wno-unused-variable -Werror=implicit-function-declaration -I/var/lib/hudson/slave/workspace/OpenModelica_BUILD_GCC_4.9/OpenModelica/build/include/omc/c -I../Util/  -DADD_METARECORD_DEFINITIONS= -DOMC_BOOTSTRAPPING_STAGE_2  -c -o build/Absyn.o build/Absyn.c
gcc-4.9 -O2 -march=native -fno-stack-protector -fPIC  -Wno-parentheses-equality -Wno-unused-variable -Werror=implicit-function-declaration -I/var/lib/hudson/slave/workspace/OpenModelica_BUILD_GCC_4.9/OpenModelica/build/include/omc/c -I../Util/  -DADD_METARECORD_DEFINITIONS= -DOMC_BOOTSTRAPPING_STAGE_2  -c -o build/File.o build/File.c
gcc-4.9 -O2 -march=native -fno-stack-protector -fPIC  -Wno-parentheses-equality -Wno-unused-variable -Werror=implicit-function-declaration -I/var/lib/hudson/slave/workspace/OpenModelica_BUILD_GCC_4.9/OpenModelica/build/include/omc/c -I../Util/  -DADD_METARECORD_DEFINITIONS= -DOMC_BOOTSTRAPPING_STAGE_2  -c -o build/ZeroCrossings_records.o build/ZeroCrossings_records.c
gcc-4.9 -O2 -march=native -fno-stack-protector -fPIC  -Wno-parentheses-equality -Wno-unused-variable -Werror=implicit-function-declaration -I/var/lib/hudson/slave/workspace/OpenModelica_BUILD_GCC_4.9/OpenModelica/build/include/omc/c -I../Util/  -DADD_METARECORD_DEFINITIONS= -DOMC_BOOTSTRAPPING_STAGE_2  -c -o build/UnitChecker_records.o build/UnitChecker_records.c
gcc-4.9 -O2 -march=native -fno-stack-protector -fPIC  -Wno-parentheses-equality -Wno-unused-variable -Werror=implicit-function-declaration -I/var/lib/hudson/slave/workspace/OpenModelica_BUILD_GCC_4.9/OpenModelica/build/include/omc/c -I../Util/  -DADD_METARECORD_DEFINITIONS= -DOMC_BOOTSTRAPPING_STAGE_2  -c -o build/UnitAbsynBuilder_records.o build/UnitAbsynBuilder_records.c
gcc-4.9 -O2 -march=native -fno-stack-protector -fPIC  -Wno-parentheses-equality -Wno-unused-variable -Werror=implicit-function-declaration -I/var/lib/hudson/slave/workspace/OpenModelica_BUILD_GCC_4.9/OpenModelica/build/include/omc/c -I../Util/  -DADD_METARECORD_DEFINITIONS= -DOMC_BOOTSTRAPPING_STAGE_2  -c -o build/SimCodeUtil_records.o build/SimCodeUtil_records.c
gcc-4.9 -O2 -march=native -fno-stack-protector -fPIC  -Wno-parentheses-equality -Wno-unused-variable -Werror=implicit-function-declaration -I/var/lib/hudson/slave/workspace/OpenModelica_BUILD_GCC_4.9/OpenModelica/build/include/omc/c -I../Util/  -DADD_METARECORD_DEFINITIONS= -DOMC_BOOTSTRAPPING_STAGE_2  -c -o build/SimCodeMain_records.o build/SimCodeMain_records.c
gcc-4.9 -O2 -march=native -fno-stack-protector -fPIC  -Wno-parentheses-equality -Wno-unused-variable -Werror=implicit-function-declaration -I/var/lib/hudson/slave/workspace/OpenModelica_BUILD_GCC_4.9/OpenModelica/build/include/omc/c -I../Util/  -DADD_METARECORD_DEFINITIONS= -DOMC_BOOTSTRAPPING_STAGE_2  -c -o build/SimCode_records.o build/SimCode_records.c
gcc-4.9 -O2 -march=native -fno-stack-protector -fPIC  -Wno-parentheses-equality -Wno-unused-variable -Werror=implicit-function-declaration -I/var/lib/hudson/slave/workspace/OpenModelica_BUILD_GCC_4.9/OpenModelica/build/include/omc/c -I../Util/  -DADD_METARECORD_DEFINITIONS= -DOMC_BOOTSTRAPPING_STAGE_2  -c -o build/RewriteRules_records.o build/RewriteRules_records.c
gcc-4.9 -O2 -march=native -fno-stack-protector -fPIC  -Wno-parentheses-equality -Wno-unused-variable -Werror=implicit-function-declaration -I/var/lib/hudson/slave/workspace/OpenModelica_BUILD_GCC_4.9/OpenModelica/build/include/omc/c -I../Util/  -DADD_METARECORD_DEFINITIONS= -DOMC_BOOTSTRAPPING_STAGE_2  -c -o build/Refactor_records.o build/Refactor_records.c
gcc-4.9 -O2 -march=native -fno-stack-protector -fPIC  -Wno-parentheses-equality -Wno-unused-variable -Werror=implicit-function-declaration -I/var/lib/hudson/slave/workspace/OpenModelica_BUILD_GCC_4.9/OpenModelica/build/include/omc/c -I../Util/  -DADD_METARECORD_DEFINITIONS= -DOMC_BOOTSTRAPPING_STAGE_2  -c -o build/NFUnitCheck_records.o build/NFUnitCheck_records.c
gcc-4.9 -O2 -march=native -fno-stack-protector -fPIC  -Wno-parentheses-equality -Wno-unused-variable -Werror=implicit-function-declaration -I/var/lib/hudson/slave/workspace/OpenModelica_BUILD_GCC_4.9/OpenModelica/build/include/omc/c -I../Util/  -DADD_METARECORD_DEFINITIONS= -DOMC_BOOTSTRAPPING_STAGE_2  -c -o build/NFInstDump_records.o build/NFInstDump_records.c
gcc-4.9 -O2 -march=native -fno-stack-protector -fPIC  -Wno-parentheses-equality -Wno-unused-variable -Werror=implicit-function-declaration -I/var/lib/hudson/slave/workspace/OpenModelica_BUILD_GCC_4.9/OpenModelica/build/include/omc/c -I../Util/  -DADD_METARECORD_DEFINITIONS= -DOMC_BOOTSTRAPPING_STAGE_2  -c -o build/MidCode_records.o build/MidCode_records.c
gcc-4.9 -O2 -march=native -fno-stack-protector -fPIC  -Wno-parentheses-equality -Wno-unused-variable -Werror=implicit-function-declaration -I/var/lib/hudson/slave/workspace/OpenModelica_BUILD_GCC_4.9/OpenModelica/build/include/omc/c -I../Util/  -DADD_METARECORD_DEFINITIONS= -DOMC_BOOTSTRAPPING_STAGE_2  -c -o build/FGraphStream_records.o build/FGraphStream_records.c
gcc-4.9 -O2 -march=native -fno-stack-protector -fPIC  -Wno-parentheses-equality -Wno-unused-variable -Werror=implicit-function-declaration -I/var/lib/hudson/slave/workspace/OpenModelica_BUILD_GCC_4.9/OpenModelica/build/include/omc/c -I../Util/  -DADD_METARECORD_DEFINITIONS= -DOMC_BOOTSTRAPPING_STAGE_2  -c -o build/DumpGraphviz_records.o build/DumpGraphviz_records.c
gcc-4.9 -O2 -march=native -fno-stack-protector -fPIC  -Wno-parentheses-equality -Wno-unused-variable -Werror=implicit-function-declaration -I/var/lib/hudson/slave/workspace/OpenModelica_BUILD_GCC_4.9/OpenModelica/build/include/omc/c -I../Util/  -DADD_METARECORD_DEFINITIONS= -DOMC_BOOTSTRAPPING_STAGE_2  -c -o build/DAEToMid_records.o build/DAEToMid_records.c
gcc-4.9 -O2 -march=native -fno-stack-protector -fPIC  -Wno-parentheses-equality -Wno-unused-variable -Werror=implicit-function-declaration -I/var/lib/hudson/slave/workspace/OpenModelica_BUILD_GCC_4.9/OpenModelica/build/include/omc/c -I../Util/  -DADD_METARECORD_DEFINITIONS= -DOMC_BOOTSTRAPPING_STAGE_2  -c -o build/CodegenMidToC_records.o build/CodegenMidToC_records.c
gcc-4.9 -O2 -march=native -fno-stack-protector -fPIC  -Wno-parentheses-equality -Wno-unused-variable -Werror=implicit-function-declaration -I/var/lib/hudson/slave/workspace/OpenModelica_BUILD_GCC_4.9/OpenModelica/build/include/omc/c -I../Util/  -DADD_METARECORD_DEFINITIONS= -DOMC_BOOTSTRAPPING_STAGE_2  -c -o build/CevalScriptBackend_records.o build/CevalScriptBackend_records.c
gcc-4.9 -O2 -march=native -fno-stack-protector -fPIC  -Wno-parentheses-equality -Wno-unused-variable -Werror=implicit-function-declaration -I/var/lib/hudson/slave/workspace/OpenModelica_BUILD_GCC_4.9/OpenModelica/build/include/omc/c -I../Util/  -DADD_METARECORD_DEFINITIONS= -DOMC_BOOTSTRAPPING_STAGE_2  -c -o build/BackendDAEUtil_records.o build/BackendDAEUtil_records.c
gcc-4.9 -O2 -march=native -fno-stack-protector -fPIC  -Wno-parentheses-equality -Wno-unused-variable -Werror=implicit-function-declaration -I/var/lib/hudson/slave/workspace/OpenModelica_BUILD_GCC_4.9/OpenModelica/build/include/omc/c -I../Util/  -DADD_METARECORD_DEFINITIONS= -DOMC_BOOTSTRAPPING_STAGE_2  -c -o build/BackendDAECreate_records.o build/BackendDAECreate_records.c
gcc-4.9 -O2 -march=native -fno-stack-protector -fPIC  -Wno-parentheses-equality -Wno-unused-variable -Werror=implicit-function-declaration -I/var/lib/hudson/slave/workspace/OpenModelica_BUILD_GCC_4.9/OpenModelica/build/include/omc/c -I../Util/  -DADD_METARECORD_DEFINITIONS= -DOMC_BOOTSTRAPPING_STAGE_2  -c -o build/ZeroMQ_records.o build/ZeroMQ_records.c
gcc-4.9 -O2 -march=native -fno-stack-protector -fPIC  -Wno-parentheses-equality -Wno-unused-variable -Werror=implicit-function-declaration -I/var/lib/hudson/slave/workspace/OpenModelica_BUILD_GCC_4.9/OpenModelica/build/include/omc/c -I../Util/  -DADD_METARECORD_DEFINITIONS= -DOMC_BOOTSTRAPPING_STAGE_2  -c -o build/VarTransform_records.o build/VarTransform_records.c
gcc-4.9 -O2 -march=native -fno-stack-protector -fPIC  -Wno-parentheses-equality -Wno-unused-variable -Werror=implicit-function-declaration -I/var/lib/hudson/slave/workspace/OpenModelica_BUILD_GCC_4.9/OpenModelica/build/include/omc/c -I../Util/  -DADD_METARECORD_DEFINITIONS= -DOMC_BOOTSTRAPPING_STAGE_2  -c -o build/Util_records.o build/Util_records.c
gcc-4.9 -O2 -march=native -fno-stack-protector -fPIC  -Wno-parentheses-equality -Wno-unused-variable -Werror=implicit-function-declaration -I/var/lib/hudson/slave/workspace/OpenModelica_BUILD_GCC_4.9/OpenModelica/build/include/omc/c -I../Util/  -DADD_METARECORD_DEFINITIONS= -DOMC_BOOTSTRAPPING_STAGE_2  -c -o build/System_records.o build/System_records.c
gcc-4.9 -O2 -march=native -fno-stack-protector -fPIC  -Wno-parentheses-equality -Wno-unused-variable -Werror=implicit-function-declaration -I/var/lib/hudson/slave/workspace/OpenModelica_BUILD_GCC_4.9/OpenModelica/build/include/omc/c -I../Util/  -DADD_METARECORD_DEFINITIONS= -DOMC_BOOTSTRAPPING_STAGE_2  -c -o build/Socket_records.o build/Socket_records.c
gcc-4.9 -O2 -march=native -fno-stack-protector -fPIC  -Wno-parentheses-equality -Wno-unused-variable -Werror=implicit-function-declaration -I/var/lib/hudson/slave/workspace/OpenModelica_BUILD_GCC_4.9/OpenModelica/build/include/omc/c -I../Util/  -DADD_METARECORD_DEFINITIONS= -DOMC_BOOTSTRAPPING_STAGE_2  -c -o build/StringUtil_records.o build/StringUtil_records.c
gcc-4.9 -O2 -march=native -fno-stack-protector -fPIC  -Wno-parentheses-equality -Wno-unused-variable -Werror=implicit-function-declaration -I/var/lib/hudson/slave/workspace/OpenModelica_BUILD_GCC_4.9/OpenModelica/build/include/omc/c -I../Util/  -DADD_METARECORD_DEFINITIONS= -DOMC_BOOTSTRAPPING_STAGE_2  -c -o build/StackOverflow_records.o build/StackOverflow_records.c
gcc-4.9 -O2 -march=native -fno-stack-protector -fPIC  -Wno-parentheses-equality -Wno-unused-variable -Werror=implicit-function-declaration -I/var/lib/hudson/slave/workspace/OpenModelica_BUILD_GCC_4.9/OpenModelica/build/include/omc/c -I../Util/  -DADD_METARECORD_DEFINITIONS= -DOMC_BOOTSTRAPPING_STAGE_2  -c -o build/Settings_records.o build/Settings_records.c
gcc-4.9 -O2 -march=native -fno-stack-protector -fPIC  -Wno-parentheses-equality -Wno-unused-variable -Werror=implicit-function-declaration -I/var/lib/hudson/slave/workspace/OpenModelica_BUILD_GCC_4.9/OpenModelica/build/include/omc/c -I../Util/  -DADD_METARECORD_DEFINITIONS= -DOMC_BOOTSTRAPPING_STAGE_2  -c -o build/Print_records.o build/Print_records.c
gcc-4.9 -O2 -march=native -fno-stack-protector -fPIC  -Wno-parentheses-equality -Wno-unused-variable -Werror=implicit-function-declaration -I/var/lib/hudson/slave/workspace/OpenModelica_BUILD_GCC_4.9/OpenModelica/build/include/omc/c -I../Util/  -DADD_METARECORD_DEFINITIONS= -DOMC_BOOTSTRAPPING_STAGE_2  -c -o build/Pointer_records.o build/Pointer_records.c
gcc-4.9 -O2 -march=native -fno-stack-protector -fPIC  -Wno-parentheses-equality -Wno-unused-variable -Werror=implicit-function-declaration -I/var/lib/hudson/slave/workspace/OpenModelica_BUILD_GCC_4.9/OpenModelica/build/include/omc/c -I../Util/  -DADD_METARECORD_DEFINITIONS= -DOMC_BOOTSTRAPPING_STAGE_2  -c -o build/Mutable_records.o build/Mutable_records.c
gcc-4.9 -O2 -march=native -fno-stack-protector -fPIC  -Wno-parentheses-equality -Wno-unused-variable -Werror=implicit-function-declaration -I/var/lib/hudson/slave/workspace/OpenModelica_BUILD_GCC_4.9/OpenModelica/build/include/omc/c -I../Util/  -DADD_METARECORD_DEFINITIONS= -DOMC_BOOTSTRAPPING_STAGE_2  -c -o build/ModelicaExternalC_records.o build/ModelicaExternalC_records.c
gcc-4.9 -O2 -march=native -fno-stack-protector -fPIC  -Wno-parentheses-equality -Wno-unused-variable -Werror=implicit-function-declaration -I/var/lib/hudson/slave/workspace/OpenModelica_BUILD_GCC_4.9/OpenModelica/build/include/omc/c -I../Util/  -DADD_METARECORD_DEFINITIONS= -DOMC_BOOTSTRAPPING_STAGE_2  -c -o build/List_records.o build/List_records.c
gcc-4.9 -O2 -march=native -fno-stack-protector -fPIC  -Wno-parentheses-equality -Wno-unused-variable -Werror=implicit-function-declaration -I/var/lib/hudson/slave/workspace/OpenModelica_BUILD_GCC_4.9/OpenModelica/build/include/omc/c -I../Util/  -DADD_METARECORD_DEFINITIONS= -DOMC_BOOTSTRAPPING_STAGE_2  -c -o build/Lapack_records.o build/Lapack_records.c
gcc-4.9 -O2 -march=native -fno-stack-protector -fPIC  -Wno-parentheses-equality -Wno-unused-variable -Werror=implicit-function-declaration -I/var/lib/hudson/slave/workspace/OpenModelica_BUILD_GCC_4.9/OpenModelica/build/include/omc/c -I../Util/  -DADD_METARECORD_DEFINITIONS= -DOMC_BOOTSTRAPPING_STAGE_2  -c -o build/IOStream_records.o build/IOStream_records.c
gcc-4.9 -O2 -march=native -fno-stack-protector -fPIC  -Wno-parentheses-equality -Wno-unused-variable -Werror=implicit-function-declaration -I/var/lib/hudson/slave/workspace/OpenModelica_BUILD_GCC_4.9/OpenModelica/build/include/omc/c -I../Util/  -DADD_METARECORD_DEFINITIONS= -DOMC_BOOTSTRAPPING_STAGE_2  -c -o build/IOStreamExt_records.o build/IOStreamExt_records.c
gcc-4.9 -O2 -march=native -fno-stack-protector -fPIC  -Wno-parentheses-equality -Wno-unused-variable -Werror=implicit-function-declaration -I/var/lib/hudson/slave/workspace/OpenModelica_BUILD_GCC_4.9/OpenModelica/build/include/omc/c -I../Util/  -DADD_METARECORD_DEFINITIONS= -DOMC_BOOTSTRAPPING_STAGE_2  -c -o build/HashTableStringToProgram_records.o build/HashTableStringToProgram_records.c
gcc-4.9 -O2 -march=native -fno-stack-protector -fPIC  -Wno-parentheses-equality -Wno-unused-variable -Werror=implicit-function-declaration -I/var/lib/hudson/slave/workspace/OpenModelica_BUILD_GCC_4.9/OpenModelica/build/include/omc/c -I../Util/  -DADD_METARECORD_DEFINITIONS= -DOMC_BOOTSTRAPPING_STAGE_2  -c -o build/HashTableStringToPath_records.o build/HashTableStringToPath_records.c
gcc-4.9 -O2 -march=native -fno-stack-protector -fPIC  -Wno-parentheses-equality -Wno-unused-variable -Werror=implicit-function-declaration -I/var/lib/hudson/slave/workspace/OpenModelica_BUILD_GCC_4.9/OpenModelica/build/include/omc/c -I../Util/  -DADD_METARECORD_DEFINITIONS= -DOMC_BOOTSTRAPPING_STAGE_2  -c -o build/HashTableSM1_records.o build/HashTableSM1_records.c
gcc-4.9 -O2 -march=native -fno-stack-protector -fPIC  -Wno-parentheses-equality -Wno-unused-variable -Werror=implicit-function-declaration -I/var/lib/hudson/slave/workspace/OpenModelica_BUILD_GCC_4.9/OpenModelica/build/include/omc/c -I../Util/  -DADD_METARECORD_DEFINITIONS= -DOMC_BOOTSTRAPPING_STAGE_2  -c -o build/HashTableExpToIndex_records.o build/HashTableExpToIndex_records.c
gcc-4.9 -O2 -march=native -fno-stack-protector -fPIC  -Wno-parentheses-equality -Wno-unused-variable -Werror=implicit-function-declaration -I/var/lib/hudson/slave/workspace/OpenModelica_BUILD_GCC_4.9/OpenModelica/build/include/omc/c -I../Util/  -DADD_METARECORD_DEFINITIONS= -DOMC_BOOTSTRAPPING_STAGE_2  -c -o build/HashTable_records.o build/HashTable_records.c
gcc-4.9 -O2 -march=native -fno-stack-protector -fPIC  -Wno-parentheses-equality -Wno-unused-variable -Werror=implicit-function-declaration -I/var/lib/hudson/slave/workspace/OpenModelica_BUILD_GCC_4.9/OpenModelica/build/include/omc/c -I../Util/  -DADD_METARECORD_DEFINITIONS= -DOMC_BOOTSTRAPPING_STAGE_2  -c -o build/HashTableCrToExpOption_records.o build/HashTableCrToExpOption_records.c
gcc-4.9 -O2 -march=native -fno-stack-protector -fPIC  -Wno-parentheses-equality -Wno-unused-variable -Werror=implicit-function-declaration -I/var/lib/hudson/slave/workspace/OpenModelica_BUILD_GCC_4.9/OpenModelica/build/include/omc/c -I../Util/  -DADD_METARECORD_DEFINITIONS= -DOMC_BOOTSTRAPPING_STAGE_2  -c -o build/HashTableCrIListArray_records.o build/HashTableCrIListArray_records.c
gcc-4.9 -O2 -march=native -fno-stack-protector -fPIC  -Wno-parentheses-equality -Wno-unused-variable -Werror=implicit-function-declaration -I/var/lib/hudson/slave/workspace/OpenModelica_BUILD_GCC_4.9/OpenModelica/build/include/omc/c -I../Util/  -DADD_METARECORD_DEFINITIONS= -DOMC_BOOTSTRAPPING_STAGE_2  -c -o build/HashTableCrILst_records.o build/HashTableCrILst_records.c
gcc-4.9 -O2 -march=native -fno-stack-protector -fPIC  -Wno-parentheses-equality -Wno-unused-variable -Werror=implicit-function-declaration -I/var/lib/hudson/slave/workspace/OpenModelica_BUILD_GCC_4.9/OpenModelica/build/include/omc/c -I../Util/  -DADD_METARECORD_DEFINITIONS= -DOMC_BOOTSTRAPPING_STAGE_2  -c -o build/HashTableCrefSimVar_records.o build/HashTableCrefSimVar_records.c
gcc-4.9 -O2 -march=native -fno-stack-protector -fPIC  -Wno-parentheses-equality -Wno-unused-variable -Werror=implicit-function-declaration -I/var/lib/hudson/slave/workspace/OpenModelica_BUILD_GCC_4.9/OpenModelica/build/include/omc/c -I../Util/  -DADD_METARECORD_DEFINITIONS= -DOMC_BOOTSTRAPPING_STAGE_2  -c -o build/HashTableCG_records.o build/HashTableCG_records.c
gcc-4.9 -O2 -march=native -fno-stack-protector -fPIC  -Wno-parentheses-equality -Wno-unused-variable -Werror=implicit-function-declaration -I/var/lib/hudson/slave/workspace/OpenModelica_BUILD_GCC_4.9/OpenModelica/build/include/omc/c -I../Util/  -DADD_METARECORD_DEFINITIONS= -DOMC_BOOTSTRAPPING_STAGE_2  -c -o build/HashTable5_records.o build/HashTable5_records.c
gcc-4.9 -O2 -march=native -fno-stack-protector -fPIC  -Wno-parentheses-equality -Wno-unused-variable -Werror=implicit-function-declaration -I/var/lib/hudson/slave/workspace/OpenModelica_BUILD_GCC_4.9/OpenModelica/build/include/omc/c -I../Util/  -DADD_METARECORD_DEFINITIONS= -DOMC_BOOTSTRAPPING_STAGE_2  -c -o build/HashTable3_records.o build/HashTable3_records.c
gcc-4.9 -O2 -march=native -fno-stack-protector -fPIC  -Wno-parentheses-equality -Wno-unused-variable -Werror=implicit-function-declaration -I/var/lib/hudson/slave/workspace/OpenModelica_BUILD_GCC_4.9/OpenModelica/build/include/omc/c -I../Util/  -DADD_METARECORD_DEFINITIONS= -DOMC_BOOTSTRAPPING_STAGE_2  -c -o build/HashTable2_records.o build/HashTable2_records.c
gcc-4.9 -O2 -march=native -fno-stack-protector -fPIC  -Wno-parentheses-equality -Wno-unused-variable -Werror=implicit-function-declaration -I/var/lib/hudson/slave/workspace/OpenModelica_BUILD_GCC_4.9/OpenModelica/build/include/omc/c -I../Util/  -DADD_METARECORD_DEFINITIONS= -DOMC_BOOTSTRAPPING_STAGE_2  -c -o build/HashSetString_records.o build/HashSetString_records.c
gcc-4.9 -O2 -march=native -fno-stack-protector -fPIC  -Wno-parentheses-equality -Wno-unused-variable -Werror=implicit-function-declaration -I/var/lib/hudson/slave/workspace/OpenModelica_BUILD_GCC_4.9/OpenModelica/build/include/omc/c -I../Util/  -DADD_METARECORD_DEFINITIONS= -DOMC_BOOTSTRAPPING_STAGE_2  -c -o build/HashSetExp_records.o build/HashSetExp_records.c
gcc-4.9 -O2 -march=native -fno-stack-protector -fPIC  -Wno-parentheses-equality -Wno-unused-variable -Werror=implicit-function-declaration -I/var/lib/hudson/slave/workspace/OpenModelica_BUILD_GCC_4.9/OpenModelica/build/include/omc/c -I../Util/  -DADD_METARECORD_DEFINITIONS= -DOMC_BOOTSTRAPPING_STAGE_2  -c -o build/HashSet_records.o build/HashSet_records.c
gcc-4.9 -O2 -march=native -fno-stack-protector -fPIC  -Wno-parentheses-equality -Wno-unused-variable -Werror=implicit-function-declaration -I/var/lib/hudson/slave/workspace/OpenModelica_BUILD_GCC_4.9/OpenModelica/build/include/omc/c -I../Util/  -DADD_METARECORD_DEFINITIONS= -DOMC_BOOTSTRAPPING_STAGE_2  -c -o build/GraphStreamExt_records.o build/GraphStreamExt_records.c
gcc-4.9 -O2 -march=native -fno-stack-protector -fPIC  -Wno-parentheses-equality -Wno-unused-variable -Werror=implicit-function-declaration -I/var/lib/hudson/slave/workspace/OpenModelica_BUILD_GCC_4.9/OpenModelica/build/include/omc/c -I../Util/  -DADD_METARECORD_DEFINITIONS= -DOMC_BOOTSTRAPPING_STAGE_2  -c -o build/GraphStream_records.o build/GraphStream_records.c
gcc-4.9 -O2 -march=native -fno-stack-protector -fPIC  -Wno-parentheses-equality -Wno-unused-variable -Werror=implicit-function-declaration -I/var/lib/hudson/slave/workspace/OpenModelica_BUILD_GCC_4.9/OpenModelica/build/include/omc/c -I../Util/  -DADD_METARECORD_DEFINITIONS= -DOMC_BOOTSTRAPPING_STAGE_2  -c -o build/Graph_records.o build/Graph_records.c
gcc-4.9 -O2 -march=native -fno-stack-protector -fPIC  -Wno-parentheses-equality -Wno-unused-variable -Werror=implicit-function-declaration -I/var/lib/hudson/slave/workspace/OpenModelica_BUILD_GCC_4.9/OpenModelica/build/include/omc/c -I../Util/  -DADD_METARECORD_DEFINITIONS= -DOMC_BOOTSTRAPPING_STAGE_2  -c -o build/GC_records.o build/GC_records.c
gcc-4.9 -O2 -march=native -fno-stack-protector -fPIC  -Wno-parentheses-equality -Wno-unused-variable -Werror=implicit-function-declaration -I/var/lib/hudson/slave/workspace/OpenModelica_BUILD_GCC_4.9/OpenModelica/build/include/omc/c -I../Util/  -DADD_METARECORD_DEFINITIONS= -DOMC_BOOTSTRAPPING_STAGE_2  -c -o build/Flags_records.o build/Flags_records.c
gcc-4.9 -O2 -march=native -fno-stack-protector -fPIC  -Wno-parentheses-equality -Wno-unused-variable -Werror=implicit-function-declaration -I/var/lib/hudson/slave/workspace/OpenModelica_BUILD_GCC_4.9/OpenModelica/build/include/omc/c -I../Util/  -DADD_METARECORD_DEFINITIONS= -DOMC_BOOTSTRAPPING_STAGE_2  -c -o build/ExpandableArray_records.o build/ExpandableArray_records.c
gcc-4.9 -O2 -march=native -fno-stack-protector -fPIC  -Wno-parentheses-equality -Wno-unused-variable -Werror=implicit-function-declaration -I/var/lib/hudson/slave/workspace/OpenModelica_BUILD_GCC_4.9/OpenModelica/build/include/omc/c -I../Util/  -DADD_METARECORD_DEFINITIONS= -DOMC_BOOTSTRAPPING_STAGE_2  -c -o build/ExecStat_records.o build/ExecStat_records.c
gcc-4.9 -O2 -march=native -fno-stack-protector -fPIC  -Wno-parentheses-equality -Wno-unused-variable -Werror=implicit-function-declaration -I/var/lib/hudson/slave/workspace/OpenModelica_BUILD_GCC_4.9/OpenModelica/build/include/omc/c -I../Util/  -DADD_METARECORD_DEFINITIONS= -DOMC_BOOTSTRAPPING_STAGE_2  -c -o build/Error_records.o build/Error_records.c
gcc-4.9 -O2 -march=native -fno-stack-protector -fPIC  -Wno-parentheses-equality -Wno-unused-variable -Werror=implicit-function-declaration -I/var/lib/hudson/slave/workspace/OpenModelica_BUILD_GCC_4.9/OpenModelica/build/include/omc/c -I../Util/  -DADD_METARECORD_DEFINITIONS= -DOMC_BOOTSTRAPPING_STAGE_2  -c -o build/ErrorExt_records.o build/ErrorExt_records.c
gcc-4.9 -O2 -march=native -fno-stack-protector -fPIC  -Wno-parentheses-equality -Wno-unused-variable -Werror=implicit-function-declaration -I/var/lib/hudson/slave/workspace/OpenModelica_BUILD_GCC_4.9/OpenModelica/build/include/omc/c -I../Util/  -DADD_METARECORD_DEFINITIONS= -DOMC_BOOTSTRAPPING_STAGE_2  -c -o build/DynLoad_records.o build/DynLoad_records.c
gcc-4.9 -O2 -march=native -fno-stack-protector -fPIC  -Wno-parentheses-equality -Wno-unused-variable -Werror=implicit-function-declaration -I/var/lib/hudson/slave/workspace/OpenModelica_BUILD_GCC_4.9/OpenModelica/build/include/omc/c -I../Util/  -DADD_METARECORD_DEFINITIONS= -DOMC_BOOTSTRAPPING_STAGE_2  -c -o build/DoubleEndedList_records.o build/DoubleEndedList_records.c
gcc-4.9 -O2 -march=native -fno-stack-protector -fPIC  -Wno-parentheses-equality -Wno-unused-variable -Werror=implicit-function-declaration -I/var/lib/hudson/slave/workspace/OpenModelica_BUILD_GCC_4.9/OpenModelica/build/include/omc/c -I../Util/  -DADD_METARECORD_DEFINITIONS= -DOMC_BOOTSTRAPPING_STAGE_2  -c -o build/DisjointSets_records.o build/DisjointSets_records.c
gcc-4.9 -O2 -march=native -fno-stack-protector -fPIC  -Wno-parentheses-equality -Wno-unused-variable -Werror=implicit-function-declaration -I/var/lib/hudson/slave/workspace/OpenModelica_BUILD_GCC_4.9/OpenModelica/build/include/omc/c -I../Util/  -DADD_METARECORD_DEFINITIONS= -DOMC_BOOTSTRAPPING_STAGE_2  -c -o build/Debug_records.o build/Debug_records.c
gcc-4.9 -O2 -march=native -fno-stack-protector -fPIC  -Wno-parentheses-equality -Wno-unused-variable -Werror=implicit-function-declaration -I/var/lib/hudson/slave/workspace/OpenModelica_BUILD_GCC_4.9/OpenModelica/build/include/omc/c -I../Util/  -DADD_METARECORD_DEFINITIONS= -DOMC_BOOTSTRAPPING_STAGE_2  -c -o build/Corba_records.o build/Corba_records.c
gcc-4.9 -O2 -march=native -fno-stack-protector -fPIC  -Wno-parentheses-equality -Wno-unused-variable -Werror=implicit-function-declaration -I/var/lib/hudson/slave/workspace/OpenModelica_BUILD_GCC_4.9/OpenModelica/build/include/omc/c -I../Util/  -DADD_METARECORD_DEFINITIONS= -DOMC_BOOTSTRAPPING_STAGE_2  -c -o build/Config_records.o build/Config_records.c
gcc-4.9 -O2 -march=native -fno-stack-protector -fPIC  -Wno-parentheses-equality -Wno-unused-variable -Werror=implicit-function-declaration -I/var/lib/hudson/slave/workspace/OpenModelica_BUILD_GCC_4.9/OpenModelica/build/include/omc/c -I../Util/  -DADD_METARECORD_DEFINITIONS= -DOMC_BOOTSTRAPPING_STAGE_2  -c -o build/ClockIndexes_records.o build/ClockIndexes_records.c
gcc-4.9 -O2 -march=native -fno-stack-protector -fPIC  -Wno-parentheses-equality -Wno-unused-variable -Werror=implicit-function-declaration -I/var/lib/hudson/slave/workspace/OpenModelica_BUILD_GCC_4.9/OpenModelica/build/include/omc/c -I../Util/  -DADD_METARECORD_DEFINITIONS= -DOMC_BOOTSTRAPPING_STAGE_2  -c -o build/BasePVector_records.o build/BasePVector_records.c
gcc-4.9 -O2 -march=native -fno-stack-protector -fPIC  -Wno-parentheses-equality -Wno-unused-variable -Werror=implicit-function-declaration -I/var/lib/hudson/slave/workspace/OpenModelica_BUILD_GCC_4.9/OpenModelica/build/include/omc/c -I../Util/  -DADD_METARECORD_DEFINITIONS= -DOMC_BOOTSTRAPPING_STAGE_2  -c -o build/BaseHashSet_records.o build/BaseHashSet_records.c
gcc-4.9 -O2 -march=native -fno-stack-protector -fPIC  -Wno-parentheses-equality -Wno-unused-variable -Werror=implicit-function-declaration -I/var/lib/hudson/slave/workspace/OpenModelica_BUILD_GCC_4.9/OpenModelica/build/include/omc/c -I../Util/  -DADD_METARECORD_DEFINITIONS= -DOMC_BOOTSTRAPPING_STAGE_2  -c -o build/BaseHashTable_records.o build/BaseHashTable_records.c
gcc-4.9 -O2 -march=native -fno-stack-protector -fPIC  -Wno-parentheses-equality -Wno-unused-variable -Werror=implicit-function-declaration -I/var/lib/hudson/slave/workspace/OpenModelica_BUILD_GCC_4.9/OpenModelica/build/include/omc/c -I../Util/  -DADD_METARECORD_DEFINITIONS= -DOMC_BOOTSTRAPPING_STAGE_2  -c -o build/BaseAvlSet_records.o build/BaseAvlSet_records.c
gcc-4.9 -O2 -march=native -fno-stack-protector -fPIC  -Wno-parentheses-equality -Wno-unused-variable -Werror=implicit-function-declaration -I/var/lib/hudson/slave/workspace/OpenModelica_BUILD_GCC_4.9/OpenModelica/build/include/omc/c -I../Util/  -DADD_METARECORD_DEFINITIONS= -DOMC_BOOTSTRAPPING_STAGE_2  -c -o build/BaseAvlTree_records.o build/BaseAvlTree_records.c
gcc-4.9 -O2 -march=native -fno-stack-protector -fPIC  -Wno-parentheses-equality -Wno-unused-variable -Werror=implicit-function-declaration -I/var/lib/hudson/slave/workspace/OpenModelica_BUILD_GCC_4.9/OpenModelica/build/include/omc/c -I../Util/  -DADD_METARECORD_DEFINITIONS= -DOMC_BOOTSTRAPPING_STAGE_2  -c -o build/AvlTreeCRToInt_records.o build/AvlTreeCRToInt_records.c
gcc-4.9 -O2 -march=native -fno-stack-protector -fPIC  -Wno-parentheses-equality -Wno-unused-variable -Werror=implicit-function-declaration -I/var/lib/hudson/slave/workspace/OpenModelica_BUILD_GCC_4.9/OpenModelica/build/include/omc/c -I../Util/  -DADD_METARECORD_DEFINITIONS= -DOMC_BOOTSTRAPPING_STAGE_2  -c -o build/AvlTreeStringString_records.o build/AvlTreeStringString_records.c
gcc-4.9 -O2 -march=native -fno-stack-protector -fPIC  -Wno-parentheses-equality -Wno-unused-variable -Werror=implicit-function-declaration -I/var/lib/hudson/slave/workspace/OpenModelica_BUILD_GCC_4.9/OpenModelica/build/include/omc/c -I../Util/  -DADD_METARECORD_DEFINITIONS= -DOMC_BOOTSTRAPPING_STAGE_2  -c -o build/AvlSetString_records.o build/AvlSetString_records.c
gcc-4.9 -O2 -march=native -fno-stack-protector -fPIC  -Wno-parentheses-equality -Wno-unused-variable -Werror=implicit-function-declaration -I/var/lib/hudson/slave/workspace/OpenModelica_BUILD_GCC_4.9/OpenModelica/build/include/omc/c -I../Util/  -DADD_METARECORD_DEFINITIONS= -DOMC_BOOTSTRAPPING_STAGE_2  -c -o build/AvlSetPath_records.o build/AvlSetPath_records.c
gcc-4.9 -O2 -march=native -fno-stack-protector -fPIC  -Wno-parentheses-equality -Wno-unused-variable -Werror=implicit-function-declaration -I/var/lib/hudson/slave/workspace/OpenModelica_BUILD_GCC_4.9/OpenModelica/build/include/omc/c -I../Util/  -DADD_METARECORD_DEFINITIONS= -DOMC_BOOTSTRAPPING_STAGE_2  -c -o build/AvlSetCR_records.o build/AvlSetCR_records.c
gcc-4.9 -O2 -march=native -fno-stack-protector -fPIC  -Wno-parentheses-equality -Wno-unused-variable -Werror=implicit-function-declaration -I/var/lib/hudson/slave/workspace/OpenModelica_BUILD_GCC_4.9/OpenModelica/build/include/omc/c -I../Util/  -DADD_METARECORD_DEFINITIONS= -DOMC_BOOTSTRAPPING_STAGE_2  -c -o build/Autoconf_records.o build/Autoconf_records.c
gcc-4.9 -O2 -march=native -fno-stack-protector -fPIC  -Wno-parentheses-equality -Wno-unused-variable -Werror=implicit-function-declaration -I/var/lib/hudson/slave/workspace/OpenModelica_BUILD_GCC_4.9/OpenModelica/build/include/omc/c -I../Util/  -DADD_METARECORD_DEFINITIONS= -DOMC_BOOTSTRAPPING_STAGE_2  -c -o build/Array_records.o build/Array_records.c
gcc-4.9 -O2 -march=native -fno-stack-protector -fPIC  -Wno-parentheses-equality -Wno-unused-variable -Werror=implicit-function-declaration -I/var/lib/hudson/slave/workspace/OpenModelica_BUILD_GCC_4.9/OpenModelica/build/include/omc/c -I../Util/  -DADD_METARECORD_DEFINITIONS= -DOMC_BOOTSTRAPPING_STAGE_2  -c -o build/Main_records.o build/Main_records.c
gcc-4.9 -O2 -march=native -fno-stack-protector -fPIC  -Wno-parentheses-equality -Wno-unused-variable -Werror=implicit-function-declaration -I/var/lib/hudson/slave/workspace/OpenModelica_BUILD_GCC_4.9/OpenModelica/build/include/omc/c -I../Util/  -DADD_METARECORD_DEFINITIONS= -DOMC_BOOTSTRAPPING_STAGE_2  -c -o build/Global_records.o build/Global_records.c
gcc-4.9 -O2 -march=native -fno-stack-protector -fPIC  -Wno-parentheses-equality -Wno-unused-variable -Werror=implicit-function-declaration -I/var/lib/hudson/slave/workspace/OpenModelica_BUILD_GCC_4.9/OpenModelica/build/include/omc/c -I../Util/  -DADD_METARECORD_DEFINITIONS= -DOMC_BOOTSTRAPPING_STAGE_2  -c -o build/Unparsing_records.o build/Unparsing_records.c
gcc-4.9 -O2 -march=native -fno-stack-protector -fPIC  -Wno-parentheses-equality -Wno-unused-variable -Werror=implicit-function-declaration -I/var/lib/hudson/slave/workspace/OpenModelica_BUILD_GCC_4.9/OpenModelica/build/include/omc/c -I../Util/  -DADD_METARECORD_DEFINITIONS= -DOMC_BOOTSTRAPPING_STAGE_2  -c -o build/TplParser_records.o build/TplParser_records.c
gcc-4.9 -O2 -march=native -fno-stack-protector -fPIC  -Wno-parentheses-equality -Wno-unused-variable -Werror=implicit-function-declaration -I/var/lib/hudson/slave/workspace/OpenModelica_BUILD_GCC_4.9/OpenModelica/build/include/omc/c -I../Util/  -DADD_METARECORD_DEFINITIONS= -DOMC_BOOTSTRAPPING_STAGE_2  -c -o build/Tpl_records.o build/Tpl_records.c
gcc-4.9 -O2 -march=native -fno-stack-protector -fPIC  -Wno-parentheses-equality -Wno-unused-variable -Werror=implicit-function-declaration -I/var/lib/hudson/slave/workspace/OpenModelica_BUILD_GCC_4.9/OpenModelica/build/include/omc/c -I../Util/  -DADD_METARECORD_DEFINITIONS= -DOMC_BOOTSTRAPPING_STAGE_2  -c -o build/TplMain_records.o build/TplMain_records.c
gcc-4.9 -O2 -march=native -fno-stack-protector -fPIC  -Wno-parentheses-equality -Wno-unused-variable -Werror=implicit-function-declaration -I/var/lib/hudson/slave/workspace/OpenModelica_BUILD_GCC_4.9/OpenModelica/build/include/omc/c -I../Util/  -DADD_METARECORD_DEFINITIONS= -DOMC_BOOTSTRAPPING_STAGE_2  -c -o build/TplCodegen_records.o build/TplCodegen_records.c
gcc-4.9 -O2 -march=native -fno-stack-protector -fPIC  -Wno-parentheses-equality -Wno-unused-variable -Werror=implicit-function-declaration -I/var/lib/hudson/slave/workspace/OpenModelica_BUILD_GCC_4.9/OpenModelica/build/include/omc/c -I../Util/  -DADD_METARECORD_DEFINITIONS= -DOMC_BOOTSTRAPPING_STAGE_2  -c -o build/TplAbsyn_records.o build/TplAbsyn_records.c
gcc-4.9 -O2 -march=native -fno-stack-protector -fPIC  -Wno-parentheses-equality -Wno-unused-variable -Werror=implicit-function-declaration -I/var/lib/hudson/slave/workspace/OpenModelica_BUILD_GCC_4.9/OpenModelica/build/include/omc/c -I../Util/  -DADD_METARECORD_DEFINITIONS= -DOMC_BOOTSTRAPPING_STAGE_2  -c -o build/SCodeDumpTpl_records.o build/SCodeDumpTpl_records.c
gcc-4.9 -O2 -march=native -fno-stack-protector -fPIC  -Wno-parentheses-equality -Wno-unused-variable -Werror=implicit-function-declaration -I/var/lib/hudson/slave/workspace/OpenModelica_BUILD_GCC_4.9/OpenModelica/build/include/omc/c -I../Util/  -DADD_METARECORD_DEFINITIONS= -DOMC_BOOTSTRAPPING_STAGE_2  -c -o build/GenerateAPIFunctionsTpl_records.o build/GenerateAPIFunctionsTpl_records.c
gcc-4.9 -O2 -march=native -fno-stack-protector -fPIC  -Wno-parentheses-equality -Wno-unused-variable -Werror=implicit-function-declaration -I/var/lib/hudson/slave/workspace/OpenModelica_BUILD_GCC_4.9/OpenModelica/build/include/omc/c -I../Util/  -DADD_METARECORD_DEFINITIONS= -DOMC_BOOTSTRAPPING_STAGE_2  -c -o build/ExpressionDumpTpl_records.o build/ExpressionDumpTpl_records.c
gcc-4.9 -O2 -march=native -fno-stack-protector -fPIC  -Wno-parentheses-equality -Wno-unused-variable -Werror=implicit-function-declaration -I/var/lib/hudson/slave/workspace/OpenModelica_BUILD_GCC_4.9/OpenModelica/build/include/omc/c -I../Util/  -DADD_METARECORD_DEFINITIONS= -DOMC_BOOTSTRAPPING_STAGE_2  -c -o build/DAEDumpTpl_records.o build/DAEDumpTpl_records.c
gcc-4.9 -O2 -march=native -fno-stack-protector -fPIC  -Wno-parentheses-equality -Wno-unused-variable -Werror=implicit-function-declaration -I/var/lib/hudson/slave/workspace/OpenModelica_BUILD_GCC_4.9/OpenModelica/build/include/omc/c -I../Util/  -DADD_METARECORD_DEFINITIONS= -DOMC_BOOTSTRAPPING_STAGE_2  -c -o build/CodegenUtil_records.o build/CodegenUtil_records.c
gcc-4.9 -O2 -march=native -fno-stack-protector -fPIC  -Wno-parentheses-equality -Wno-unused-variable -Werror=implicit-function-declaration -I/var/lib/hudson/slave/workspace/OpenModelica_BUILD_GCC_4.9/OpenModelica/build/include/omc/c -I../Util/  -DADD_METARECORD_DEFINITIONS= -DOMC_BOOTSTRAPPING_STAGE_2  -c -o build/CodegenCFunctions_records.o build/CodegenCFunctions_records.c
gcc-4.9 -O2 -march=native -fno-stack-protector -fPIC  -Wno-parentheses-equality -Wno-unused-variable -Werror=implicit-function-declaration -I/var/lib/hudson/slave/workspace/OpenModelica_BUILD_GCC_4.9/OpenModelica/build/include/omc/c -I../Util/  -DADD_METARECORD_DEFINITIONS= -DOMC_BOOTSTRAPPING_STAGE_2  -c -o build/AbsynDumpTpl_records.o build/AbsynDumpTpl_records.c
gcc-4.9 -O2 -march=native -fno-stack-protector -fPIC  -Wno-parentheses-equality -Wno-unused-variable -Werror=implicit-function-declaration -I/var/lib/hudson/slave/workspace/OpenModelica_BUILD_GCC_4.9/OpenModelica/build/include/omc/c -I../Util/  -DADD_METARECORD_DEFINITIONS= -DOMC_BOOTSTRAPPING_STAGE_2  -c -o build/SymbolTable_records.o build/SymbolTable_records.c
gcc-4.9 -O2 -march=native -fno-stack-protector -fPIC  -Wno-parentheses-equality -Wno-unused-variable -Werror=implicit-function-declaration -I/var/lib/hudson/slave/workspace/OpenModelica_BUILD_GCC_4.9/OpenModelica/build/include/omc/c -I../Util/  -DADD_METARECORD_DEFINITIONS= -DOMC_BOOTSTRAPPING_STAGE_2  -c -o build/StaticScript_records.o build/StaticScript_records.c
gcc-4.9 -O2 -march=native -fno-stack-protector -fPIC  -Wno-parentheses-equality -Wno-unused-variable -Werror=implicit-function-declaration -I/var/lib/hudson/slave/workspace/OpenModelica_BUILD_GCC_4.9/OpenModelica/build/include/omc/c -I../Util/  -DADD_METARECORD_DEFINITIONS= -DOMC_BOOTSTRAPPING_STAGE_2  -c -o build/Interactive_records.o build/Interactive_records.c
gcc-4.9 -O2 -march=native -fno-stack-protector -fPIC  -Wno-parentheses-equality -Wno-unused-variable -Werror=implicit-function-declaration -I/var/lib/hudson/slave/workspace/OpenModelica_BUILD_GCC_4.9/OpenModelica/build/include/omc/c -I../Util/  -DADD_METARECORD_DEFINITIONS= -DOMC_BOOTSTRAPPING_STAGE_2  -c -o build/GlobalScriptUtil_records.o build/GlobalScriptUtil_records.c
gcc-4.9 -O2 -march=native -fno-stack-protector -fPIC  -Wno-parentheses-equality -Wno-unused-variable -Werror=implicit-function-declaration -I/var/lib/hudson/slave/workspace/OpenModelica_BUILD_GCC_4.9/OpenModelica/build/include/omc/c -I../Util/  -DADD_METARECORD_DEFINITIONS= -DOMC_BOOTSTRAPPING_STAGE_2  -c -o build/GlobalScriptDump_records.o build/GlobalScriptDump_records.c
gcc-4.9 -O2 -march=native -fno-stack-protector -fPIC  -Wno-parentheses-equality -Wno-unused-variable -Werror=implicit-function-declaration -I/var/lib/hudson/slave/workspace/OpenModelica_BUILD_GCC_4.9/OpenModelica/build/include/omc/c -I../Util/  -DADD_METARECORD_DEFINITIONS= -DOMC_BOOTSTRAPPING_STAGE_2  -c -o build/GlobalScript_records.o build/GlobalScript_records.c
gcc-4.9 -O2 -march=native -fno-stack-protector -fPIC  -Wno-parentheses-equality -Wno-unused-variable -Werror=implicit-function-declaration -I/var/lib/hudson/slave/workspace/OpenModelica_BUILD_GCC_4.9/OpenModelica/build/include/omc/c -I../Util/  -DADD_METARECORD_DEFINITIONS= -DOMC_BOOTSTRAPPING_STAGE_2  -c -o build/CevalScript_records.o build/CevalScript_records.c
gcc-4.9 -O2 -march=native -fno-stack-protector -fPIC  -Wno-parentheses-equality -Wno-unused-variable -Werror=implicit-function-declaration -I/var/lib/hudson/slave/workspace/OpenModelica_BUILD_GCC_4.9/OpenModelica/build/include/omc/c -I../Util/  -DADD_METARECORD_DEFINITIONS= -DOMC_BOOTSTRAPPING_STAGE_2  -c -o build/SimCodeVar_records.o build/SimCodeVar_records.c
gcc-4.9 -O2 -march=native -fno-stack-protector -fPIC  -Wno-parentheses-equality -Wno-unused-variable -Werror=implicit-function-declaration -I/var/lib/hudson/slave/workspace/OpenModelica_BUILD_GCC_4.9/OpenModelica/build/include/omc/c -I../Util/  -DADD_METARECORD_DEFINITIONS= -DOMC_BOOTSTRAPPING_STAGE_2  -c -o build/SimCodeFunctionUtil_records.o build/SimCodeFunctionUtil_records.c
gcc-4.9 -O2 -march=native -fno-stack-protector -fPIC  -Wno-parentheses-equality -Wno-unused-variable -Werror=implicit-function-declaration -I/var/lib/hudson/slave/workspace/OpenModelica_BUILD_GCC_4.9/OpenModelica/build/include/omc/c -I../Util/  -DADD_METARECORD_DEFINITIONS= -DOMC_BOOTSTRAPPING_STAGE_2  -c -o build/SimCodeFunction_records.o build/SimCodeFunction_records.c
gcc-4.9 -O2 -march=native -fno-stack-protector -fPIC  -Wno-parentheses-equality -Wno-unused-variable -Werror=implicit-function-declaration -I/var/lib/hudson/slave/workspace/OpenModelica_BUILD_GCC_4.9/OpenModelica/build/include/omc/c -I../Util/  -DADD_METARECORD_DEFINITIONS= -DOMC_BOOTSTRAPPING_STAGE_2  -c -o build/HpcOmSimCode_records.o build/HpcOmSimCode_records.c
gcc-4.9 -O2 -march=native -fno-stack-protector -fPIC  -Wno-parentheses-equality -Wno-unused-variable -Werror=implicit-function-declaration -I/var/lib/hudson/slave/workspace/OpenModelica_BUILD_GCC_4.9/OpenModelica/build/include/omc/c -I../Util/  -DADD_METARECORD_DEFINITIONS= -DOMC_BOOTSTRAPPING_STAGE_2  -c -o build/BackendDAE_records.o build/BackendDAE_records.c
gcc-4.9 -O2 -march=native -fno-stack-protector -fPIC  -Wno-parentheses-equality -Wno-unused-variable -Werror=implicit-function-declaration -I/var/lib/hudson/slave/workspace/OpenModelica_BUILD_GCC_4.9/OpenModelica/build/include/omc/c -I../Util/  -DADD_METARECORD_DEFINITIONS= -DOMC_BOOTSTRAPPING_STAGE_2  -c -o build/FVisit_records.o build/FVisit_records.c
gcc-4.9 -O2 -march=native -fno-stack-protector -fPIC  -Wno-parentheses-equality -Wno-unused-variable -Werror=implicit-function-declaration -I/var/lib/hudson/slave/workspace/OpenModelica_BUILD_GCC_4.9/OpenModelica/build/include/omc/c -I../Util/  -DADD_METARECORD_DEFINITIONS= -DOMC_BOOTSTRAPPING_STAGE_2  -c -o build/FTraverse_records.o build/FTraverse_records.c
gcc-4.9 -O2 -march=native -fno-stack-protector -fPIC  -Wno-parentheses-equality -Wno-unused-variable -Werror=implicit-function-declaration -I/var/lib/hudson/slave/workspace/OpenModelica_BUILD_GCC_4.9/OpenModelica/build/include/omc/c -I../Util/  -DADD_METARECORD_DEFINITIONS= -DOMC_BOOTSTRAPPING_STAGE_2  -c -o build/FResolve_records.o build/FResolve_records.c
gcc-4.9 -O2 -march=native -fno-stack-protector -fPIC  -Wno-parentheses-equality -Wno-unused-variable -Werror=implicit-function-declaration -I/var/lib/hudson/slave/workspace/OpenModelica_BUILD_GCC_4.9/OpenModelica/build/include/omc/c -I../Util/  -DADD_METARECORD_DEFINITIONS= -DOMC_BOOTSTRAPPING_STAGE_2  -c -o build/FNode_records.o build/FNode_records.c
gcc-4.9 -O2 -march=native -fno-stack-protector -fPIC  -Wno-parentheses-equality -Wno-unused-variable -Werror=implicit-function-declaration -I/var/lib/hudson/slave/workspace/OpenModelica_BUILD_GCC_4.9/OpenModelica/build/include/omc/c -I../Util/  -DADD_METARECORD_DEFINITIONS= -DOMC_BOOTSTRAPPING_STAGE_2  -c -o build/FMod_records.o build/FMod_records.c
gcc-4.9 -O2 -march=native -fno-stack-protector -fPIC  -Wno-parentheses-equality -Wno-unused-variable -Werror=implicit-function-declaration -I/var/lib/hudson/slave/workspace/OpenModelica_BUILD_GCC_4.9/OpenModelica/build/include/omc/c -I../Util/  -DADD_METARECORD_DEFINITIONS= -DOMC_BOOTSTRAPPING_STAGE_2  -c -o build/FLookup_records.o build/FLookup_records.c
gcc-4.9 -O2 -march=native -fno-stack-protector -fPIC  -Wno-parentheses-equality -Wno-unused-variable -Werror=implicit-function-declaration -I/var/lib/hudson/slave/workspace/OpenModelica_BUILD_GCC_4.9/OpenModelica/build/include/omc/c -I../Util/  -DADD_METARECORD_DEFINITIONS= -DOMC_BOOTSTRAPPING_STAGE_2  -c -o build/FGraphBuildEnv_records.o build/FGraphBuildEnv_records.c
gcc-4.9 -O2 -march=native -fno-stack-protector -fPIC  -Wno-parentheses-equality -Wno-unused-variable -Werror=implicit-function-declaration -I/var/lib/hudson/slave/workspace/OpenModelica_BUILD_GCC_4.9/OpenModelica/build/include/omc/c -I../Util/  -DADD_METARECORD_DEFINITIONS= -DOMC_BOOTSTRAPPING_STAGE_2  -c -o build/FGraphBuild_records.o build/FGraphBuild_records.c
gcc-4.9 -O2 -march=native -fno-stack-protector -fPIC  -Wno-parentheses-equality -Wno-unused-variable -Werror=implicit-function-declaration -I/var/lib/hudson/slave/workspace/OpenModelica_BUILD_GCC_4.9/OpenModelica/build/include/omc/c -I../Util/  -DADD_METARECORD_DEFINITIONS= -DOMC_BOOTSTRAPPING_STAGE_2  -c -o build/FGraph_records.o build/FGraph_records.c
gcc-4.9 -O2 -march=native -fno-stack-protector -fPIC  -Wno-parentheses-equality -Wno-unused-variable -Werror=implicit-function-declaration -I/var/lib/hudson/slave/workspace/OpenModelica_BUILD_GCC_4.9/OpenModelica/build/include/omc/c -I../Util/  -DADD_METARECORD_DEFINITIONS= -DOMC_BOOTSTRAPPING_STAGE_2  -c -o build/FExpand_records.o build/FExpand_records.c
gcc-4.9 -O2 -march=native -fno-stack-protector -fPIC  -Wno-parentheses-equality -Wno-unused-variable -Werror=implicit-function-declaration -I/var/lib/hudson/slave/workspace/OpenModelica_BUILD_GCC_4.9/OpenModelica/build/include/omc/c -I../Util/  -DADD_METARECORD_DEFINITIONS= -DOMC_BOOTSTRAPPING_STAGE_2  -c -o build/FCore_records.o build/FCore_records.c
gcc-4.9 -O2 -march=native -fno-stack-protector -fPIC  -Wno-parentheses-equality -Wno-unused-variable -Werror=implicit-function-declaration -I/var/lib/hudson/slave/workspace/OpenModelica_BUILD_GCC_4.9/OpenModelica/build/include/omc/c -I../Util/  -DADD_METARECORD_DEFINITIONS= -DOMC_BOOTSTRAPPING_STAGE_2  -c -o build/FBuiltin_records.o build/FBuiltin_records.c
gcc-4.9 -O2 -march=native -fno-stack-protector -fPIC  -Wno-parentheses-equality -Wno-unused-variable -Werror=implicit-function-declaration -I/var/lib/hudson/slave/workspace/OpenModelica_BUILD_GCC_4.9/OpenModelica/build/include/omc/c -I../Util/  -DADD_METARECORD_DEFINITIONS= -DOMC_BOOTSTRAPPING_STAGE_2  -c -o build/ValuesUtil_records.o build/ValuesUtil_records.c
gcc-4.9 -O2 -march=native -fno-stack-protector -fPIC  -Wno-parentheses-equality -Wno-unused-variable -Werror=implicit-function-declaration -I/var/lib/hudson/slave/workspace/OpenModelica_BUILD_GCC_4.9/OpenModelica/build/include/omc/c -I../Util/  -DADD_METARECORD_DEFINITIONS= -DOMC_BOOTSTRAPPING_STAGE_2  -c -o build/Values_records.o build/Values_records.c
gcc-4.9 -O2 -march=native -fno-stack-protector -fPIC  -Wno-parentheses-equality -Wno-unused-variable -Werror=implicit-function-declaration -I/var/lib/hudson/slave/workspace/OpenModelica_BUILD_GCC_4.9/OpenModelica/build/include/omc/c -I../Util/  -DADD_METARECORD_DEFINITIONS= -DOMC_BOOTSTRAPPING_STAGE_2  -c -o build/UnitParserExt_records.o build/UnitParserExt_records.c
gcc-4.9 -O2 -march=native -fno-stack-protector -fPIC  -Wno-parentheses-equality -Wno-unused-variable -Werror=implicit-function-declaration -I/var/lib/hudson/slave/workspace/OpenModelica_BUILD_GCC_4.9/OpenModelica/build/include/omc/c -I../Util/  -DADD_METARECORD_DEFINITIONS= -DOMC_BOOTSTRAPPING_STAGE_2  -c -o build/UnitAbsyn_records.o build/UnitAbsyn_records.c
gcc-4.9 -O2 -march=native -fno-stack-protector -fPIC  -Wno-parentheses-equality -Wno-unused-variable -Werror=implicit-function-declaration -I/var/lib/hudson/slave/workspace/OpenModelica_BUILD_GCC_4.9/OpenModelica/build/include/omc/c -I../Util/  -DADD_METARECORD_DEFINITIONS= -DOMC_BOOTSTRAPPING_STAGE_2  -c -o build/Types_records.o build/Types_records.c
gcc-4.9 -O2 -march=native -fno-stack-protector -fPIC  -Wno-parentheses-equality -Wno-unused-variable -Werror=implicit-function-declaration -I/var/lib/hudson/slave/workspace/OpenModelica_BUILD_GCC_4.9/OpenModelica/build/include/omc/c -I../Util/  -DADD_METARECORD_DEFINITIONS= -DOMC_BOOTSTRAPPING_STAGE_2  -c -o build/StateMachineFlatten_records.o build/StateMachineFlatten_records.c
gcc-4.9 -O2 -march=native -fno-stack-protector -fPIC  -Wno-parentheses-equality -Wno-unused-variable -Werror=implicit-function-declaration -I/var/lib/hudson/slave/workspace/OpenModelica_BUILD_GCC_4.9/OpenModelica/build/include/omc/c -I../Util/  -DADD_METARECORD_DEFINITIONS= -DOMC_BOOTSTRAPPING_STAGE_2  -c -o build/NFSCodeCheck_records.o build/NFSCodeCheck_records.c
gcc-4.9 -O2 -march=native -fno-stack-protector -fPIC  -Wno-parentheses-equality -Wno-unused-variable -Werror=implicit-function-declaration -I/var/lib/hudson/slave/workspace/OpenModelica_BUILD_GCC_4.9/OpenModelica/build/include/omc/c -I../Util/  -DADD_METARECORD_DEFINITIONS= -DOMC_BOOTSTRAPPING_STAGE_2  -c -o build/NFSCodeLookup_records.o build/NFSCodeLookup_records.c
gcc-4.9 -O2 -march=native -fno-stack-protector -fPIC  -Wno-parentheses-equality -Wno-unused-variable -Werror=implicit-function-declaration -I/var/lib/hudson/slave/workspace/OpenModelica_BUILD_GCC_4.9/OpenModelica/build/include/omc/c -I../Util/  -DADD_METARECORD_DEFINITIONS= -DOMC_BOOTSTRAPPING_STAGE_2  -c -o build/NFSCodeFlattenRedeclare_records.o build/NFSCodeFlattenRedeclare_records.c
gcc-4.9 -O2 -march=native -fno-stack-protector -fPIC  -Wno-parentheses-equality -Wno-unused-variable -Werror=implicit-function-declaration -I/var/lib/hudson/slave/workspace/OpenModelica_BUILD_GCC_4.9/OpenModelica/build/include/omc/c -I../Util/  -DADD_METARECORD_DEFINITIONS= -DOMC_BOOTSTRAPPING_STAGE_2  -c -o build/NFSCodeFlatten_records.o build/NFSCodeFlatten_records.c
gcc-4.9 -O2 -march=native -fno-stack-protector -fPIC  -Wno-parentheses-equality -Wno-unused-variable -Werror=implicit-function-declaration -I/var/lib/hudson/slave/workspace/OpenModelica_BUILD_GCC_4.9/OpenModelica/build/include/omc/c -I../Util/  -DADD_METARECORD_DEFINITIONS= -DOMC_BOOTSTRAPPING_STAGE_2  -c -o build/NFSCodeFlattenImports_records.o build/NFSCodeFlattenImports_records.c
gcc-4.9 -O2 -march=native -fno-stack-protector -fPIC  -Wno-parentheses-equality -Wno-unused-variable -Werror=implicit-function-declaration -I/var/lib/hudson/slave/workspace/OpenModelica_BUILD_GCC_4.9/OpenModelica/build/include/omc/c -I../Util/  -DADD_METARECORD_DEFINITIONS= -DOMC_BOOTSTRAPPING_STAGE_2  -c -o build/NFSCodeEnv_records.o build/NFSCodeEnv_records.c
gcc-4.9 -O2 -march=native -fno-stack-protector -fPIC  -Wno-parentheses-equality -Wno-unused-variable -Werror=implicit-function-declaration -I/var/lib/hudson/slave/workspace/OpenModelica_BUILD_GCC_4.9/OpenModelica/build/include/omc/c -I../Util/  -DADD_METARECORD_DEFINITIONS= -DOMC_BOOTSTRAPPING_STAGE_2  -c -o build/NFSCodeDependency_records.o build/NFSCodeDependency_records.c
gcc-4.9 -O2 -march=native -fno-stack-protector -fPIC  -Wno-parentheses-equality -Wno-unused-variable -Werror=implicit-function-declaration -I/var/lib/hudson/slave/workspace/OpenModelica_BUILD_GCC_4.9/OpenModelica/build/include/omc/c -I../Util/  -DADD_METARECORD_DEFINITIONS= -DOMC_BOOTSTRAPPING_STAGE_2  -c -o build/NFInstUtil_records.o build/NFInstUtil_records.c
gcc-4.9 -O2 -march=native -fno-stack-protector -fPIC  -Wno-parentheses-equality -Wno-unused-variable -Werror=implicit-function-declaration -I/var/lib/hudson/slave/workspace/OpenModelica_BUILD_GCC_4.9/OpenModelica/build/include/omc/c -I../Util/  -DADD_METARECORD_DEFINITIONS= -DOMC_BOOTSTRAPPING_STAGE_2  -c -o build/NFInstTypes_records.o build/NFInstTypes_records.c
gcc-4.9 -O2 -march=native -fno-stack-protector -fPIC  -Wno-parentheses-equality -Wno-unused-variable -Werror=implicit-function-declaration -I/var/lib/hudson/slave/workspace/OpenModelica_BUILD_GCC_4.9/OpenModelica/build/include/omc/c -I../Util/  -DADD_METARECORD_DEFINITIONS= -DOMC_BOOTSTRAPPING_STAGE_2  -c -o build/NFInstPrefix_records.o build/NFInstPrefix_records.c
gcc-4.9 -O2 -march=native -fno-stack-protector -fPIC  -Wno-parentheses-equality -Wno-unused-variable -Werror=implicit-function-declaration -I/var/lib/hudson/slave/workspace/OpenModelica_BUILD_GCC_4.9/OpenModelica/build/include/omc/c -I../Util/  -DADD_METARECORD_DEFINITIONS= -DOMC_BOOTSTRAPPING_STAGE_2  -c -o build/NFEnvExtends_records.o build/NFEnvExtends_records.c
gcc-4.9 -O2 -march=native -fno-stack-protector -fPIC  -Wno-parentheses-equality -Wno-unused-variable -Werror=implicit-function-declaration -I/var/lib/hudson/slave/workspace/OpenModelica_BUILD_GCC_4.9/OpenModelica/build/include/omc/c -I../Util/  -DADD_METARECORD_DEFINITIONS= -DOMC_BOOTSTRAPPING_STAGE_2  -c -o build/Static_records.o build/Static_records.c
gcc-4.9 -O2 -march=native -fno-stack-protector -fPIC  -Wno-parentheses-equality -Wno-unused-variable -Werror=implicit-function-declaration -I/var/lib/hudson/slave/workspace/OpenModelica_BUILD_GCC_4.9/OpenModelica/build/include/omc/c -I../Util/  -DADD_METARECORD_DEFINITIONS= -DOMC_BOOTSTRAPPING_STAGE_2  -c -o build/SCodeUtil_records.o build/SCodeUtil_records.c
gcc-4.9 -O2 -march=native -fno-stack-protector -fPIC  -Wno-parentheses-equality -Wno-unused-variable -Werror=implicit-function-declaration -I/var/lib/hudson/slave/workspace/OpenModelica_BUILD_GCC_4.9/OpenModelica/build/include/omc/c -I../Util/  -DADD_METARECORD_DEFINITIONS= -DOMC_BOOTSTRAPPING_STAGE_2  -c -o build/SCodeDump_records.o build/SCodeDump_records.c
gcc-4.9 -O2 -march=native -fno-stack-protector -fPIC  -Wno-parentheses-equality -Wno-unused-variable -Werror=implicit-function-declaration -I/var/lib/hudson/slave/workspace/OpenModelica_BUILD_GCC_4.9/OpenModelica/build/include/omc/c -I../Util/  -DADD_METARECORD_DEFINITIONS= -DOMC_BOOTSTRAPPING_STAGE_2  -c -o build/SCode_records.o build/SCode_records.c
gcc-4.9 -O2 -march=native -fno-stack-protector -fPIC  -Wno-parentheses-equality -Wno-unused-variable -Werror=implicit-function-declaration -I/var/lib/hudson/slave/workspace/OpenModelica_BUILD_GCC_4.9/OpenModelica/build/include/omc/c -I../Util/  -DADD_METARECORD_DEFINITIONS= -DOMC_BOOTSTRAPPING_STAGE_2  -c -o build/PrefixUtil_records.o build/PrefixUtil_records.c
gcc-4.9 -O2 -march=native -fno-stack-protector -fPIC  -Wno-parentheses-equality -Wno-unused-variable -Werror=implicit-function-declaration -I/var/lib/hudson/slave/workspace/OpenModelica_BUILD_GCC_4.9/OpenModelica/build/include/omc/c -I../Util/  -DADD_METARECORD_DEFINITIONS= -DOMC_BOOTSTRAPPING_STAGE_2  -c -o build/Prefix_records.o build/Prefix_records.c
gcc-4.9 -O2 -march=native -fno-stack-protector -fPIC  -Wno-parentheses-equality -Wno-unused-variable -Werror=implicit-function-declaration -I/var/lib/hudson/slave/workspace/OpenModelica_BUILD_GCC_4.9/OpenModelica/build/include/omc/c -I../Util/  -DADD_METARECORD_DEFINITIONS= -DOMC_BOOTSTRAPPING_STAGE_2  -c -o build/Patternm_records.o build/Patternm_records.c
gcc-4.9 -O2 -march=native -fno-stack-protector -fPIC  -Wno-parentheses-equality -Wno-unused-variable -Werror=implicit-function-declaration -I/var/lib/hudson/slave/workspace/OpenModelica_BUILD_GCC_4.9/OpenModelica/build/include/omc/c -I../Util/  -DADD_METARECORD_DEFINITIONS= -DOMC_BOOTSTRAPPING_STAGE_2  -c -o build/ParserExt_records.o build/ParserExt_records.c
gcc-4.9 -O2 -march=native -fno-stack-protector -fPIC  -Wno-parentheses-equality -Wno-unused-variable -Werror=implicit-function-declaration -I/var/lib/hudson/slave/workspace/OpenModelica_BUILD_GCC_4.9/OpenModelica/build/include/omc/c -I../Util/  -DADD_METARECORD_DEFINITIONS= -DOMC_BOOTSTRAPPING_STAGE_2  -c -o build/Parser_records.o build/Parser_records.c
gcc-4.9 -O2 -march=native -fno-stack-protector -fPIC  -Wno-parentheses-equality -Wno-unused-variable -Werror=implicit-function-declaration -I/var/lib/hudson/slave/workspace/OpenModelica_BUILD_GCC_4.9/OpenModelica/build/include/omc/c -I../Util/  -DADD_METARECORD_DEFINITIONS= -DOMC_BOOTSTRAPPING_STAGE_2  -c -o build/OperatorOverloading_records.o build/OperatorOverloading_records.c
gcc-4.9 -O2 -march=native -fno-stack-protector -fPIC  -Wno-parentheses-equality -Wno-unused-variable -Werror=implicit-function-declaration -I/var/lib/hudson/slave/workspace/OpenModelica_BUILD_GCC_4.9/OpenModelica/build/include/omc/c -I../Util/  -DADD_METARECORD_DEFINITIONS= -DOMC_BOOTSTRAPPING_STAGE_2  -c -o build/Mod_records.o build/Mod_records.c
gcc-4.9 -O2 -march=native -fno-stack-protector -fPIC  -Wno-parentheses-equality -Wno-unused-variable -Werror=implicit-function-declaration -I/var/lib/hudson/slave/workspace/OpenModelica_BUILD_GCC_4.9/OpenModelica/build/include/omc/c -I../Util/  -DADD_METARECORD_DEFINITIONS= -DOMC_BOOTSTRAPPING_STAGE_2  -c -o build/MMath_records.o build/MMath_records.c
gcc-4.9 -O2 -march=native -fno-stack-protector -fPIC  -Wno-parentheses-equality -Wno-unused-variable -Werror=implicit-function-declaration -I/var/lib/hudson/slave/workspace/OpenModelica_BUILD_GCC_4.9/OpenModelica/build/include/omc/c -I../Util/  -DADD_METARECORD_DEFINITIONS= -DOMC_BOOTSTRAPPING_STAGE_2  -c -o build/MetaUtil_records.o build/MetaUtil_records.c
gcc-4.9 -O2 -march=native -fno-stack-protector -fPIC  -Wno-parentheses-equality -Wno-unused-variable -Werror=implicit-function-declaration -I/var/lib/hudson/slave/workspace/OpenModelica_BUILD_GCC_4.9/OpenModelica/build/include/omc/c -I../Util/  -DADD_METARECORD_DEFINITIONS= -DOMC_BOOTSTRAPPING_STAGE_2  -c -o build/Lookup_records.o build/Lookup_records.c
gcc-4.9 -O2 -march=native -fno-stack-protector -fPIC  -Wno-parentheses-equality -Wno-unused-variable -Werror=implicit-function-declaration -I/var/lib/hudson/slave/workspace/OpenModelica_BUILD_GCC_4.9/OpenModelica/build/include/omc/c -I../Util/  -DADD_METARECORD_DEFINITIONS= -DOMC_BOOTSTRAPPING_STAGE_2  -c -o build/InstTypes_records.o build/InstTypes_records.c
gcc-4.9 -O2 -march=native -fno-stack-protector -fPIC  -Wno-parentheses-equality -Wno-unused-variable -Werror=implicit-function-declaration -I/var/lib/hudson/slave/workspace/OpenModelica_BUILD_GCC_4.9/OpenModelica/build/include/omc/c -I../Util/  -DADD_METARECORD_DEFINITIONS= -DOMC_BOOTSTRAPPING_STAGE_2  -c -o build/InstStateMachineUtil_records.o build/InstStateMachineUtil_records.c
gcc-4.9 -O2 -march=native -fno-stack-protector -fPIC  -Wno-parentheses-equality -Wno-unused-variable -Werror=implicit-function-declaration -I/var/lib/hudson/slave/workspace/OpenModelica_BUILD_GCC_4.9/OpenModelica/build/include/omc/c -I../Util/  -DADD_METARECORD_DEFINITIONS= -DOMC_BOOTSTRAPPING_STAGE_2  -c -o build/InstSection_records.o build/InstSection_records.c
gcc-4.9 -O2 -march=native -fno-stack-protector -fPIC  -Wno-parentheses-equality -Wno-unused-variable -Werror=implicit-function-declaration -I/var/lib/hudson/slave/workspace/OpenModelica_BUILD_GCC_4.9/OpenModelica/build/include/omc/c -I../Util/  -DADD_METARECORD_DEFINITIONS= -DOMC_BOOTSTRAPPING_STAGE_2  -c -o build/InstExtends_records.o build/InstExtends_records.c
gcc-4.9 -O2 -march=native -fno-stack-protector -fPIC  -Wno-parentheses-equality -Wno-unused-variable -Werror=implicit-function-declaration -I/var/lib/hudson/slave/workspace/OpenModelica_BUILD_GCC_4.9/OpenModelica/build/include/omc/c -I../Util/  -DADD_METARECORD_DEFINITIONS= -DOMC_BOOTSTRAPPING_STAGE_2  -c -o build/InstUtil_records.o build/InstUtil_records.c
gcc-4.9 -O2 -march=native -fno-stack-protector -fPIC  -Wno-parentheses-equality -Wno-unused-variable -Werror=implicit-function-declaration -I/var/lib/hudson/slave/workspace/OpenModelica_BUILD_GCC_4.9/OpenModelica/build/include/omc/c -I../Util/  -DADD_METARECORD_DEFINITIONS= -DOMC_BOOTSTRAPPING_STAGE_2  -c -o build/InstBinding_records.o build/InstBinding_records.c
gcc-4.9 -O2 -march=native -fno-stack-protector -fPIC  -Wno-parentheses-equality -Wno-unused-variable -Werror=implicit-function-declaration -I/var/lib/hudson/slave/workspace/OpenModelica_BUILD_GCC_4.9/OpenModelica/build/include/omc/c -I../Util/  -DADD_METARECORD_DEFINITIONS= -DOMC_BOOTSTRAPPING_STAGE_2  -c -o build/InstFunction_records.o build/InstFunction_records.c
gcc-4.9 -O2 -march=native -fno-stack-protector -fPIC  -Wno-parentheses-equality -Wno-unused-variable -Werror=implicit-function-declaration -I/var/lib/hudson/slave/workspace/OpenModelica_BUILD_GCC_4.9/OpenModelica/build/include/omc/c -I../Util/  -DADD_METARECORD_DEFINITIONS= -DOMC_BOOTSTRAPPING_STAGE_2  -c -o build/InstDAE_records.o build/InstDAE_records.c
gcc-4.9 -O2 -march=native -fno-stack-protector -fPIC  -Wno-parentheses-equality -Wno-unused-variable -Werror=implicit-function-declaration -I/var/lib/hudson/slave/workspace/OpenModelica_BUILD_GCC_4.9/OpenModelica/build/include/omc/c -I../Util/  -DADD_METARECORD_DEFINITIONS= -DOMC_BOOTSTRAPPING_STAGE_2  -c -o build/InstVar_records.o build/InstVar_records.c
gcc-4.9 -O2 -march=native -fno-stack-protector -fPIC  -Wno-parentheses-equality -Wno-unused-variable -Werror=implicit-function-declaration -I/var/lib/hudson/slave/workspace/OpenModelica_BUILD_GCC_4.9/OpenModelica/build/include/omc/c -I../Util/  -DADD_METARECORD_DEFINITIONS= -DOMC_BOOTSTRAPPING_STAGE_2  -c -o build/Inst_records.o build/Inst_records.c
gcc-4.9 -O2 -march=native -fno-stack-protector -fPIC  -Wno-parentheses-equality -Wno-unused-variable -Werror=implicit-function-declaration -I/var/lib/hudson/slave/workspace/OpenModelica_BUILD_GCC_4.9/OpenModelica/build/include/omc/c -I../Util/  -DADD_METARECORD_DEFINITIONS= -DOMC_BOOTSTRAPPING_STAGE_2  -c -o build/InnerOuter_records.o build/InnerOuter_records.c
gcc-4.9 -O2 -march=native -fno-stack-protector -fPIC  -Wno-parentheses-equality -Wno-unused-variable -Werror=implicit-function-declaration -I/var/lib/hudson/slave/workspace/OpenModelica_BUILD_GCC_4.9/OpenModelica/build/include/omc/c -I../Util/  -DADD_METARECORD_DEFINITIONS= -DOMC_BOOTSTRAPPING_STAGE_2  -c -o build/Inline_records.o build/Inline_records.c
gcc-4.9 -O2 -march=native -fno-stack-protector -fPIC  -Wno-parentheses-equality -Wno-unused-variable -Werror=implicit-function-declaration -I/var/lib/hudson/slave/workspace/OpenModelica_BUILD_GCC_4.9/OpenModelica/build/include/omc/c -I../Util/  -DADD_METARECORD_DEFINITIONS= -DOMC_BOOTSTRAPPING_STAGE_2  -c -o build/Graphviz_records.o build/Graphviz_records.c
gcc-4.9 -O2 -march=native -fno-stack-protector -fPIC  -Wno-parentheses-equality -Wno-unused-variable -Werror=implicit-function-declaration -I/var/lib/hudson/slave/workspace/OpenModelica_BUILD_GCC_4.9/OpenModelica/build/include/omc/c -I../Util/  -DADD_METARECORD_DEFINITIONS= -DOMC_BOOTSTRAPPING_STAGE_2  -c -o build/ExpressionSimplifyTypes_records.o build/ExpressionSimplifyTypes_records.c
gcc-4.9 -O2 -march=native -fno-stack-protector -fPIC  -Wno-parentheses-equality -Wno-unused-variable -Werror=implicit-function-declaration -I/var/lib/hudson/slave/workspace/OpenModelica_BUILD_GCC_4.9/OpenModelica/build/include/omc/c -I../Util/  -DADD_METARECORD_DEFINITIONS= -DOMC_BOOTSTRAPPING_STAGE_2  -c -o build/ExpressionSimplify_records.o build/ExpressionSimplify_records.c
gcc-4.9 -O2 -march=native -fno-stack-protector -fPIC  -Wno-parentheses-equality -Wno-unused-variable -Werror=implicit-function-declaration -I/var/lib/hudson/slave/workspace/OpenModelica_BUILD_GCC_4.9/OpenModelica/build/include/omc/c -I../Util/  -DADD_METARECORD_DEFINITIONS= -DOMC_BOOTSTRAPPING_STAGE_2  -c -o build/Expression_records.o build/Expression_records.c
gcc-4.9 -O2 -march=native -fno-stack-protector -fPIC  -Wno-parentheses-equality -Wno-unused-variable -Werror=implicit-function-declaration -I/var/lib/hudson/slave/workspace/OpenModelica_BUILD_GCC_4.9/OpenModelica/build/include/omc/c -I../Util/  -DADD_METARECORD_DEFINITIONS= -DOMC_BOOTSTRAPPING_STAGE_2  -c -o build/ExpressionDump_records.o build/ExpressionDump_records.c
gcc-4.9 -O2 -march=native -fno-stack-protector -fPIC  -Wno-parentheses-equality -Wno-unused-variable -Werror=implicit-function-declaration -I/var/lib/hudson/slave/workspace/OpenModelica_BUILD_GCC_4.9/OpenModelica/build/include/omc/c -I../Util/  -DADD_METARECORD_DEFINITIONS= -DOMC_BOOTSTRAPPING_STAGE_2  -c -o build/ElementSource_records.o build/ElementSource_records.c
gcc-4.9 -O2 -march=native -fno-stack-protector -fPIC  -Wno-parentheses-equality -Wno-unused-variable -Werror=implicit-function-declaration -I/var/lib/hudson/slave/workspace/OpenModelica_BUILD_GCC_4.9/OpenModelica/build/include/omc/c -I../Util/  -DADD_METARECORD_DEFINITIONS= -DOMC_BOOTSTRAPPING_STAGE_2  -c -o build/Dump_records.o build/Dump_records.c
gcc-4.9 -O2 -march=native -fno-stack-protector -fPIC  -Wno-parentheses-equality -Wno-unused-variable -Werror=implicit-function-declaration -I/var/lib/hudson/slave/workspace/OpenModelica_BUILD_GCC_4.9/OpenModelica/build/include/omc/c -I../Util/  -DADD_METARECORD_DEFINITIONS= -DOMC_BOOTSTRAPPING_STAGE_2  -c -o build/DAEUtil_records.o build/DAEUtil_records.c
gcc-4.9 -O2 -march=native -fno-stack-protector -fPIC  -Wno-parentheses-equality -Wno-unused-variable -Werror=implicit-function-declaration -I/var/lib/hudson/slave/workspace/OpenModelica_BUILD_GCC_4.9/OpenModelica/build/include/omc/c -I../Util/  -DADD_METARECORD_DEFINITIONS= -DOMC_BOOTSTRAPPING_STAGE_2  -c -o build/DAE_records.o build/DAE_records.c
gcc-4.9 -O2 -march=native -fno-stack-protector -fPIC  -Wno-parentheses-equality -Wno-unused-variable -Werror=implicit-function-declaration -I/var/lib/hudson/slave/workspace/OpenModelica_BUILD_GCC_4.9/OpenModelica/build/include/omc/c -I../Util/  -DADD_METARECORD_DEFINITIONS= -DOMC_BOOTSTRAPPING_STAGE_2  -c -o build/DAEDump_records.o build/DAEDump_records.c
gcc-4.9 -O2 -march=native -fno-stack-protector -fPIC  -Wno-parentheses-equality -Wno-unused-variable -Werror=implicit-function-declaration -I/var/lib/hudson/slave/workspace/OpenModelica_BUILD_GCC_4.9/OpenModelica/build/include/omc/c -I../Util/  -DADD_METARECORD_DEFINITIONS= -DOMC_BOOTSTRAPPING_STAGE_2  -c -o build/Constants_records.o build/Constants_records.c
gcc-4.9 -O2 -march=native -fno-stack-protector -fPIC  -Wno-parentheses-equality -Wno-unused-variable -Werror=implicit-function-declaration -I/var/lib/hudson/slave/workspace/OpenModelica_BUILD_GCC_4.9/OpenModelica/build/include/omc/c -I../Util/  -DADD_METARECORD_DEFINITIONS= -DOMC_BOOTSTRAPPING_STAGE_2  -c -o build/ConnectUtil_records.o build/ConnectUtil_records.c
gcc-4.9 -O2 -march=native -fno-stack-protector -fPIC  -Wno-parentheses-equality -Wno-unused-variable -Werror=implicit-function-declaration -I/var/lib/hudson/slave/workspace/OpenModelica_BUILD_GCC_4.9/OpenModelica/build/include/omc/c -I../Util/  -DADD_METARECORD_DEFINITIONS= -DOMC_BOOTSTRAPPING_STAGE_2  -c -o build/Connect_records.o build/Connect_records.c
gcc-4.9 -O2 -march=native -fno-stack-protector -fPIC  -Wno-parentheses-equality -Wno-unused-variable -Werror=implicit-function-declaration -I/var/lib/hudson/slave/workspace/OpenModelica_BUILD_GCC_4.9/OpenModelica/build/include/omc/c -I../Util/  -DADD_METARECORD_DEFINITIONS= -DOMC_BOOTSTRAPPING_STAGE_2  -c -o build/ConnectionGraph_records.o build/ConnectionGraph_records.c
gcc-4.9 -O2 -march=native -fno-stack-protector -fPIC  -Wno-parentheses-equality -Wno-unused-variable -Werror=implicit-function-declaration -I/var/lib/hudson/slave/workspace/OpenModelica_BUILD_GCC_4.9/OpenModelica/build/include/omc/c -I../Util/  -DADD_METARECORD_DEFINITIONS= -DOMC_BOOTSTRAPPING_STAGE_2  -c -o build/ComponentReference_records.o build/ComponentReference_records.c
gcc-4.9 -O2 -march=native -fno-stack-protector -fPIC  -Wno-parentheses-equality -Wno-unused-variable -Werror=implicit-function-declaration -I/var/lib/hudson/slave/workspace/OpenModelica_BUILD_GCC_4.9/OpenModelica/build/include/omc/c -I../Util/  -DADD_METARECORD_DEFINITIONS= -DOMC_BOOTSTRAPPING_STAGE_2  -c -o build/ClassLoader_records.o build/ClassLoader_records.c
gcc-4.9 -O2 -march=native -fno-stack-protector -fPIC  -Wno-parentheses-equality -Wno-unused-variable -Werror=implicit-function-declaration -I/var/lib/hudson/slave/workspace/OpenModelica_BUILD_GCC_4.9/OpenModelica/build/include/omc/c -I../Util/  -DADD_METARECORD_DEFINITIONS= -DOMC_BOOTSTRAPPING_STAGE_2  -c -o build/ClassInf_records.o build/ClassInf_records.c
gcc-4.9 -O2 -march=native -fno-stack-protector -fPIC  -Wno-parentheses-equality -Wno-unused-variable -Werror=implicit-function-declaration -I/var/lib/hudson/slave/workspace/OpenModelica_BUILD_GCC_4.9/OpenModelica/build/include/omc/c -I../Util/  -DADD_METARECORD_DEFINITIONS= -DOMC_BOOTSTRAPPING_STAGE_2  -c -o build/Ceval_records.o build/Ceval_records.c
gcc-4.9 -O2 -march=native -fno-stack-protector -fPIC  -Wno-parentheses-equality -Wno-unused-variable -Werror=implicit-function-declaration -I/var/lib/hudson/slave/workspace/OpenModelica_BUILD_GCC_4.9/OpenModelica/build/include/omc/c -I../Util/  -DADD_METARECORD_DEFINITIONS= -DOMC_BOOTSTRAPPING_STAGE_2  -c -o build/CevalFunction_records.o build/CevalFunction_records.c
gcc-4.9 -O2 -march=native -fno-stack-protector -fPIC  -Wno-parentheses-equality -Wno-unused-variable -Werror=implicit-function-declaration -I/var/lib/hudson/slave/workspace/OpenModelica_BUILD_GCC_4.9/OpenModelica/build/include/omc/c -I../Util/  -DADD_METARECORD_DEFINITIONS= -DOMC_BOOTSTRAPPING_STAGE_2  -c -o build/Builtin_records.o build/Builtin_records.c
gcc-4.9 -O2 -march=native -fno-stack-protector -fPIC  -Wno-parentheses-equality -Wno-unused-variable -Werror=implicit-function-declaration -I/var/lib/hudson/slave/workspace/OpenModelica_BUILD_GCC_4.9/OpenModelica/build/include/omc/c -I../Util/  -DADD_METARECORD_DEFINITIONS= -DOMC_BOOTSTRAPPING_STAGE_2  -c -o build/BackendInterface_records.o build/BackendInterface_records.c
gcc-4.9 -O2 -march=native -fno-stack-protector -fPIC  -Wno-parentheses-equality -Wno-unused-variable -Werror=implicit-function-declaration -I/var/lib/hudson/slave/workspace/OpenModelica_BUILD_GCC_4.9/OpenModelica/build/include/omc/c -I../Util/  -DADD_METARECORD_DEFINITIONS= -DOMC_BOOTSTRAPPING_STAGE_2  -c -o build/Algorithm_records.o build/Algorithm_records.c
gcc-4.9 -O2 -march=native -fno-stack-protector -fPIC  -Wno-parentheses-equality -Wno-unused-variable -Werror=implicit-function-declaration -I/var/lib/hudson/slave/workspace/OpenModelica_BUILD_GCC_4.9/OpenModelica/build/include/omc/c -I../Util/  -DADD_METARECORD_DEFINITIONS= -DOMC_BOOTSTRAPPING_STAGE_2  -c -o build/AbsynUtil_records.o build/AbsynUtil_records.c
gcc-4.9 -O2 -march=native -fno-stack-protector -fPIC  -Wno-parentheses-equality -Wno-unused-variable -Werror=implicit-function-declaration -I/var/lib/hudson/slave/workspace/OpenModelica_BUILD_GCC_4.9/OpenModelica/build/include/omc/c -I../Util/  -DADD_METARECORD_DEFINITIONS= -DOMC_BOOTSTRAPPING_STAGE_2  -c -o build/Absyn_records.o build/Absyn_records.c
gcc-4.9 -O2 -march=native -fno-stack-protector -fPIC  -Wno-parentheses-equality -Wno-unused-variable -Werror=implicit-function-declaration -I/var/lib/hudson/slave/workspace/OpenModelica_BUILD_GCC_4.9/OpenModelica/build/include/omc/c -I../Util/  -DADD_METARECORD_DEFINITIONS= -DOMC_BOOTSTRAPPING_STAGE_2  -c -o build/File_records.o build/File_records.c
cp -a build/_main.c build/_main_omc.c
gcc-4.9 -DOMC_ENTRYPOINT_STATIC= -c build/_main.c -o  build/_main.o -O2 -march=native -fno-stack-protector -fPIC  -Wno-parentheses-equality -Wno-unused-variable -Werror=implicit-function-declaration -I/var/lib/hudson/slave/workspace/OpenModelica_BUILD_GCC_4.9/OpenModelica/build/include/omc/c -I../Util/  -DADD_METARECORD_DEFINITIONS= -DOMC_BOOTSTRAPPING_STAGE_2
cp -a build/OpenModelicaScriptingAPI.h /var/lib/hudson/slave/workspace/OpenModelica_BUILD_GCC_4.9/OpenModelica/build/include/omc/scripting-API
gcc-4.9 -c build/_main_omc.c -o  build/_main_omc.o -O2 -march=native -fno-stack-protector -fPIC  -Wno-parentheses-equality -Wno-unused-variable -Werror=implicit-function-declaration -I/var/lib/hudson/slave/workspace/OpenModelica_BUILD_GCC_4.9/OpenModelica/build/include/omc/c -I../Util/  -DADD_METARECORD_DEFINITIONS= -DOMC_BOOTSTRAPPING_STAGE_2
gcc-4.9 -shared -Wl,-z,origin -Wl,-rpath,'$ORIGIN/../lib/x86_64-linux-gnu/omc' -Wl,-rpath,'$ORIGIN'  -o /var/lib/hudson/slave/workspace/OpenModelica_BUILD_GCC_4.9/OpenModelica/build/lib/x86_64-linux-gnu/omc/libOpenModelicaCompiler.so build/ZeroCrossings.o build/UnitChecker.o build/UnitAbsynBuilder.o build/SimCodeUtil.o build/SimCodeMain.o build/SimCode.o build/RewriteRules.o build/Refactor.o build/NFUnitCheck.o build/NFInstDump.o build/MidCode.o build/FGraphStream.o build/DumpGraphviz.o build/DAEToMid.o build/CodegenMidToC.o build/CevalScriptBackend.o build/BackendDAEUtil.o build/BackendDAECreate.o build/ZeroMQ.o build/VarTransform.o build/Util.o build/System.o build/Socket.o build/StringUtil.o build/StackOverflow.o build/Settings.o build/Print.o build/Pointer.o build/Mutable.o build/ModelicaExternalC.o build/List.o build/Lapack.o build/IOStream.o build/IOStreamExt.o build/HashTableStringToProgram.o build/HashTableStringToPath.o build/HashTableSM1.o build/HashTableExpToIndex.o build/HashTable.o build/HashTableCrToExpOption.o build/HashTableCrIListArray.o build/HashTableCrILst.o build/HashTableCrefSimVar.o build/HashTableCG.o build/HashTable5.o build/HashTable3.o build/HashTable2.o build/HashSetString.o build/HashSetExp.o build/HashSet.o build/GraphStreamExt.o build/GraphStream.o build/Graph.o build/GC.o build/Flags.o build/ExpandableArray.o build/ExecStat.o build/Error.o build/ErrorExt.o build/DynLoad.o build/DoubleEndedList.o build/DisjointSets.o build/Debug.o build/Corba.o build/Config.o build/ClockIndexes.o build/BasePVector.o build/BaseHashSet.o build/BaseHashTable.o build/BaseAvlSet.o build/BaseAvlTree.o build/AvlTreeCRToInt.o build/AvlTreeStringString.o build/AvlSetString.o build/AvlSetPath.o build/AvlSetCR.o build/Autoconf.o build/Array.o build/Main.o build/Global.o build/Unparsing.o build/TplParser.o build/Tpl.o build/TplMain.o build/TplCodegen.o build/TplAbsyn.o build/SCodeDumpTpl.o build/GenerateAPIFunctionsTpl.o build/ExpressionDumpTpl.o build/DAEDumpTpl.o build/CodegenUtil.o build/CodegenCFunctions.o build/AbsynDumpTpl.o build/SymbolTable.o build/StaticScript.o build/Interactive.o build/GlobalScriptUtil.o build/GlobalScriptDump.o build/GlobalScript.o build/CevalScript.o build/SimCodeVar.o build/SimCodeFunctionUtil.o build/SimCodeFunction.o build/HpcOmSimCode.o build/BackendDAE.o build/FVisit.o build/FTraverse.o build/FResolve.o build/FNode.o build/FMod.o build/FLookup.o build/FGraphBuildEnv.o build/FGraphBuild.o build/FGraph.o build/FExpand.o build/FCore.o build/FBuiltin.o build/ValuesUtil.o build/Values.o build/UnitParserExt.o build/UnitAbsyn.o build/Types.o build/StateMachineFlatten.o build/NFSCodeCheck.o build/NFSCodeLookup.o build/NFSCodeFlattenRedeclare.o build/NFSCodeFlatten.o build/NFSCodeFlattenImports.o build/NFSCodeEnv.o build/NFSCodeDependency.o build/NFInstUtil.o build/NFInstTypes.o build/NFInstPrefix.o build/NFEnvExtends.o build/Static.o build/SCodeUtil.o build/SCodeDump.o build/SCode.o build/PrefixUtil.o build/Prefix.o build/Patternm.o build/ParserExt.o build/Parser.o build/OperatorOverloading.o build/Mod.o build/MMath.o build/MetaUtil.o build/Lookup.o build/InstTypes.o build/InstStateMachineUtil.o build/InstSection.o build/InstExtends.o build/InstUtil.o build/InstBinding.o build/InstFunction.o build/InstDAE.o build/InstVar.o build/Inst.o build/InnerOuter.o build/Inline.o build/Graphviz.o build/ExpressionSimplifyTypes.o build/ExpressionSimplify.o build/Expression.o build/ExpressionDump.o build/ElementSource.o build/Dump.o build/DAEUtil.o build/DAE.o build/DAEDump.o build/Constants.o build/ConnectUtil.o build/Connect.o build/ConnectionGraph.o build/ComponentReference.o build/ClassLoader.o build/ClassInf.o build/Ceval.o build/CevalFunction.o build/Builtin.o build/BackendInterface.o build/Algorithm.o build/AbsynUtil.o build/Absyn.o build/File.o build/ZeroCrossings_records.o build/UnitChecker_records.o build/UnitAbsynBuilder_records.o build/SimCodeUtil_records.o build/SimCodeMain_records.o build/SimCode_records.o build/RewriteRules_records.o build/Refactor_records.o build/NFUnitCheck_records.o build/NFInstDump_records.o build/MidCode_records.o build/FGraphStream_records.o build/DumpGraphviz_records.o build/DAEToMid_records.o build/CodegenMidToC_records.o build/CevalScriptBackend_records.o build/BackendDAEUtil_records.o build/BackendDAECreate_records.o build/ZeroMQ_records.o build/VarTransform_records.o build/Util_records.o build/System_records.o build/Socket_records.o build/StringUtil_records.o build/StackOverflow_records.o build/Settings_records.o build/Print_records.o build/Pointer_records.o build/Mutable_records.o build/ModelicaExternalC_records.o build/List_records.o build/Lapack_records.o build/IOStream_records.o build/IOStreamExt_records.o build/HashTableStringToProgram_records.o build/HashTableStringToPath_records.o build/HashTableSM1_records.o build/HashTableExpToIndex_records.o build/HashTable_records.o build/HashTableCrToExpOption_records.o build/HashTableCrIListArray_records.o build/HashTableCrILst_records.o build/HashTableCrefSimVar_records.o build/HashTableCG_records.o build/HashTable5_records.o build/HashTable3_records.o build/HashTable2_records.o build/HashSetString_records.o build/HashSetExp_records.o build/HashSet_records.o build/GraphStreamExt_records.o build/GraphStream_records.o build/Graph_records.o build/GC_records.o build/Flags_records.o build/ExpandableArray_records.o build/ExecStat_records.o build/Error_records.o build/ErrorExt_records.o build/DynLoad_records.o build/DoubleEndedList_records.o build/DisjointSets_records.o build/Debug_records.o build/Corba_records.o build/Config_records.o build/ClockIndexes_records.o build/BasePVector_records.o build/BaseHashSet_records.o build/BaseHashTable_records.o build/BaseAvlSet_records.o build/BaseAvlTree_records.o build/AvlTreeCRToInt_records.o build/AvlTreeStringString_records.o build/AvlSetString_records.o build/AvlSetPath_records.o build/AvlSetCR_records.o build/Autoconf_records.o build/Array_records.o build/Main_records.o build/Global_records.o build/Unparsing_records.o build/TplParser_records.o build/Tpl_records.o build/TplMain_records.o build/TplCodegen_records.o build/TplAbsyn_records.o build/SCodeDumpTpl_records.o build/GenerateAPIFunctionsTpl_records.o build/ExpressionDumpTpl_records.o build/DAEDumpTpl_records.o build/CodegenUtil_records.o build/CodegenCFunctions_records.o build/AbsynDumpTpl_records.o build/SymbolTable_records.o build/StaticScript_records.o build/Interactive_records.o build/GlobalScriptUtil_records.o build/GlobalScriptDump_records.o build/GlobalScript_records.o build/CevalScript_records.o build/SimCodeVar_records.o build/SimCodeFunctionUtil_records.o build/SimCodeFunction_records.o build/HpcOmSimCode_records.o build/BackendDAE_records.o build/FVisit_records.o build/FTraverse_records.o build/FResolve_records.o build/FNode_records.o build/FMod_records.o build/FLookup_records.o build/FGraphBuildEnv_records.o build/FGraphBuild_records.o build/FGraph_records.o build/FExpand_records.o build/FCore_records.o build/FBuiltin_records.o build/ValuesUtil_records.o build/Values_records.o build/UnitParserExt_records.o build/UnitAbsyn_records.o build/Types_records.o build/StateMachineFlatten_records.o build/NFSCodeCheck_records.o build/NFSCodeLookup_records.o build/NFSCodeFlattenRedeclare_records.o build/NFSCodeFlatten_records.o build/NFSCodeFlattenImports_records.o build/NFSCodeEnv_records.o build/NFSCodeDependency_records.o build/NFInstUtil_records.o build/NFInstTypes_records.o build/NFInstPrefix_records.o build/NFEnvExtends_records.o build/Static_records.o build/SCodeUtil_records.o build/SCodeDump_records.o build/SCode_records.o build/PrefixUtil_records.o build/Prefix_records.o build/Patternm_records.o build/ParserExt_records.o build/Parser_records.o build/OperatorOverloading_records.o build/Mod_records.o build/MMath_records.o build/MetaUtil_records.o build/Lookup_records.o build/InstTypes_records.o build/InstStateMachineUtil_records.o build/InstSection_records.o build/InstExtends_records.o build/InstUtil_records.o build/InstBinding_records.o build/InstFunction_records.o build/InstDAE_records.o build/InstVar_records.o build/Inst_records.o build/InnerOuter_records.o build/Inline_records.o build/Graphviz_records.o build/ExpressionSimplifyTypes_records.o build/ExpressionSimplify_records.o build/Expression_records.o build/ExpressionDump_records.o build/ElementSource_records.o build/Dump_records.o build/DAEUtil_records.o build/DAE_records.o build/DAEDump_records.o build/Constants_records.o build/ConnectUtil_records.o build/Connect_records.o build/ConnectionGraph_records.o build/ComponentReference_records.o build/ClassLoader_records.o build/ClassInf_records.o build/Ceval_records.o build/CevalFunction_records.o build/Builtin_records.o build/BackendInterface_records.o build/Algorithm_records.o build/AbsynUtil_records.o build/Absyn_records.o build/File_records.o build/_main_omc.o -L.  -Lbuild/ -L"/var/lib/hudson/slave/workspace/OpenModelica_BUILD_GCC_4.9/OpenModelica/build/lib/x86_64-linux-gnu/omc" -lomparse /var/lib/hudson/slave/workspace/OpenModelica_BUILD_GCC_4.9/OpenModelica/OMCompiler/Compiler/runtime/libomcgraphstream.a /var/lib/hudson/slave/workspace/OpenModelica_BUILD_GCC_4.9/OpenModelica/OMCompiler/Compiler/runtime/libomcbackendruntime.a -lomcruntime -lOpenModelicaRuntimeC -lModelicaExternalC -lModelicaIO -lModelicaMatIO -lomantlr3 -lomniORB4 -lomnithread -lpthread -L/var/lib/hudson/slave/workspace/OpenModelica_BUILD_GCC_4.9/OpenModelica/OMCompiler/3rdParty/FMIL/install/lib -lfmilib -lexpat    -lomcgc  -lpthread -lm -ldl  -lstdc++ -rdynamic  -llpsolve55_pic -lcolamd -lm -ldl   -lhwloc -L/var/lib/hudson/slave/workspace/OpenModelica_BUILD_GCC_4.9/OpenModelica/build/lib/x86_64-linux-gnu/omc -lmetis  -llapack -lblas   -lzmq 
/var/lib/hudson/slave/workspace/OpenModelica_BUILD_GCC_4.9/OpenModelica/build/lib/x86_64-linux-gnu/omc/libModelicaExternalC.a(ModelicaInternal.o): In function `ModelicaInternal_temporaryFileName':
ModelicaInternal.c:(.text+0xd94): warning: the use of `tmpnam' is dangerous, better use `mkstemp'
/var/lib/hudson/slave/workspace/OpenModelica_BUILD_GCC_4.9/OpenModelica/build/lib/x86_64-linux-gnu/omc/libModelicaMatIO.a(ModelicaMatIO.o): In function `Mat_VarDelete':
ModelicaMatIO.c:(.text+0x48003): warning: the use of `mktemp' is dangerous, better use `mkstemp' or `mkdtemp'
test ! ".so" = ".dylib" || install_name_tool -id @rpath/libOpenModelicaCompiler.dylib /var/lib/hudson/slave/workspace/OpenModelica_BUILD_GCC_4.9/OpenModelica/build/lib/x86_64-linux-gnu/omc/libOpenModelicaCompiler.so
gcc-4.9 build/_main.o -Wl,-z,origin -Wl,-rpath,'$ORIGIN/../lib/x86_64-linux-gnu/omc' -Wl,-rpath,'$ORIGIN' -O2 -march=native -fno-stack-protector -fPIC  -Wno-parentheses-equality -Wno-unused-variable -Werror=implicit-function-declaration -I/var/lib/hudson/slave/workspace/OpenModelica_BUILD_GCC_4.9/OpenModelica/build/include/omc/c -I../Util/  -DADD_METARECORD_DEFINITIONS= -DOMC_BOOTSTRAPPING_STAGE_2 -o build/omc -L"/var/lib/hudson/slave/workspace/OpenModelica_BUILD_GCC_4.9/OpenModelica/build/lib/x86_64-linux-gnu/omc" -Wl,-rpath-link,/var/lib/hudson/slave/workspace/OpenModelica_BUILD_GCC_4.9/OpenModelica/build/lib/x86_64-linux-gnu/omc -lOpenModelicaCompiler
/var/lib/hudson/slave/workspace/OpenModelica_BUILD_GCC_4.9/OpenModelica/build/lib/x86_64-linux-gnu/omc/libOpenModelicaCompiler.so: undefined reference to `inflate'
/var/lib/hudson/slave/workspace/OpenModelica_BUILD_GCC_4.9/OpenModelica/build/lib/x86_64-linux-gnu/omc/libOpenModelicaCompiler.so: undefined reference to `inflateInit_'
/var/lib/hudson/slave/workspace/OpenModelica_BUILD_GCC_4.9/OpenModelica/build/lib/x86_64-linux-gnu/omc/libOpenModelicaCompiler.so: undefined reference to `deflateInit_'
/var/lib/hudson/slave/workspace/OpenModelica_BUILD_GCC_4.9/OpenModelica/build/lib/x86_64-linux-gnu/omc/libOpenModelicaCompiler.so: undefined reference to `zError'
/var/lib/hudson/slave/workspace/OpenModelica_BUILD_GCC_4.9/OpenModelica/build/lib/x86_64-linux-gnu/omc/libOpenModelicaCompiler.so: undefined reference to `deflate'
/var/lib/hudson/slave/workspace/OpenModelica_BUILD_GCC_4.9/OpenModelica/build/lib/x86_64-linux-gnu/omc/libOpenModelicaCompiler.so: undefined reference to `deflateEnd'
/var/lib/hudson/slave/workspace/OpenModelica_BUILD_GCC_4.9/OpenModelica/build/lib/x86_64-linux-gnu/omc/libOpenModelicaCompiler.so: undefined reference to `inflateEnd'
/var/lib/hudson/slave/workspace/OpenModelica_BUILD_GCC_4.9/OpenModelica/build/lib/x86_64-linux-gnu/omc/libOpenModelicaCompiler.so: undefined reference to `inflateCopy'
collect2: error: ld returned 1 exit status
Makefile.common:187: recipe for target 'build/omc' failed
make[5]: *** [build/omc] Error 1
make[5]: Leaving directory '/var/lib/hudson/slave/workspace/OpenModelica_BUILD_GCC_4.9/OpenModelica/OMCompiler/Compiler/boot'
Makefile.common:50: recipe for target 'bootstrap-from-tarball' failed
make[4]: *** [bootstrap-from-tarball] Error 2
make[4]: Leaving directory '/var/lib/hudson/slave/workspace/OpenModelica_BUILD_GCC_4.9/OpenModelica/OMCompiler/Compiler/boot'
Makefile.common:3: recipe for target 'all' failed
make[3]: *** [all] Error 2
make[3]: Leaving directory '/var/lib/hudson/slave/workspace/OpenModelica_BUILD_GCC_4.9/OpenModelica/OMCompiler/Compiler/boot'
Makefile:98: recipe for target 'omc-bootstrapped' failed
make[2]: *** [omc-bootstrapped] Error 2
make[2]: Leaving directory '/var/lib/hudson/slave/workspace/OpenModelica_BUILD_GCC_4.9/OpenModelica/OMCompiler'
Makefile.common:217: recipe for target 'all-runtimeCPPinstall' failed
make[1]: *** [all-runtimeCPPinstall] Error 2
make[1]: Leaving directory '/var/lib/hudson/slave/workspace/OpenModelica_BUILD_GCC_4.9/OpenModelica/OMCompiler'
Makefile:9: recipe for target 'omc' failed
make: *** [omc] Error 2
Command exited with non-zero status 2
1746.30user 123.78system 3:25.91elapsed 908%CPU (0avgtext+0avgdata 482988maxresident)k
112inputs+7276088outputs (0major+43065870minor)pagefaults 0swaps
Sending e-mails to: openmodelicabuilds@ida.liu.se
[DEBUG] Skipping watched dependency update for build: OpenModelica_BUILD_GCC_4.9 #2968 due to result: FAILURE
Finished: FAILURE

Powered by Hudson Open Source Continuous Integration Server from the Eclipse Foundation