Hudson logo

Failed

simulation_libraries_3rdParty_Annex60.Annex60.Fluid.Movers.BaseClasses.Characteristics.pressure.mos (from (result.xml))

Failing for the past 1,595 builds (Since #9699 )

Stacktrace

Output mismatch (see stdout for details)

Standard Output

 + Annex60.Fluid.Movers.BaseClasses.Characteristics.pressure.mos                     ... equation mismatch [time: 1]

==== Log /tmp/omc-rtest-adrpo33/simulation/libraries/3rdParty/Annex60/Annex60.Fluid.Movers.BaseClasses.Characteristics.pressure.mos_temp5913/log-Annex60.Fluid.Movers.BaseClasses.Characteristics.pressure.mos
true
true
""
false
"Error: Error building simulator. Build log: gcc  -falign-functions -fno-ipa-pure-const -mstackrealign -msse2 -mfpmath=sse   -I"C:/dev/hudson/workspace/OM_Win/OM/build/include/omc/c"  -c -o Annex60_pressure_0.o Annex60_pressure_0.c
gcc  -falign-functions -fno-ipa-pure-const -mstackrealign -msse2 -mfpmath=sse   -I"C:/dev/hudson/workspace/OM_Win/OM/build/include/omc/c"  -c -o Annex60_pressure_0_records.o Annex60_pressure_0_records.c
g++ -shared -Xlinker --export-all-symbols -fPIC -o Annex60_pressure_0.dll Annex60_pressure_0.o Annex60_pressure_0_records.o   -falign-functions -fno-ipa-pure-const -mstackrealign -msse2 -mfpmath=sse   -I"C:/dev/hudson/workspace/OM_Win/OM/build/include/omc/c"  -L"C:/dev/hudson/workspace/OM_Win/OM/build/lib//omc" -Wl,--stack,16777216,-rpath,'C:/dev/hudson/workspace/OM_Win/OM/build/lib//omc'   -fopenmp -Wl,-Bstatic -lregex -ltre -lintl -liconv -lexpat -lomcgc -lpthread -loleaut32 -limagehlp -lhdf5 -lz -lszip -Wl,-Bdynamic  -lOpenModelicaRuntimeC -Wl,-Bstatic -lomcgc -lregex -ltre -lintl -liconv -lexpat -static-libgcc -luuid -loleaut32 -lole32 -limagehlp -lws2_32 -llis -lumfpack -lklu -lcolamd -lbtf -lamd  -lsundials_idas -lsundials_kinsol -lsundials_nvecserial -lipopt -lcoinmumps -lpthread -lm -lgfortranbegin -lgfortran -lquadmath -lmingw32 -lgcc_eh -lmoldname -lmingwex -lmsvcrt -luser32 -lkernel32 -ladvapi32 -lshell32 -lopenblas -lcminpack -Wl,-Bdynamic -lm
C:/dev/hudson/workspace/OM_Win/OM/build/lib//omc/libOpenModelicaRuntimeC.a(base_array.o):base_array.c:(.rdata$.refptr.omc_assert[.refptr.omc_assert]+0x0): undefined reference to `omc_assert'
C:/dev/hudson/workspace/OM_Win/OM/build/lib//omc/libOpenModelicaRuntimeC.a(omc_gc.o):omc_gc.c:(.rdata$.refptr.omc_assert_warning[.refptr.omc_assert_warning]+0x0): undefined reference to `omc_assert_warning'
collect2.exe: error: ld returned 1 exit status
Annex60_pressure_0.makefile:20: recipe for target 'Annex60_pressure_0' failed
make: *** [Annex60_pressure_0] Error 1
RESULT: 2
"

Equation mismatch: diff says:
--- /tmp/omc-rtest-adrpo33/simulation/libraries/3rdParty/Annex60/Annex60.Fluid.Movers.BaseClasses.Characteristics.pressure.mos_temp5913/equations-expected2019-05-16 22:05:14.422500300 +0200
+++ /tmp/omc-rtest-adrpo33/simulation/libraries/3rdParty/Annex60/Annex60.Fluid.Movers.BaseClasses.Characteristics.pressure.mos_temp5913/equations-got2019-05-16 22:05:15.775485900 +0200
@@ -1,5 +1,14 @@
 true
 true
 ""
-true
-""
+false
+"Error: Error building simulator. Build log: gcc  -falign-functions -fno-ipa-pure-const -mstackrealign -msse2 -mfpmath=sse   -I"C:/dev/hudson/workspace/OM_Win/OM/build/include/omc/c"  -c -o Annex60_pressure_0.o Annex60_pressure_0.c
+gcc -falign-functions -fno-ipa-pure-const -mstackrealign -msse2 -mfpmath=sse   -I"C:/dev/hudson/workspace/OM_Win/OM/build/include/omc/c"  -c -o Annex60_pressure_0_records.o Annex60_pressure_0_records.c
+g++ -shared -Xlinker --export-all-symbols -fPIC -o Annex60_pressure_0.dll Annex60_pressure_0.o Annex60_pressure_0_records.o   -falign-functions -fno-ipa-pure-const -mstackrealign -msse2 -mfpmath=sse   -I"C:/dev/hudson/workspace/OM_Win/OM/build/include/omc/c"  -L"C:/dev/hudson/workspace/OM_Win/OM/build/lib//omc" -Wl,--stack,16777216,-rpath,'C:/dev/hudson/workspace/OM_Win/OM/build/lib//omc'   -fopenmp -Wl,-Bstatic -lregex -ltre -lintl -liconv -lexpat -lomcgc -lpthread -loleaut32 -limagehlp -lhdf5 -lz -lszip -Wl,-Bdynamic  -lOpenModelicaRuntimeC -Wl,-Bstatic -lomcgc -lregex -ltre -lintl -liconv -lexpat -static-libgcc -luuid -loleaut32 -lole32 -limagehlp -lws2_32 -llis -lumfpack -lklu -lcolamd -lbtf -lamd  -lsundials_idas -lsundials_kinsol -lsundials_nvecserial -lipopt -lcoinmumps -lpthread -lm -lgfortranbegin -lgfortran -lquadmath -lmingw32 -lgcc_eh -lmoldname -lmingwex -lmsvcrt -luser32 -lkernel32 -ladvapi32 -lshell32 -lopenblas -lcminpack -Wl,-Bdynamic -lm
+C:/dev/hudson/workspace/OM_Win/OM/build/lib//omc/libOpenModelicaRuntimeC.a(base_array.o):base_array.c:(.rdata$.refptr.omc_assert[.refptr.omc_assert]+0x0): undefined reference to `omc_assert'
+C:/dev/hudson/workspace/OM_Win/OM/build/lib//omc/libOpenModelicaRuntimeC.a(omc_gc.o):omc_gc.c:(.rdata$.refptr.omc_assert_warning[.refptr.omc_assert_warning]+0x0): undefined reference to `omc_assert_warning'
+collect2.exe: error: ld returned 1 exit status
+Annex60_pressure_0.makefile:20: recipe for target 'Annex60_pressure_0' failed
+make: *** [Annex60_pressure_0] Error 1
+RESULT: 2
+"

Equation mismatch: omc-diff says:
Failed 't' 'f'
Line 4: Text differs:
expected: true
got:      false

== 1 out of 1 tests failed [simulation/libraries/3rdParty/Annex60/Annex60.Fluid.Movers.BaseClasses.Characteristics.pressure.mos_temp5913, time: 2]

Powered by Hudson Open Source Continuous Integration Server from the Eclipse Foundation