Hudson logo

Failed

flattening_modelica_mosfiles.ZeroRange.mos (from (result.xml))

Failing for the past 1,595 builds (Since #9699 )

Stacktrace

Output mismatch (see stdout for details)

Standard Output

 + ZeroRange                                                                         ... equation mismatch [time: 32]

==== Log /tmp/omc-rtest-adrpo33/flattening/modelica/mosfiles/ZeroRange.mos_temp7431/log-ZeroRange.mos
true
0
""
1
""
2
""
2
""
1
""
0
""
true

"Error: Error building simulator. Build log: gcc  -falign-functions -fno-ipa-pure-const -mstackrealign -msse2 -mfpmath=sse   -I"C:/dev/hudson/workspace/OM_Win/OM/build/include/omc/c"  -c -o ZeroRange_testRangeLoop.o ZeroRange_testRangeLoop.c
gcc  -falign-functions -fno-ipa-pure-const -mstackrealign -msse2 -mfpmath=sse   -I"C:/dev/hudson/workspace/OM_Win/OM/build/include/omc/c"  -c -o ZeroRange_testRangeLoop_records.o ZeroRange_testRangeLoop_records.c
g++ -shared -Xlinker --export-all-symbols -fPIC -o ZeroRange_testRangeLoop.dll ZeroRange_testRangeLoop.o ZeroRange_testRangeLoop_records.o   -falign-functions -fno-ipa-pure-const -mstackrealign -msse2 -mfpmath=sse   -I"C:/dev/hudson/workspace/OM_Win/OM/build/include/omc/c"  -L"C:/dev/hudson/workspace/OM_Win/OM/build/lib//omc" -Wl,--stack,16777216,-rpath,'C:/dev/hudson/workspace/OM_Win/OM/build/lib//omc'   -fopenmp -Wl,-Bstatic -lregex -ltre -lintl -liconv -lexpat -lomcgc -lpthread -loleaut32 -limagehlp -lhdf5 -lz -lszip -Wl,-Bdynamic  -lOpenModelicaRuntimeC -Wl,-Bstatic -lomcgc -lregex -ltre -lintl -liconv -lexpat -static-libgcc -luuid -loleaut32 -lole32 -limagehlp -lws2_32 -llis -lumfpack -lklu -lcolamd -lbtf -lamd  -lsundials_idas -lsundials_kinsol -lsundials_nvecserial -lipopt -lcoinmumps -lpthread -lm -lgfortranbegin -lgfortran -lquadmath -lmingw32 -lgcc_eh -lmoldname -lmingwex -lmsvcrt -luser32 -lkernel32 -ladvapi32 -lshell32 -lopenblas -lcminpack -Wl,-Bdynamic -lm
ZeroRange_testRangeLoop.o:ZeroRange_testRangeLoop.c:(.rdata$.refptr.omc_assert[.refptr.omc_assert]+0x0): undefined reference to `omc_assert'
C:/dev/hudson/workspace/OM_Win/OM/build/lib//omc/libOpenModelicaRuntimeC.a(omc_gc.o):omc_gc.c:(.rdata$.refptr.omc_assert_warning[.refptr.omc_assert_warning]+0x0): undefined reference to `omc_assert_warning'
collect2.exe: error: ld returned 1 exit status
ZeroRange_testRangeLoop.makefile:20: recipe for target 'ZeroRange_testRangeLoop' failed
make: *** [ZeroRange_testRangeLoop] Error 1
RESULT: 2
"

"Error: Error building simulator. Build log: gcc  -falign-functions -fno-ipa-pure-const -mstackrealign -msse2 -mfpmath=sse   -I"C:/dev/hudson/workspace/OM_Win/OM/build/include/omc/c"  -c -o ZeroRange_testRangeLoop.o ZeroRange_testRangeLoop.c
gcc  -falign-functions -fno-ipa-pure-const -mstackrealign -msse2 -mfpmath=sse   -I"C:/dev/hudson/workspace/OM_Win/OM/build/include/omc/c"  -c -o ZeroRange_testRangeLoop_records.o ZeroRange_testRangeLoop_records.c
g++ -shared -Xlinker --export-all-symbols -fPIC -o ZeroRange_testRangeLoop.dll ZeroRange_testRangeLoop.o ZeroRange_testRangeLoop_records.o   -falign-functions -fno-ipa-pure-const -mstackrealign -msse2 -mfpmath=sse   -I"C:/dev/hudson/workspace/OM_Win/OM/build/include/omc/c"  -L"C:/dev/hudson/workspace/OM_Win/OM/build/lib//omc" -Wl,--stack,16777216,-rpath,'C:/dev/hudson/workspace/OM_Win/OM/build/lib//omc'   -fopenmp -Wl,-Bstatic -lregex -ltre -lintl -liconv -lexpat -lomcgc -lpthread -loleaut32 -limagehlp -lhdf5 -lz -lszip -Wl,-Bdynamic  -lOpenModelicaRuntimeC -Wl,-Bstatic -lomcgc -lregex -ltre -lintl -liconv -lexpat -static-libgcc -luuid -loleaut32 -lole32 -limagehlp -lws2_32 -llis -lumfpack -lklu -lcolamd -lbtf -lamd  -lsundials_idas -lsundials_kinsol -lsundials_nvecserial -lipopt -lcoinmumps -lpthread -lm -lgfortranbegin -lgfortran -lquadmath -lmingw32 -lgcc_eh -lmoldname -lmingwex -lmsvcrt -luser32 -lkernel32 -ladvapi32 -lshell32 -lopenblas -lcminpack -Wl,-Bdynamic -lm
ZeroRange_testRangeLoop.o:ZeroRange_testRangeLoop.c:(.rdata$.refptr.omc_assert[.refptr.omc_assert]+0x0): undefined reference to `omc_assert'
C:/dev/hudson/workspace/OM_Win/OM/build/lib//omc/libOpenModelicaRuntimeC.a(omc_gc.o):omc_gc.c:(.rdata$.refptr.omc_assert_warning[.refptr.omc_assert_warning]+0x0): undefined reference to `omc_assert_warning'
collect2.exe: error: ld returned 1 exit status
ZeroRange_testRangeLoop.makefile:20: recipe for target 'ZeroRange_testRangeLoop' failed
make: *** [ZeroRange_testRangeLoop] Error 1
RESULT: 2
"

"Error: Error building simulator. Build log: gcc  -falign-functions -fno-ipa-pure-const -mstackrealign -msse2 -mfpmath=sse   -I"C:/dev/hudson/workspace/OM_Win/OM/build/include/omc/c"  -c -o ZeroRange_testRangeLoop.o ZeroRange_testRangeLoop.c
gcc  -falign-functions -fno-ipa-pure-const -mstackrealign -msse2 -mfpmath=sse   -I"C:/dev/hudson/workspace/OM_Win/OM/build/include/omc/c"  -c -o ZeroRange_testRangeLoop_records.o ZeroRange_testRangeLoop_records.c
g++ -shared -Xlinker --export-all-symbols -fPIC -o ZeroRange_testRangeLoop.dll ZeroRange_testRangeLoop.o ZeroRange_testRangeLoop_records.o   -falign-functions -fno-ipa-pure-const -mstackrealign -msse2 -mfpmath=sse   -I"C:/dev/hudson/workspace/OM_Win/OM/build/include/omc/c"  -L"C:/dev/hudson/workspace/OM_Win/OM/build/lib//omc" -Wl,--stack,16777216,-rpath,'C:/dev/hudson/workspace/OM_Win/OM/build/lib//omc'   -fopenmp -Wl,-Bstatic -lregex -ltre -lintl -liconv -lexpat -lomcgc -lpthread -loleaut32 -limagehlp -lhdf5 -lz -lszip -Wl,-Bdynamic  -lOpenModelicaRuntimeC -Wl,-Bstatic -lomcgc -lregex -ltre -lintl -liconv -lexpat -static-libgcc -luuid -loleaut32 -lole32 -limagehlp -lws2_32 -llis -lumfpack -lklu -lcolamd -lbtf -lamd  -lsundials_idas -lsundials_kinsol -lsundials_nvecserial -lipopt -lcoinmumps -lpthread -lm -lgfortranbegin -lgfortran -lquadmath -lmingw32 -lgcc_eh -lmoldname -lmingwex -lmsvcrt -luser32 -lkernel32 -ladvapi32 -lshell32 -lopenblas -lcminpack -Wl,-Bdynamic -lm
ZeroRange_testRangeLoop.o:ZeroRange_testRangeLoop.c:(.rdata$.refptr.omc_assert[.refptr.omc_assert]+0x0): undefined reference to `omc_assert'
C:/dev/hudson/workspace/OM_Win/OM/build/lib//omc/libOpenModelicaRuntimeC.a(omc_gc.o):omc_gc.c:(.rdata$.refptr.omc_assert_warning[.refptr.omc_assert_warning]+0x0): undefined reference to `omc_assert_warning'
collect2.exe: error: ld returned 1 exit status
ZeroRange_testRangeLoop.makefile:20: recipe for target 'ZeroRange_testRangeLoop' failed
make: *** [ZeroRange_testRangeLoop] Error 1
RESULT: 2
"

"Error: Error building simulator. Build log: gcc  -falign-functions -fno-ipa-pure-const -mstackrealign -msse2 -mfpmath=sse   -I"C:/dev/hudson/workspace/OM_Win/OM/build/include/omc/c"  -c -o ZeroRange_testRangeLoop.o ZeroRange_testRangeLoop.c
gcc  -falign-functions -fno-ipa-pure-const -mstackrealign -msse2 -mfpmath=sse   -I"C:/dev/hudson/workspace/OM_Win/OM/build/include/omc/c"  -c -o ZeroRange_testRangeLoop_records.o ZeroRange_testRangeLoop_records.c
g++ -shared -Xlinker --export-all-symbols -fPIC -o ZeroRange_testRangeLoop.dll ZeroRange_testRangeLoop.o ZeroRange_testRangeLoop_records.o   -falign-functions -fno-ipa-pure-const -mstackrealign -msse2 -mfpmath=sse   -I"C:/dev/hudson/workspace/OM_Win/OM/build/include/omc/c"  -L"C:/dev/hudson/workspace/OM_Win/OM/build/lib//omc" -Wl,--stack,16777216,-rpath,'C:/dev/hudson/workspace/OM_Win/OM/build/lib//omc'   -fopenmp -Wl,-Bstatic -lregex -ltre -lintl -liconv -lexpat -lomcgc -lpthread -loleaut32 -limagehlp -lhdf5 -lz -lszip -Wl,-Bdynamic  -lOpenModelicaRuntimeC -Wl,-Bstatic -lomcgc -lregex -ltre -lintl -liconv -lexpat -static-libgcc -luuid -loleaut32 -lole32 -limagehlp -lws2_32 -llis -lumfpack -lklu -lcolamd -lbtf -lamd  -lsundials_idas -lsundials_kinsol -lsundials_nvecserial -lipopt -lcoinmumps -lpthread -lm -lgfortranbegin -lgfortran -lquadmath -lmingw32 -lgcc_eh -lmoldname -lmingwex -lmsvcrt -luser32 -lkernel32 -ladvapi32 -lshell32 -lopenblas -lcminpack -Wl,-Bdynamic -lm
ZeroRange_testRangeLoop.o:ZeroRange_testRangeLoop.c:(.rdata$.refptr.omc_assert[.refptr.omc_assert]+0x0): undefined reference to `omc_assert'
C:/dev/hudson/workspace/OM_Win/OM/build/lib//omc/libOpenModelicaRuntimeC.a(omc_gc.o):omc_gc.c:(.rdata$.refptr.omc_assert_warning[.refptr.omc_assert_warning]+0x0): undefined reference to `omc_assert_warning'
collect2.exe: error: ld returned 1 exit status
ZeroRange_testRangeLoop.makefile:20: recipe for target 'ZeroRange_testRangeLoop' failed
make: *** [ZeroRange_testRangeLoop] Error 1
RESULT: 2
"

"Error: Error building simulator. Build log: gcc  -falign-functions -fno-ipa-pure-const -mstackrealign -msse2 -mfpmath=sse   -I"C:/dev/hudson/workspace/OM_Win/OM/build/include/omc/c"  -c -o ZeroRange_testRangeLoop.o ZeroRange_testRangeLoop.c
gcc  -falign-functions -fno-ipa-pure-const -mstackrealign -msse2 -mfpmath=sse   -I"C:/dev/hudson/workspace/OM_Win/OM/build/include/omc/c"  -c -o ZeroRange_testRangeLoop_records.o ZeroRange_testRangeLoop_records.c
g++ -shared -Xlinker --export-all-symbols -fPIC -o ZeroRange_testRangeLoop.dll ZeroRange_testRangeLoop.o ZeroRange_testRangeLoop_records.o   -falign-functions -fno-ipa-pure-const -mstackrealign -msse2 -mfpmath=sse   -I"C:/dev/hudson/workspace/OM_Win/OM/build/include/omc/c"  -L"C:/dev/hudson/workspace/OM_Win/OM/build/lib//omc" -Wl,--stack,16777216,-rpath,'C:/dev/hudson/workspace/OM_Win/OM/build/lib//omc'   -fopenmp -Wl,-Bstatic -lregex -ltre -lintl -liconv -lexpat -lomcgc -lpthread -loleaut32 -limagehlp -lhdf5 -lz -lszip -Wl,-Bdynamic  -lOpenModelicaRuntimeC -Wl,-Bstatic -lomcgc -lregex -ltre -lintl -liconv -lexpat -static-libgcc -luuid -loleaut32 -lole32 -limagehlp -lws2_32 -llis -lumfpack -lklu -lcolamd -lbtf -lamd  -lsundials_idas -lsundials_kinsol -lsundials_nvecserial -lipopt -lcoinmumps -lpthread -lm -lgfortranbegin -lgfortran -lquadmath -lmingw32 -lgcc_eh -lmoldname -lmingwex -lmsvcrt -luser32 -lkernel32 -ladvapi32 -lshell32 -lopenblas -lcminpack -Wl,-Bdynamic -lm
ZeroRange_testRangeLoop.o:ZeroRange_testRangeLoop.c:(.rdata$.refptr.omc_assert[.refptr.omc_assert]+0x0): undefined reference to `omc_assert'
C:/dev/hudson/workspace/OM_Win/OM/build/lib//omc/libOpenModelicaRuntimeC.a(omc_gc.o):omc_gc.c:(.rdata$.refptr.omc_assert_warning[.refptr.omc_assert_warning]+0x0): undefined reference to `omc_assert_warning'
collect2.exe: error: ld returned 1 exit status
ZeroRange_testRangeLoop.makefile:20: recipe for target 'ZeroRange_testRangeLoop' failed
make: *** [ZeroRange_testRangeLoop] Error 1
RESULT: 2
"

"Error: Error building simulator. Build log: gcc  -falign-functions -fno-ipa-pure-const -mstackrealign -msse2 -mfpmath=sse   -I"C:/dev/hudson/workspace/OM_Win/OM/build/include/omc/c"  -c -o ZeroRange_testRangeLoop.o ZeroRange_testRangeLoop.c
gcc  -falign-functions -fno-ipa-pure-const -mstackrealign -msse2 -mfpmath=sse   -I"C:/dev/hudson/workspace/OM_Win/OM/build/include/omc/c"  -c -o ZeroRange_testRangeLoop_records.o ZeroRange_testRangeLoop_records.c
g++ -shared -Xlinker --export-all-symbols -fPIC -o ZeroRange_testRangeLoop.dll ZeroRange_testRangeLoop.o ZeroRange_testRangeLoop_records.o   -falign-functions -fno-ipa-pure-const -mstackrealign -msse2 -mfpmath=sse   -I"C:/dev/hudson/workspace/OM_Win/OM/build/include/omc/c"  -L"C:/dev/hudson/workspace/OM_Win/OM/build/lib//omc" -Wl,--stack,16777216,-rpath,'C:/dev/hudson/workspace/OM_Win/OM/build/lib//omc'   -fopenmp -Wl,-Bstatic -lregex -ltre -lintl -liconv -lexpat -lomcgc -lpthread -loleaut32 -limagehlp -lhdf5 -lz -lszip -Wl,-Bdynamic  -lOpenModelicaRuntimeC -Wl,-Bstatic -lomcgc -lregex -ltre -lintl -liconv -lexpat -static-libgcc -luuid -loleaut32 -lole32 -limagehlp -lws2_32 -llis -lumfpack -lklu -lcolamd -lbtf -lamd  -lsundials_idas -lsundials_kinsol -lsundials_nvecserial -lipopt -lcoinmumps -lpthread -lm -lgfortranbegin -lgfortran -lquadmath -lmingw32 -lgcc_eh -lmoldname -lmingwex -lmsvcrt -luser32 -lkernel32 -ladvapi32 -lshell32 -lopenblas -lcminpack -Wl,-Bdynamic -lm
ZeroRange_testRangeLoop.o:ZeroRange_testRangeLoop.c:(.rdata$.refptr.omc_assert[.refptr.omc_assert]+0x0): undefined reference to `omc_assert'
C:/dev/hudson/workspace/OM_Win/OM/build/lib//omc/libOpenModelicaRuntimeC.a(omc_gc.o):omc_gc.c:(.rdata$.refptr.omc_assert_warning[.refptr.omc_assert_warning]+0x0): undefined reference to `omc_assert_warning'
collect2.exe: error: ld returned 1 exit status
ZeroRange_testRangeLoop.makefile:20: recipe for target 'ZeroRange_testRangeLoop' failed
make: *** [ZeroRange_testRangeLoop] Error 1
RESULT: 2
"

"Error: Error building simulator. Build log: gcc  -falign-functions -fno-ipa-pure-const -mstackrealign -msse2 -mfpmath=sse   -I"C:/dev/hudson/workspace/OM_Win/OM/build/include/omc/c"  -c -o ZeroRange_testRangeLoop.o ZeroRange_testRangeLoop.c
gcc  -falign-functions -fno-ipa-pure-const -mstackrealign -msse2 -mfpmath=sse   -I"C:/dev/hudson/workspace/OM_Win/OM/build/include/omc/c"  -c -o ZeroRange_testRangeLoop_records.o ZeroRange_testRangeLoop_records.c
g++ -shared -Xlinker --export-all-symbols -fPIC -o ZeroRange_testRangeLoop.dll ZeroRange_testRangeLoop.o ZeroRange_testRangeLoop_records.o   -falign-functions -fno-ipa-pure-const -mstackrealign -msse2 -mfpmath=sse   -I"C:/dev/hudson/workspace/OM_Win/OM/build/include/omc/c"  -L"C:/dev/hudson/workspace/OM_Win/OM/build/lib//omc" -Wl,--stack,16777216,-rpath,'C:/dev/hudson/workspace/OM_Win/OM/build/lib//omc'   -fopenmp -Wl,-Bstatic -lregex -ltre -lintl -liconv -lexpat -lomcgc -lpthread -loleaut32 -limagehlp -lhdf5 -lz -lszip -Wl,-Bdynamic  -lOpenModelicaRuntimeC -Wl,-Bstatic -lomcgc -lregex -ltre -lintl -liconv -lexpat -static-libgcc -luuid -loleaut32 -lole32 -limagehlp -lws2_32 -llis -lumfpack -lklu -lcolamd -lbtf -lamd  -lsundials_idas -lsundials_kinsol -lsundials_nvecserial -lipopt -lcoinmumps -lpthread -lm -lgfortranbegin -lgfortran -lquadmath -lmingw32 -lgcc_eh -lmoldname -lmingwex -lmsvcrt -luser32 -lkernel32 -ladvapi32 -lshell32 -lopenblas -lcminpack -Wl,-Bdynamic -lm
ZeroRange_testRangeLoop.o:ZeroRange_testRangeLoop.c:(.rdata$.refptr.omc_assert[.refptr.omc_assert]+0x0): undefined reference to `omc_assert'
C:/dev/hudson/workspace/OM_Win/OM/build/lib//omc/libOpenModelicaRuntimeC.a(omc_gc.o):omc_gc.c:(.rdata$.refptr.omc_assert_warning[.refptr.omc_assert_warning]+0x0): undefined reference to `omc_assert_warning'
collect2.exe: error: ld returned 1 exit status
ZeroRange_testRangeLoop.makefile:20: recipe for target 'ZeroRange_testRangeLoop' failed
make: *** [ZeroRange_testRangeLoop] Error 1
RESULT: 2
"

Equation mismatch: diff says:
--- /tmp/omc-rtest-adrpo33/flattening/modelica/mosfiles/ZeroRange.mos_temp7431/equations-expected2019-05-16 21:05:01.846030900 +0200
+++ /tmp/omc-rtest-adrpo33/flattening/modelica/mosfiles/ZeroRange.mos_temp7431/equations-got2019-05-16 21:05:33.757640700 +0200
@@ -10,20 +10,82 @@
 1
 ""
 0
 ""
 true
-0
-""
-1
-""
-2
-""
-2
-""
-1
-""
-0
-""
-fail()
-"Error: assertion range step != 0 failed
+
+"Error: Error building simulator. Build log: gcc  -falign-functions -fno-ipa-pure-const -mstackrealign -msse2 -mfpmath=sse   -I"C:/dev/hudson/workspace/OM_Win/OM/build/include/omc/c"  -c -o ZeroRange_testRangeLoop.o ZeroRange_testRangeLoop.c
+gcc -falign-functions -fno-ipa-pure-const -mstackrealign -msse2 -mfpmath=sse   -I"C:/dev/hudson/workspace/OM_Win/OM/build/include/omc/c"  -c -o ZeroRange_testRangeLoop_records.o ZeroRange_testRangeLoop_records.c
+g++ -shared -Xlinker --export-all-symbols -fPIC -o ZeroRange_testRangeLoop.dll ZeroRange_testRangeLoop.o ZeroRange_testRangeLoop_records.o   -falign-functions -fno-ipa-pure-const -mstackrealign -msse2 -mfpmath=sse   -I"C:/dev/hudson/workspace/OM_Win/OM/build/include/omc/c"  -L"C:/dev/hudson/workspace/OM_Win/OM/build/lib//omc" -Wl,--stack,16777216,-rpath,'C:/dev/hudson/workspace/OM_Win/OM/build/lib//omc'   -fopenmp -Wl,-Bstatic -lregex -ltre -lintl -liconv -lexpat -lomcgc -lpthread -loleaut32 -limagehlp -lhdf5 -lz -lszip -Wl,-Bdynamic  -lOpenModelicaRuntimeC -Wl,-Bstatic -lomcgc -lregex -ltre -lintl -liconv -lexpat -static-libgcc -luuid -loleaut32 -lole32 -limagehlp -lws2_32 -llis -lumfpack -lklu -lcolamd -lbtf -lamd  -lsundials_idas -lsundials_kinsol -lsundials_nvecserial -lipopt -lcoinmumps -lpthread -lm -lgfortranbegin -lgfortran -lquadmath -lmingw32 -lgcc_eh -lmoldname -lmingwex -lmsvcrt -luser32 -lkernel32 -ladvapi32 -lshell32 -lopenblas -lcminpack -Wl,-Bdynamic -lm
+ZeroRange_testRangeLoop.o:ZeroRange_testRangeLoop.c:(.rdata$.refptr.omc_assert[.refptr.omc_assert]+0x0): undefined reference to `omc_assert'
+C:/dev/hudson/workspace/OM_Win/OM/build/lib//omc/libOpenModelicaRuntimeC.a(omc_gc.o):omc_gc.c:(.rdata$.refptr.omc_assert_warning[.refptr.omc_assert_warning]+0x0): undefined reference to `omc_assert_warning'
+collect2.exe: error: ld returned 1 exit status
+ZeroRange_testRangeLoop.makefile:20: recipe for target 'ZeroRange_testRangeLoop' failed
+make: *** [ZeroRange_testRangeLoop] Error 1
+RESULT: 2
+"
+
+"Error: Error building simulator. Build log: gcc  -falign-functions -fno-ipa-pure-const -mstackrealign -msse2 -mfpmath=sse   -I"C:/dev/hudson/workspace/OM_Win/OM/build/include/omc/c"  -c -o ZeroRange_testRangeLoop.o ZeroRange_testRangeLoop.c
+gcc -falign-functions -fno-ipa-pure-const -mstackrealign -msse2 -mfpmath=sse   -I"C:/dev/hudson/workspace/OM_Win/OM/build/include/omc/c"  -c -o ZeroRange_testRangeLoop_records.o ZeroRange_testRangeLoop_records.c
+g++ -shared -Xlinker --export-all-symbols -fPIC -o ZeroRange_testRangeLoop.dll ZeroRange_testRangeLoop.o ZeroRange_testRangeLoop_records.o   -falign-functions -fno-ipa-pure-const -mstackrealign -msse2 -mfpmath=sse   -I"C:/dev/hudson/workspace/OM_Win/OM/build/include/omc/c"  -L"C:/dev/hudson/workspace/OM_Win/OM/build/lib//omc" -Wl,--stack,16777216,-rpath,'C:/dev/hudson/workspace/OM_Win/OM/build/lib//omc'   -fopenmp -Wl,-Bstatic -lregex -ltre -lintl -liconv -lexpat -lomcgc -lpthread -loleaut32 -limagehlp -lhdf5 -lz -lszip -Wl,-Bdynamic  -lOpenModelicaRuntimeC -Wl,-Bstatic -lomcgc -lregex -ltre -lintl -liconv -lexpat -static-libgcc -luuid -loleaut32 -lole32 -limagehlp -lws2_32 -llis -lumfpack -lklu -lcolamd -lbtf -lamd  -lsundials_idas -lsundials_kinsol -lsundials_nvecserial -lipopt -lcoinmumps -lpthread -lm -lgfortranbegin -lgfortran -lquadmath -lmingw32 -lgcc_eh -lmoldname -lmingwex -lmsvcrt -luser32 -lkernel32 -ladvapi32 -lshell32 -lopenblas -lcminpack -Wl,-Bdynamic -lm
+ZeroRange_testRangeLoop.o:ZeroRange_testRangeLoop.c:(.rdata$.refptr.omc_assert[.refptr.omc_assert]+0x0): undefined reference to `omc_assert'
+C:/dev/hudson/workspace/OM_Win/OM/build/lib//omc/libOpenModelicaRuntimeC.a(omc_gc.o):omc_gc.c:(.rdata$.refptr.omc_assert_warning[.refptr.omc_assert_warning]+0x0): undefined reference to `omc_assert_warning'
+collect2.exe: error: ld returned 1 exit status
+ZeroRange_testRangeLoop.makefile:20: recipe for target 'ZeroRange_testRangeLoop' failed
+make: *** [ZeroRange_testRangeLoop] Error 1
+RESULT: 2
+"
+
+"Error: Error building simulator. Build log: gcc  -falign-functions -fno-ipa-pure-const -mstackrealign -msse2 -mfpmath=sse   -I"C:/dev/hudson/workspace/OM_Win/OM/build/include/omc/c"  -c -o ZeroRange_testRangeLoop.o ZeroRange_testRangeLoop.c
+gcc -falign-functions -fno-ipa-pure-const -mstackrealign -msse2 -mfpmath=sse   -I"C:/dev/hudson/workspace/OM_Win/OM/build/include/omc/c"  -c -o ZeroRange_testRangeLoop_records.o ZeroRange_testRangeLoop_records.c
+g++ -shared -Xlinker --export-all-symbols -fPIC -o ZeroRange_testRangeLoop.dll ZeroRange_testRangeLoop.o ZeroRange_testRangeLoop_records.o   -falign-functions -fno-ipa-pure-const -mstackrealign -msse2 -mfpmath=sse   -I"C:/dev/hudson/workspace/OM_Win/OM/build/include/omc/c"  -L"C:/dev/hudson/workspace/OM_Win/OM/build/lib//omc" -Wl,--stack,16777216,-rpath,'C:/dev/hudson/workspace/OM_Win/OM/build/lib//omc'   -fopenmp -Wl,-Bstatic -lregex -ltre -lintl -liconv -lexpat -lomcgc -lpthread -loleaut32 -limagehlp -lhdf5 -lz -lszip -Wl,-Bdynamic  -lOpenModelicaRuntimeC -Wl,-Bstatic -lomcgc -lregex -ltre -lintl -liconv -lexpat -static-libgcc -luuid -loleaut32 -lole32 -limagehlp -lws2_32 -llis -lumfpack -lklu -lcolamd -lbtf -lamd  -lsundials_idas -lsundials_kinsol -lsundials_nvecserial -lipopt -lcoinmumps -lpthread -lm -lgfortranbegin -lgfortran -lquadmath -lmingw32 -lgcc_eh -lmoldname -lmingwex -lmsvcrt -luser32 -lkernel32 -ladvapi32 -lshell32 -lopenblas -lcminpack -Wl,-Bdynamic -lm
+ZeroRange_testRangeLoop.o:ZeroRange_testRangeLoop.c:(.rdata$.refptr.omc_assert[.refptr.omc_assert]+0x0): undefined reference to `omc_assert'
+C:/dev/hudson/workspace/OM_Win/OM/build/lib//omc/libOpenModelicaRuntimeC.a(omc_gc.o):omc_gc.c:(.rdata$.refptr.omc_assert_warning[.refptr.omc_assert_warning]+0x0): undefined reference to `omc_assert_warning'
+collect2.exe: error: ld returned 1 exit status
+ZeroRange_testRangeLoop.makefile:20: recipe for target 'ZeroRange_testRangeLoop' failed
+make: *** [ZeroRange_testRangeLoop] Error 1
+RESULT: 2
+"
+
+"Error: Error building simulator. Build log: gcc  -falign-functions -fno-ipa-pure-const -mstackrealign -msse2 -mfpmath=sse   -I"C:/dev/hudson/workspace/OM_Win/OM/build/include/omc/c"  -c -o ZeroRange_testRangeLoop.o ZeroRange_testRangeLoop.c
+gcc -falign-functions -fno-ipa-pure-const -mstackrealign -msse2 -mfpmath=sse   -I"C:/dev/hudson/workspace/OM_Win/OM/build/include/omc/c"  -c -o ZeroRange_testRangeLoop_records.o ZeroRange_testRangeLoop_records.c
+g++ -shared -Xlinker --export-all-symbols -fPIC -o ZeroRange_testRangeLoop.dll ZeroRange_testRangeLoop.o ZeroRange_testRangeLoop_records.o   -falign-functions -fno-ipa-pure-const -mstackrealign -msse2 -mfpmath=sse   -I"C:/dev/hudson/workspace/OM_Win/OM/build/include/omc/c"  -L"C:/dev/hudson/workspace/OM_Win/OM/build/lib//omc" -Wl,--stack,16777216,-rpath,'C:/dev/hudson/workspace/OM_Win/OM/build/lib//omc'   -fopenmp -Wl,-Bstatic -lregex -ltre -lintl -liconv -lexpat -lomcgc -lpthread -loleaut32 -limagehlp -lhdf5 -lz -lszip -Wl,-Bdynamic  -lOpenModelicaRuntimeC -Wl,-Bstatic -lomcgc -lregex -ltre -lintl -liconv -lexpat -static-libgcc -luuid -loleaut32 -lole32 -limagehlp -lws2_32 -llis -lumfpack -lklu -lcolamd -lbtf -lamd  -lsundials_idas -lsundials_kinsol -lsundials_nvecserial -lipopt -lcoinmumps -lpthread -lm -lgfortranbegin -lgfortran -lquadmath -lmingw32 -lgcc_eh -lmoldname -lmingwex -lmsvcrt -luser32 -lkernel32 -ladvapi32 -lshell32 -lopenblas -lcminpack -Wl,-Bdynamic -lm
+ZeroRange_testRangeLoop.o:ZeroRange_testRangeLoop.c:(.rdata$.refptr.omc_assert[.refptr.omc_assert]+0x0): undefined reference to `omc_assert'
+C:/dev/hudson/workspace/OM_Win/OM/build/lib//omc/libOpenModelicaRuntimeC.a(omc_gc.o):omc_gc.c:(.rdata$.refptr.omc_assert_warning[.refptr.omc_assert_warning]+0x0): undefined reference to `omc_assert_warning'
+collect2.exe: error: ld returned 1 exit status
+ZeroRange_testRangeLoop.makefile:20: recipe for target 'ZeroRange_testRangeLoop' failed
+make: *** [ZeroRange_testRangeLoop] Error 1
+RESULT: 2
+"
+
+"Error: Error building simulator. Build log: gcc  -falign-functions -fno-ipa-pure-const -mstackrealign -msse2 -mfpmath=sse   -I"C:/dev/hudson/workspace/OM_Win/OM/build/include/omc/c"  -c -o ZeroRange_testRangeLoop.o ZeroRange_testRangeLoop.c
+gcc -falign-functions -fno-ipa-pure-const -mstackrealign -msse2 -mfpmath=sse   -I"C:/dev/hudson/workspace/OM_Win/OM/build/include/omc/c"  -c -o ZeroRange_testRangeLoop_records.o ZeroRange_testRangeLoop_records.c
+g++ -shared -Xlinker --export-all-symbols -fPIC -o ZeroRange_testRangeLoop.dll ZeroRange_testRangeLoop.o ZeroRange_testRangeLoop_records.o   -falign-functions -fno-ipa-pure-const -mstackrealign -msse2 -mfpmath=sse   -I"C:/dev/hudson/workspace/OM_Win/OM/build/include/omc/c"  -L"C:/dev/hudson/workspace/OM_Win/OM/build/lib//omc" -Wl,--stack,16777216,-rpath,'C:/dev/hudson/workspace/OM_Win/OM/build/lib//omc'   -fopenmp -Wl,-Bstatic -lregex -ltre -lintl -liconv -lexpat -lomcgc -lpthread -loleaut32 -limagehlp -lhdf5 -lz -lszip -Wl,-Bdynamic  -lOpenModelicaRuntimeC -Wl,-Bstatic -lomcgc -lregex -ltre -lintl -liconv -lexpat -static-libgcc -luuid -loleaut32 -lole32 -limagehlp -lws2_32 -llis -lumfpack -lklu -lcolamd -lbtf -lamd  -lsundials_idas -lsundials_kinsol -lsundials_nvecserial -lipopt -lcoinmumps -lpthread -lm -lgfortranbegin -lgfortran -lquadmath -lmingw32 -lgcc_eh -lmoldname -lmingwex -lmsvcrt -luser32 -lkernel32 -ladvapi32 -lshell32 -lopenblas -lcminpack -Wl,-Bdynamic -lm
+ZeroRange_testRangeLoop.o:ZeroRange_testRangeLoop.c:(.rdata$.refptr.omc_assert[.refptr.omc_assert]+0x0): undefined reference to `omc_assert'
+C:/dev/hudson/workspace/OM_Win/OM/build/lib//omc/libOpenModelicaRuntimeC.a(omc_gc.o):omc_gc.c:(.rdata$.refptr.omc_assert_warning[.refptr.omc_assert_warning]+0x0): undefined reference to `omc_assert_warning'
+collect2.exe: error: ld returned 1 exit status
+ZeroRange_testRangeLoop.makefile:20: recipe for target 'ZeroRange_testRangeLoop' failed
+make: *** [ZeroRange_testRangeLoop] Error 1
+RESULT: 2
+"
+
+"Error: Error building simulator. Build log: gcc  -falign-functions -fno-ipa-pure-const -mstackrealign -msse2 -mfpmath=sse   -I"C:/dev/hudson/workspace/OM_Win/OM/build/include/omc/c"  -c -o ZeroRange_testRangeLoop.o ZeroRange_testRangeLoop.c
+gcc -falign-functions -fno-ipa-pure-const -mstackrealign -msse2 -mfpmath=sse   -I"C:/dev/hudson/workspace/OM_Win/OM/build/include/omc/c"  -c -o ZeroRange_testRangeLoop_records.o ZeroRange_testRangeLoop_records.c
+g++ -shared -Xlinker --export-all-symbols -fPIC -o ZeroRange_testRangeLoop.dll ZeroRange_testRangeLoop.o ZeroRange_testRangeLoop_records.o   -falign-functions -fno-ipa-pure-const -mstackrealign -msse2 -mfpmath=sse   -I"C:/dev/hudson/workspace/OM_Win/OM/build/include/omc/c"  -L"C:/dev/hudson/workspace/OM_Win/OM/build/lib//omc" -Wl,--stack,16777216,-rpath,'C:/dev/hudson/workspace/OM_Win/OM/build/lib//omc'   -fopenmp -Wl,-Bstatic -lregex -ltre -lintl -liconv -lexpat -lomcgc -lpthread -loleaut32 -limagehlp -lhdf5 -lz -lszip -Wl,-Bdynamic  -lOpenModelicaRuntimeC -Wl,-Bstatic -lomcgc -lregex -ltre -lintl -liconv -lexpat -static-libgcc -luuid -loleaut32 -lole32 -limagehlp -lws2_32 -llis -lumfpack -lklu -lcolamd -lbtf -lamd  -lsundials_idas -lsundials_kinsol -lsundials_nvecserial -lipopt -lcoinmumps -lpthread -lm -lgfortranbegin -lgfortran -lquadmath -lmingw32 -lgcc_eh -lmoldname -lmingwex -lmsvcrt -luser32 -lkernel32 -ladvapi32 -lshell32 -lopenblas -lcminpack -Wl,-Bdynamic -lm
+ZeroRange_testRangeLoop.o:ZeroRange_testRangeLoop.c:(.rdata$.refptr.omc_assert[.refptr.omc_assert]+0x0): undefined reference to `omc_assert'
+C:/dev/hudson/workspace/OM_Win/OM/build/lib//omc/libOpenModelicaRuntimeC.a(omc_gc.o):omc_gc.c:(.rdata$.refptr.omc_assert_warning[.refptr.omc_assert_warning]+0x0): undefined reference to `omc_assert_warning'
+collect2.exe: error: ld returned 1 exit status
+ZeroRange_testRangeLoop.makefile:20: recipe for target 'ZeroRange_testRangeLoop' failed
+make: *** [ZeroRange_testRangeLoop] Error 1
+RESULT: 2
+"
+
+"Error: Error building simulator. Build log: gcc  -falign-functions -fno-ipa-pure-const -mstackrealign -msse2 -mfpmath=sse   -I"C:/dev/hudson/workspace/OM_Win/OM/build/include/omc/c"  -c -o ZeroRange_testRangeLoop.o ZeroRange_testRangeLoop.c
+gcc -falign-functions -fno-ipa-pure-const -mstackrealign -msse2 -mfpmath=sse   -I"C:/dev/hudson/workspace/OM_Win/OM/build/include/omc/c"  -c -o ZeroRange_testRangeLoop_records.o ZeroRange_testRangeLoop_records.c
+g++ -shared -Xlinker --export-all-symbols -fPIC -o ZeroRange_testRangeLoop.dll ZeroRange_testRangeLoop.o ZeroRange_testRangeLoop_records.o   -falign-functions -fno-ipa-pure-const -mstackrealign -msse2 -mfpmath=sse   -I"C:/dev/hudson/workspace/OM_Win/OM/build/include/omc/c"  -L"C:/dev/hudson/workspace/OM_Win/OM/build/lib//omc" -Wl,--stack,16777216,-rpath,'C:/dev/hudson/workspace/OM_Win/OM/build/lib//omc'   -fopenmp -Wl,-Bstatic -lregex -ltre -lintl -liconv -lexpat -lomcgc -lpthread -loleaut32 -limagehlp -lhdf5 -lz -lszip -Wl,-Bdynamic  -lOpenModelicaRuntimeC -Wl,-Bstatic -lomcgc -lregex -ltre -lintl -liconv -lexpat -static-libgcc -luuid -loleaut32 -lole32 -limagehlp -lws2_32 -llis -lumfpack -lklu -lcolamd -lbtf -lamd  -lsundials_idas -lsundials_kinsol -lsundials_nvecserial -lipopt -lcoinmumps -lpthread -lm -lgfortranbegin -lgfortran -lquadmath -lmingw32 -lgcc_eh -lmoldname -lmingwex -lmsvcrt -luser32 -lkernel32 -ladvapi32 -lshell32 -lopenblas -lcminpack -Wl,-Bdynamic -lm
+ZeroRange_testRangeLoop.o:ZeroRange_testRangeLoop.c:(.rdata$.refptr.omc_assert[.refptr.omc_assert]+0x0): undefined reference to `omc_assert'
+C:/dev/hudson/workspace/OM_Win/OM/build/lib//omc/libOpenModelicaRuntimeC.a(omc_gc.o):omc_gc.c:(.rdata$.refptr.omc_assert_warning[.refptr.omc_assert_warning]+0x0): undefined reference to `omc_assert_warning'
+collect2.exe: error: ld returned 1 exit status
+ZeroRange_testRangeLoop.makefile:20: recipe for target 'ZeroRange_testRangeLoop' failed
+make: *** [ZeroRange_testRangeLoop] Error 1
+RESULT: 2
 "

Equation mismatch: omc-diff says:
Line 15: Lexical token differs:
expected: 0
got:      


== 1 out of 1 tests failed [flattening/modelica/mosfiles/ZeroRange.mos_temp7431, time: 33]

Powered by Hudson Open Source Continuous Integration Server from the Eclipse Foundation