Hudson logo

Failed

flattening_modelica_mosfiles.StringArrayReturn.mos (from (result.xml))

Failing for the past 1,595 builds (Since #9699 )

Stacktrace

Output mismatch (see stdout for details)

Standard Output

 + StringArrayReturn                                                                 ... equation mismatch [time: 5]

==== Log /tmp/omc-rtest-adrpo33/flattening/modelica/mosfiles/StringArrayReturn.mos_temp7983/log-StringArrayReturn.mos
true
true
""

"Error: Error building simulator. Build log: gcc  -falign-functions -fno-ipa-pure-const -mstackrealign -msse2 -mfpmath=sse   -I"C:/dev/hudson/workspace/OM_Win/OM/build/include/omc/c"  -c -o StringArrayReturn_f.o StringArrayReturn_f.c
gcc  -falign-functions -fno-ipa-pure-const -mstackrealign -msse2 -mfpmath=sse   -I"C:/dev/hudson/workspace/OM_Win/OM/build/include/omc/c"  -c -o StringArrayReturn_f_records.o StringArrayReturn_f_records.c
g++ -shared -Xlinker --export-all-symbols -fPIC -o StringArrayReturn_f.dll StringArrayReturn_f.o StringArrayReturn_f_records.o   -falign-functions -fno-ipa-pure-const -mstackrealign -msse2 -mfpmath=sse   -I"C:/dev/hudson/workspace/OM_Win/OM/build/include/omc/c"  -L"C:/dev/hudson/workspace/OM_Win/OM/build/lib//omc" -Wl,--stack,16777216,-rpath,'C:/dev/hudson/workspace/OM_Win/OM/build/lib//omc'   -fopenmp -Wl,-Bstatic -lregex -ltre -lintl -liconv -lexpat -lomcgc -lpthread -loleaut32 -limagehlp -lhdf5 -lz -lszip -Wl,-Bdynamic  -lOpenModelicaRuntimeC -Wl,-Bstatic -lomcgc -lregex -ltre -lintl -liconv -lexpat -static-libgcc -luuid -loleaut32 -lole32 -limagehlp -lws2_32 -llis -lumfpack -lklu -lcolamd -lbtf -lamd  -lsundials_idas -lsundials_kinsol -lsundials_nvecserial -lipopt -lcoinmumps -lpthread -lm -lgfortranbegin -lgfortran -lquadmath -lmingw32 -lgcc_eh -lmoldname -lmingwex -lmsvcrt -luser32 -lkernel32 -ladvapi32 -lshell32 -lopenblas -lcminpack -Wl,-Bdynamic -lm
C:/dev/hudson/workspace/OM_Win/OM/build/lib//omc/libOpenModelicaRuntimeC.a(base_array.o):base_array.c:(.rdata$.refptr.omc_assert[.refptr.omc_assert]+0x0): undefined reference to `omc_assert'
C:/dev/hudson/workspace/OM_Win/OM/build/lib//omc/libOpenModelicaRuntimeC.a(omc_gc.o):omc_gc.c:(.rdata$.refptr.omc_assert_warning[.refptr.omc_assert_warning]+0x0): undefined reference to `omc_assert_warning'
collect2.exe: error: ld returned 1 exit status
StringArrayReturn_f.makefile:20: recipe for target 'StringArrayReturn_f' failed
make: *** [StringArrayReturn_f] Error 1
RESULT: 2
"

Equation mismatch: diff says:
--- /tmp/omc-rtest-adrpo33/flattening/modelica/mosfiles/StringArrayReturn.mos_temp7983/equations-expected2019-05-16 22:04:34.753306500 +0200
+++ /tmp/omc-rtest-adrpo33/flattening/modelica/mosfiles/StringArrayReturn.mos_temp7983/equations-got2019-05-16 22:04:39.569266200 +0200
@@ -1,5 +1,14 @@
 true
 true
 ""
-{"test","test","test"}
-""
+
+"Error: Error building simulator. Build log: gcc  -falign-functions -fno-ipa-pure-const -mstackrealign -msse2 -mfpmath=sse   -I"C:/dev/hudson/workspace/OM_Win/OM/build/include/omc/c"  -c -o StringArrayReturn_f.o StringArrayReturn_f.c
+gcc -falign-functions -fno-ipa-pure-const -mstackrealign -msse2 -mfpmath=sse   -I"C:/dev/hudson/workspace/OM_Win/OM/build/include/omc/c"  -c -o StringArrayReturn_f_records.o StringArrayReturn_f_records.c
+g++ -shared -Xlinker --export-all-symbols -fPIC -o StringArrayReturn_f.dll StringArrayReturn_f.o StringArrayReturn_f_records.o   -falign-functions -fno-ipa-pure-const -mstackrealign -msse2 -mfpmath=sse   -I"C:/dev/hudson/workspace/OM_Win/OM/build/include/omc/c"  -L"C:/dev/hudson/workspace/OM_Win/OM/build/lib//omc" -Wl,--stack,16777216,-rpath,'C:/dev/hudson/workspace/OM_Win/OM/build/lib//omc'   -fopenmp -Wl,-Bstatic -lregex -ltre -lintl -liconv -lexpat -lomcgc -lpthread -loleaut32 -limagehlp -lhdf5 -lz -lszip -Wl,-Bdynamic  -lOpenModelicaRuntimeC -Wl,-Bstatic -lomcgc -lregex -ltre -lintl -liconv -lexpat -static-libgcc -luuid -loleaut32 -lole32 -limagehlp -lws2_32 -llis -lumfpack -lklu -lcolamd -lbtf -lamd  -lsundials_idas -lsundials_kinsol -lsundials_nvecserial -lipopt -lcoinmumps -lpthread -lm -lgfortranbegin -lgfortran -lquadmath -lmingw32 -lgcc_eh -lmoldname -lmingwex -lmsvcrt -luser32 -lkernel32 -ladvapi32 -lshell32 -lopenblas -lcminpack -Wl,-Bdynamic -lm
+C:/dev/hudson/workspace/OM_Win/OM/build/lib//omc/libOpenModelicaRuntimeC.a(base_array.o):base_array.c:(.rdata$.refptr.omc_assert[.refptr.omc_assert]+0x0): undefined reference to `omc_assert'
+C:/dev/hudson/workspace/OM_Win/OM/build/lib//omc/libOpenModelicaRuntimeC.a(omc_gc.o):omc_gc.c:(.rdata$.refptr.omc_assert_warning[.refptr.omc_assert_warning]+0x0): undefined reference to `omc_assert_warning'
+collect2.exe: error: ld returned 1 exit status
+StringArrayReturn_f.makefile:20: recipe for target 'StringArrayReturn_f' failed
+make: *** [StringArrayReturn_f] Error 1
+RESULT: 2
+"

Equation mismatch: omc-diff says:
Line 4: Lexical token differs:
expected: {"test","test","test"}
got:      


== 1 out of 1 tests failed [flattening/modelica/mosfiles/StringArrayReturn.mos_temp7983, time: 6]

Powered by Hudson Open Source Continuous Integration Server from the Eclipse Foundation