Hudson logo

Failed

flattening_modelica_mosfiles.ExternalLibraryFunction.mos (from (result.xml))

Failing for the past 1,595 builds (Since #9699 )

Stacktrace

Output mismatch (see stdout for details)

Standard Output

 + ExternalLibraryFunction                                                           ... equation mismatch [time: 18]

==== Log /tmp/omc-rtest-adrpo33/flattening/modelica/mosfiles/ExternalLibraryFunction.mos_temp1407/log-ExternalLibraryFunction.mos
true
true
""
true
"Test"
"flattening/modelica/mosfiles/ExternalLibraryFunction.mos_temp1407/TestLibrary"
"C:\\dev\\hudson\\workspace\\OM_Win\\OM\\testsuite\\flattening\\modelica\\mosfiles\\ExternalLibraryFunction.mos_temp1407\\TestLibrary"
true

"Error: Error building simulator. Build log: gcc  -falign-functions -fno-ipa-pure-const -mstackrealign -msse2 -mfpmath=sse   -I"C:/dev/hudson/workspace/OM_Win/OM/build/include/omc/c"  -c -o Test_ext1.o Test_ext1.c
gcc  -falign-functions -fno-ipa-pure-const -mstackrealign -msse2 -mfpmath=sse   -I"C:/dev/hudson/workspace/OM_Win/OM/build/include/omc/c"  -c -o Test_ext1_records.o Test_ext1_records.c
g++ -shared -Xlinker --export-all-symbols -fPIC -o Test_ext1.dll Test_ext1.o Test_ext1_records.o "-LC:/dev/hudson/workspace/OM_Win/OM/build/lib//omc" "-LC:/dev/hudson/workspace/OM_Win/OM/build/lib/" "-L%APPDATA%/.openmodelica/binaries/Test" "-LC:/dev/hudson/workspace/OM_Win/OM/testsuite/flattening/modelica/mosfiles/ExternalLibraryFunction.mos_temp1407/TestLibrary/Resources/Library/mingw64" "-LC:/dev/hudson/workspace/OM_Win/OM/testsuite/flattening/modelica/mosfiles/ExternalLibraryFunction.mos_temp1407/TestLibrary/Resources/Library/win64" "-LC:/dev/hudson/workspace/OM_Win/OM/testsuite/flattening/modelica/mosfiles/ExternalLibraryFunction.mos_temp1407/TestLibrary/Resources/Library" -lext1  -falign-functions -fno-ipa-pure-const -mstackrealign -msse2 -mfpmath=sse   -I"C:/dev/hudson/workspace/OM_Win/OM/build/include/omc/c"  -L"C:/dev/hudson/workspace/OM_Win/OM/build/lib//omc" -Wl,--stack,16777216,-rpath,'C:/dev/hudson/workspace/OM_Win/OM/build/lib//omc'   -fopenmp -Wl,-Bstatic -lregex -ltre -lintl -liconv -lexpat -lomcgc -lpthread -loleaut32 -limagehlp -lhdf5 -lz -lszip -Wl,-Bdynamic  -lOpenModelicaRuntimeC -Wl,-Bstatic -lomcgc -lregex -ltre -lintl -liconv -lexpat -static-libgcc -luuid -loleaut32 -lole32 -limagehlp -lws2_32 -llis -lumfpack -lklu -lcolamd -lbtf -lamd  -lsundials_idas -lsundials_kinsol -lsundials_nvecserial -lipopt -lcoinmumps -lpthread -lm -lgfortranbegin -lgfortran -lquadmath -lmingw32 -lgcc_eh -lmoldname -lmingwex -lmsvcrt -luser32 -lkernel32 -ladvapi32 -lshell32 -lopenblas -lcminpack -Wl,-Bdynamic -lm
C:/dev/hudson/workspace/OM_Win/OM/build/lib//omc/libOpenModelicaRuntimeC.a(base_array.o):base_array.c:(.rdata$.refptr.omc_assert[.refptr.omc_assert]+0x0): undefined reference to `omc_assert'
C:/dev/hudson/workspace/OM_Win/OM/build/lib//omc/libOpenModelicaRuntimeC.a(omc_gc.o):omc_gc.c:(.rdata$.refptr.omc_assert_warning[.refptr.omc_assert_warning]+0x0): undefined reference to `omc_assert_warning'
collect2.exe: error: ld returned 1 exit status
Test_ext1.makefile:20: recipe for target 'Test_ext1' failed
make: *** [Test_ext1] Error 1
RESULT: 2
"

"Error: Error building simulator. Build log: gcc  -falign-functions -fno-ipa-pure-const -mstackrealign -msse2 -mfpmath=sse   -I"C:/dev/hudson/workspace/OM_Win/OM/build/include/omc/c"  -c -o Test_ext2.o Test_ext2.c
gcc  -falign-functions -fno-ipa-pure-const -mstackrealign -msse2 -mfpmath=sse   -I"C:/dev/hudson/workspace/OM_Win/OM/build/include/omc/c"  -c -o Test_ext2_records.o Test_ext2_records.c
g++ -shared -Xlinker --export-all-symbols -fPIC -o Test_ext2.dll Test_ext2.o Test_ext2_records.o "-LC:/dev/hudson/workspace/OM_Win/OM/build/lib//omc" "-LC:/dev/hudson/workspace/OM_Win/OM/build/lib/" "-L%APPDATA%/.openmodelica/binaries/Test" "-LC:/dev/hudson/workspace/OM_Win/OM/testsuite/flattening/modelica/mosfiles/ExternalLibraryFunction.mos_temp1407/TestLibrary/Resources/SpecialLib//mingw64" "-LC:/dev/hudson/workspace/OM_Win/OM/testsuite/flattening/modelica/mosfiles/ExternalLibraryFunction.mos_temp1407/TestLibrary/Resources/SpecialLib//win64" "-LC:/dev/hudson/workspace/OM_Win/OM/testsuite/flattening/modelica/mosfiles/ExternalLibraryFunction.mos_temp1407/TestLibrary/Resources/SpecialLib/" -lext2  -falign-functions -fno-ipa-pure-const -mstackrealign -msse2 -mfpmath=sse   -I"C:/dev/hudson/workspace/OM_Win/OM/build/include/omc/c"  -L"C:/dev/hudson/workspace/OM_Win/OM/build/lib//omc" -Wl,--stack,16777216,-rpath,'C:/dev/hudson/workspace/OM_Win/OM/build/lib//omc'   -fopenmp -Wl,-Bstatic -lregex -ltre -lintl -liconv -lexpat -lomcgc -lpthread -loleaut32 -limagehlp -lhdf5 -lz -lszip -Wl,-Bdynamic  -lOpenModelicaRuntimeC -Wl,-Bstatic -lomcgc -lregex -ltre -lintl -liconv -lexpat -static-libgcc -luuid -loleaut32 -lole32 -limagehlp -lws2_32 -llis -lumfpack -lklu -lcolamd -lbtf -lamd  -lsundials_idas -lsundials_kinsol -lsundials_nvecserial -lipopt -lcoinmumps -lpthread -lm -lgfortranbegin -lgfortran -lquadmath -lmingw32 -lgcc_eh -lmoldname -lmingwex -lmsvcrt -luser32 -lkernel32 -ladvapi32 -lshell32 -lopenblas -lcminpack -Wl,-Bdynamic -lm
C:/dev/hudson/workspace/OM_Win/OM/build/lib//omc/libOpenModelicaRuntimeC.a(base_array.o):base_array.c:(.rdata$.refptr.omc_assert[.refptr.omc_assert]+0x0): undefined reference to `omc_assert'
C:/dev/hudson/workspace/OM_Win/OM/build/lib//omc/libOpenModelicaRuntimeC.a(omc_gc.o):omc_gc.c:(.rdata$.refptr.omc_assert_warning[.refptr.omc_assert_warning]+0x0): undefined reference to `omc_assert_warning'
collect2.exe: error: ld returned 1 exit status
Test_ext2.makefile:20: recipe for target 'Test_ext2' failed
make: *** [Test_ext2] Error 1
RESULT: 2
"

"Error: Error building simulator. Build log: gcc  -falign-functions -fno-ipa-pure-const -mstackrealign -msse2 -mfpmath=sse   -I"C:/dev/hudson/workspace/OM_Win/OM/build/include/omc/c" "-IC:/dev/hudson/workspace/OM_Win/OM/testsuite/flattening/modelica/mosfiles/ExternalLibraryFunction.mos_temp1407/TestLibrary/Resources/Include" -c -o Test_ext3.o Test_ext3.c
gcc  -falign-functions -fno-ipa-pure-const -mstackrealign -msse2 -mfpmath=sse   -I"C:/dev/hudson/workspace/OM_Win/OM/build/include/omc/c" "-IC:/dev/hudson/workspace/OM_Win/OM/testsuite/flattening/modelica/mosfiles/ExternalLibraryFunction.mos_temp1407/TestLibrary/Resources/Include" -c -o Test_ext3_records.o Test_ext3_records.c
g++ -shared -Xlinker --export-all-symbols -fPIC -o Test_ext3.dll Test_ext3.o Test_ext3_records.o   -falign-functions -fno-ipa-pure-const -mstackrealign -msse2 -mfpmath=sse   -I"C:/dev/hudson/workspace/OM_Win/OM/build/include/omc/c" "-IC:/dev/hudson/workspace/OM_Win/OM/testsuite/flattening/modelica/mosfiles/ExternalLibraryFunction.mos_temp1407/TestLibrary/Resources/Include" -L"C:/dev/hudson/workspace/OM_Win/OM/build/lib//omc" -Wl,--stack,16777216,-rpath,'C:/dev/hudson/workspace/OM_Win/OM/build/lib//omc'   -fopenmp -Wl,-Bstatic -lregex -ltre -lintl -liconv -lexpat -lomcgc -lpthread -loleaut32 -limagehlp -lhdf5 -lz -lszip -Wl,-Bdynamic  -lOpenModelicaRuntimeC -Wl,-Bstatic -lomcgc -lregex -ltre -lintl -liconv -lexpat -static-libgcc -luuid -loleaut32 -lole32 -limagehlp -lws2_32 -llis -lumfpack -lklu -lcolamd -lbtf -lamd  -lsundials_idas -lsundials_kinsol -lsundials_nvecserial -lipopt -lcoinmumps -lpthread -lm -lgfortranbegin -lgfortran -lquadmath -lmingw32 -lgcc_eh -lmoldname -lmingwex -lmsvcrt -luser32 -lkernel32 -ladvapi32 -lshell32 -lopenblas -lcminpack -Wl,-Bdynamic -lm
C:/dev/hudson/workspace/OM_Win/OM/build/lib//omc/libOpenModelicaRuntimeC.a(base_array.o):base_array.c:(.rdata$.refptr.omc_assert[.refptr.omc_assert]+0x0): undefined reference to `omc_assert'
C:/dev/hudson/workspace/OM_Win/OM/build/lib//omc/libOpenModelicaRuntimeC.a(omc_gc.o):omc_gc.c:(.rdata$.refptr.omc_assert_warning[.refptr.omc_assert_warning]+0x0): undefined reference to `omc_assert_warning'
collect2.exe: error: ld returned 1 exit status
Test_ext3.makefile:20: recipe for target 'Test_ext3' failed
make: *** [Test_ext3] Error 1
RESULT: 2
"

"Error: Error building simulator. Build log: gcc  -falign-functions -fno-ipa-pure-const -mstackrealign -msse2 -mfpmath=sse   -I"C:/dev/hudson/workspace/OM_Win/OM/build/include/omc/c" "-IC:/dev/hudson/workspace/OM_Win/OM/testsuite/flattening/modelica/mosfiles/ExternalLibraryFunction.mos_temp1407/TestLibrary/Resources/SpecialSources/" -c -o Test_ext4.o Test_ext4.c
gcc  -falign-functions -fno-ipa-pure-const -mstackrealign -msse2 -mfpmath=sse   -I"C:/dev/hudson/workspace/OM_Win/OM/build/include/omc/c" "-IC:/dev/hudson/workspace/OM_Win/OM/testsuite/flattening/modelica/mosfiles/ExternalLibraryFunction.mos_temp1407/TestLibrary/Resources/SpecialSources/" -c -o Test_ext4_records.o Test_ext4_records.c
g++ -shared -Xlinker --export-all-symbols -fPIC -o Test_ext4.dll Test_ext4.o Test_ext4_records.o   -falign-functions -fno-ipa-pure-const -mstackrealign -msse2 -mfpmath=sse   -I"C:/dev/hudson/workspace/OM_Win/OM/build/include/omc/c" "-IC:/dev/hudson/workspace/OM_Win/OM/testsuite/flattening/modelica/mosfiles/ExternalLibraryFunction.mos_temp1407/TestLibrary/Resources/SpecialSources/" -L"C:/dev/hudson/workspace/OM_Win/OM/build/lib//omc" -Wl,--stack,16777216,-rpath,'C:/dev/hudson/workspace/OM_Win/OM/build/lib//omc'   -fopenmp -Wl,-Bstatic -lregex -ltre -lintl -liconv -lexpat -lomcgc -lpthread -loleaut32 -limagehlp -lhdf5 -lz -lszip -Wl,-Bdynamic  -lOpenModelicaRuntimeC -Wl,-Bstatic -lomcgc -lregex -ltre -lintl -liconv -lexpat -static-libgcc -luuid -loleaut32 -lole32 -limagehlp -lws2_32 -llis -lumfpack -lklu -lcolamd -lbtf -lamd  -lsundials_idas -lsundials_kinsol -lsundials_nvecserial -lipopt -lcoinmumps -lpthread -lm -lgfortranbegin -lgfortran -lquadmath -lmingw32 -lgcc_eh -lmoldname -lmingwex -lmsvcrt -luser32 -lkernel32 -ladvapi32 -lshell32 -lopenblas -lcminpack -Wl,-Bdynamic -lm
C:/dev/hudson/workspace/OM_Win/OM/build/lib//omc/libOpenModelicaRuntimeC.a(base_array.o):base_array.c:(.rdata$.refptr.omc_assert[.refptr.omc_assert]+0x0): undefined reference to `omc_assert'
C:/dev/hudson/workspace/OM_Win/OM/build/lib//omc/libOpenModelicaRuntimeC.a(omc_gc.o):omc_gc.c:(.rdata$.refptr.omc_assert_warning[.refptr.omc_assert_warning]+0x0): undefined reference to `omc_assert_warning'
collect2.exe: error: ld returned 1 exit status
Test_ext4.makefile:20: recipe for target 'Test_ext4' failed
make: *** [Test_ext4] Error 1
RESULT: 2
"

Equation mismatch: diff says:
--- /tmp/omc-rtest-adrpo33/flattening/modelica/mosfiles/ExternalLibraryFunction.mos_temp1407/equations-expected2019-05-16 21:18:31.335456400 +0200
+++ /tmp/omc-rtest-adrpo33/flattening/modelica/mosfiles/ExternalLibraryFunction.mos_temp1407/equations-got2019-05-16 21:18:49.429461000 +0200
@@ -2,15 +2,51 @@
 true
 ""
 true
 "Test"
 "flattening/modelica/mosfiles/TestLibrary"
-"flattening/modelica/mosfiles/TestLibrary"
+"C:\\dev\\hudson\\workspace\\OM_Win\\OM\\testsuite\\flattening\\modelica\\mosfiles\\ExternalLibraryFunction.mos_temp1407\\TestLibrary"
 true
-42.1
-""
-42.2
-""
-42.3
-""
-42.4
-""
+
+"Error: Error building simulator. Build log: gcc  -falign-functions -fno-ipa-pure-const -mstackrealign -msse2 -mfpmath=sse   -I"C:/dev/hudson/workspace/OM_Win/OM/build/include/omc/c"  -c -o Test_ext1.o Test_ext1.c
+gcc -falign-functions -fno-ipa-pure-const -mstackrealign -msse2 -mfpmath=sse   -I"C:/dev/hudson/workspace/OM_Win/OM/build/include/omc/c"  -c -o Test_ext1_records.o Test_ext1_records.c
+g++ -shared -Xlinker --export-all-symbols -fPIC -o Test_ext1.dll Test_ext1.o Test_ext1_records.o "-LC:/dev/hudson/workspace/OM_Win/OM/build/lib//omc" "-LC:/dev/hudson/workspace/OM_Win/OM/build/lib/" "-L%APPDATA%/.openmodelica/binaries/Test" "-LC:/dev/hudson/workspace/OM_Win/OM/testsuite/flattening/modelica/mosfiles/TestLibrary/Resources/Library/mingw64" "-LC:/dev/hudson/workspace/OM_Win/OM/testsuite/flattening/modelica/mosfiles/TestLibrary/Resources/Library/win64" "-LC:/dev/hudson/workspace/OM_Win/OM/testsuite/flattening/modelica/mosfiles/TestLibrary/Resources/Library" -lext1  -falign-functions -fno-ipa-pure-const -mstackrealign -msse2 -mfpmath=sse   -I"C:/dev/hudson/workspace/OM_Win/OM/build/include/omc/c"  -L"C:/dev/hudson/workspace/OM_Win/OM/build/lib//omc" -Wl,--stack,16777216,-rpath,'C:/dev/hudson/workspace/OM_Win/OM/build/lib//omc'   -fopenmp -Wl,-Bstatic -lregex -ltre -lintl -liconv -lexpat -lomcgc -lpthread -loleaut32 -limagehlp -lhdf5 -lz -lszip -Wl,-Bdynamic  -lOpenModelicaRuntimeC -Wl,-Bstatic -lomcgc -lregex -ltre -lintl -liconv -lexpat -static-libgcc -luuid -loleaut32 -lole32 -limagehlp -lws2_32 -llis -lumfpack -lklu -lcolamd -lbtf -lamd  -lsundials_idas -lsundials_kinsol -lsundials_nvecserial -lipopt -lcoinmumps -lpthread -lm -lgfortranbegin -lgfortran -lquadmath -lmingw32 -lgcc_eh -lmoldname -lmingwex -lmsvcrt -luser32 -lkernel32 -ladvapi32 -lshell32 -lopenblas -lcminpack -Wl,-Bdynamic -lm
+C:/dev/hudson/workspace/OM_Win/OM/build/lib//omc/libOpenModelicaRuntimeC.a(base_array.o):base_array.c:(.rdata$.refptr.omc_assert[.refptr.omc_assert]+0x0): undefined reference to `omc_assert'
+C:/dev/hudson/workspace/OM_Win/OM/build/lib//omc/libOpenModelicaRuntimeC.a(omc_gc.o):omc_gc.c:(.rdata$.refptr.omc_assert_warning[.refptr.omc_assert_warning]+0x0): undefined reference to `omc_assert_warning'
+collect2.exe: error: ld returned 1 exit status
+Test_ext1.makefile:20: recipe for target 'Test_ext1' failed
+make: *** [Test_ext1] Error 1
+RESULT: 2
+"
+
+"Error: Error building simulator. Build log: gcc  -falign-functions -fno-ipa-pure-const -mstackrealign -msse2 -mfpmath=sse   -I"C:/dev/hudson/workspace/OM_Win/OM/build/include/omc/c"  -c -o Test_ext2.o Test_ext2.c
+gcc -falign-functions -fno-ipa-pure-const -mstackrealign -msse2 -mfpmath=sse   -I"C:/dev/hudson/workspace/OM_Win/OM/build/include/omc/c"  -c -o Test_ext2_records.o Test_ext2_records.c
+g++ -shared -Xlinker --export-all-symbols -fPIC -o Test_ext2.dll Test_ext2.o Test_ext2_records.o "-LC:/dev/hudson/workspace/OM_Win/OM/build/lib//omc" "-LC:/dev/hudson/workspace/OM_Win/OM/build/lib/" "-L%APPDATA%/.openmodelica/binaries/Test" "-LC:/dev/hudson/workspace/OM_Win/OM/testsuite/flattening/modelica/mosfiles/TestLibrary/Resources/SpecialLib//mingw64" "-LC:/dev/hudson/workspace/OM_Win/OM/testsuite/flattening/modelica/mosfiles/TestLibrary/Resources/SpecialLib//win64" "-LC:/dev/hudson/workspace/OM_Win/OM/testsuite/flattening/modelica/mosfiles/TestLibrary/Resources/SpecialLib/" -lext2  -falign-functions -fno-ipa-pure-const -mstackrealign -msse2 -mfpmath=sse   -I"C:/dev/hudson/workspace/OM_Win/OM/build/include/omc/c"  -L"C:/dev/hudson/workspace/OM_Win/OM/build/lib//omc" -Wl,--stack,16777216,-rpath,'C:/dev/hudson/workspace/OM_Win/OM/build/lib//omc'   -fopenmp -Wl,-Bstatic -lregex -ltre -lintl -liconv -lexpat -lomcgc -lpthread -loleaut32 -limagehlp -lhdf5 -lz -lszip -Wl,-Bdynamic  -lOpenModelicaRuntimeC -Wl,-Bstatic -lomcgc -lregex -ltre -lintl -liconv -lexpat -static-libgcc -luuid -loleaut32 -lole32 -limagehlp -lws2_32 -llis -lumfpack -lklu -lcolamd -lbtf -lamd  -lsundials_idas -lsundials_kinsol -lsundials_nvecserial -lipopt -lcoinmumps -lpthread -lm -lgfortranbegin -lgfortran -lquadmath -lmingw32 -lgcc_eh -lmoldname -lmingwex -lmsvcrt -luser32 -lkernel32 -ladvapi32 -lshell32 -lopenblas -lcminpack -Wl,-Bdynamic -lm
+C:/dev/hudson/workspace/OM_Win/OM/build/lib//omc/libOpenModelicaRuntimeC.a(base_array.o):base_array.c:(.rdata$.refptr.omc_assert[.refptr.omc_assert]+0x0): undefined reference to `omc_assert'
+C:/dev/hudson/workspace/OM_Win/OM/build/lib//omc/libOpenModelicaRuntimeC.a(omc_gc.o):omc_gc.c:(.rdata$.refptr.omc_assert_warning[.refptr.omc_assert_warning]+0x0): undefined reference to `omc_assert_warning'
+collect2.exe: error: ld returned 1 exit status
+Test_ext2.makefile:20: recipe for target 'Test_ext2' failed
+make: *** [Test_ext2] Error 1
+RESULT: 2
+"
+
+"Error: Error building simulator. Build log: gcc  -falign-functions -fno-ipa-pure-const -mstackrealign -msse2 -mfpmath=sse   -I"C:/dev/hudson/workspace/OM_Win/OM/build/include/omc/c" "-IC:/dev/hudson/workspace/OM_Win/OM/testsuite/flattening/modelica/mosfiles/TestLibrary/Resources/Include" -c -o Test_ext3.o Test_ext3.c
+gcc -falign-functions -fno-ipa-pure-const -mstackrealign -msse2 -mfpmath=sse   -I"C:/dev/hudson/workspace/OM_Win/OM/build/include/omc/c" "-IC:/dev/hudson/workspace/OM_Win/OM/testsuite/flattening/modelica/mosfiles/TestLibrary/Resources/Include" -c -o Test_ext3_records.o Test_ext3_records.c
+g++ -shared -Xlinker --export-all-symbols -fPIC -o Test_ext3.dll Test_ext3.o Test_ext3_records.o   -falign-functions -fno-ipa-pure-const -mstackrealign -msse2 -mfpmath=sse   -I"C:/dev/hudson/workspace/OM_Win/OM/build/include/omc/c" "-IC:/dev/hudson/workspace/OM_Win/OM/testsuite/flattening/modelica/mosfiles/TestLibrary/Resources/Include" -L"C:/dev/hudson/workspace/OM_Win/OM/build/lib//omc" -Wl,--stack,16777216,-rpath,'C:/dev/hudson/workspace/OM_Win/OM/build/lib//omc'   -fopenmp -Wl,-Bstatic -lregex -ltre -lintl -liconv -lexpat -lomcgc -lpthread -loleaut32 -limagehlp -lhdf5 -lz -lszip -Wl,-Bdynamic  -lOpenModelicaRuntimeC -Wl,-Bstatic -lomcgc -lregex -ltre -lintl -liconv -lexpat -static-libgcc -luuid -loleaut32 -lole32 -limagehlp -lws2_32 -llis -lumfpack -lklu -lcolamd -lbtf -lamd  -lsundials_idas -lsundials_kinsol -lsundials_nvecserial -lipopt -lcoinmumps -lpthread -lm -lgfortranbegin -lgfortran -lquadmath -lmingw32 -lgcc_eh -lmoldname -lmingwex -lmsvcrt -luser32 -lkernel32 -ladvapi32 -lshell32 -lopenblas -lcminpack -Wl,-Bdynamic -lm
+C:/dev/hudson/workspace/OM_Win/OM/build/lib//omc/libOpenModelicaRuntimeC.a(base_array.o):base_array.c:(.rdata$.refptr.omc_assert[.refptr.omc_assert]+0x0): undefined reference to `omc_assert'
+C:/dev/hudson/workspace/OM_Win/OM/build/lib//omc/libOpenModelicaRuntimeC.a(omc_gc.o):omc_gc.c:(.rdata$.refptr.omc_assert_warning[.refptr.omc_assert_warning]+0x0): undefined reference to `omc_assert_warning'
+collect2.exe: error: ld returned 1 exit status
+Test_ext3.makefile:20: recipe for target 'Test_ext3' failed
+make: *** [Test_ext3] Error 1
+RESULT: 2
+"
+
+"Error: Error building simulator. Build log: gcc  -falign-functions -fno-ipa-pure-const -mstackrealign -msse2 -mfpmath=sse   -I"C:/dev/hudson/workspace/OM_Win/OM/build/include/omc/c" "-IC:/dev/hudson/workspace/OM_Win/OM/testsuite/flattening/modelica/mosfiles/TestLibrary/Resources/SpecialSources/" -c -o Test_ext4.o Test_ext4.c
+gcc -falign-functions -fno-ipa-pure-const -mstackrealign -msse2 -mfpmath=sse   -I"C:/dev/hudson/workspace/OM_Win/OM/build/include/omc/c" "-IC:/dev/hudson/workspace/OM_Win/OM/testsuite/flattening/modelica/mosfiles/TestLibrary/Resources/SpecialSources/" -c -o Test_ext4_records.o Test_ext4_records.c
+g++ -shared -Xlinker --export-all-symbols -fPIC -o Test_ext4.dll Test_ext4.o Test_ext4_records.o   -falign-functions -fno-ipa-pure-const -mstackrealign -msse2 -mfpmath=sse   -I"C:/dev/hudson/workspace/OM_Win/OM/build/include/omc/c" "-IC:/dev/hudson/workspace/OM_Win/OM/testsuite/flattening/modelica/mosfiles/TestLibrary/Resources/SpecialSources/" -L"C:/dev/hudson/workspace/OM_Win/OM/build/lib//omc" -Wl,--stack,16777216,-rpath,'C:/dev/hudson/workspace/OM_Win/OM/build/lib//omc'   -fopenmp -Wl,-Bstatic -lregex -ltre -lintl -liconv -lexpat -lomcgc -lpthread -loleaut32 -limagehlp -lhdf5 -lz -lszip -Wl,-Bdynamic  -lOpenModelicaRuntimeC -Wl,-Bstatic -lomcgc -lregex -ltre -lintl -liconv -lexpat -static-libgcc -luuid -loleaut32 -lole32 -limagehlp -lws2_32 -llis -lumfpack -lklu -lcolamd -lbtf -lamd  -lsundials_idas -lsundials_kinsol -lsundials_nvecserial -lipopt -lcoinmumps -lpthread -lm -lgfortranbegin -lgfortran -lquadmath -lmingw32 -lgcc_eh -lmoldname -lmingwex -lmsvcrt -luser32 -lkernel32 -ladvapi32 -lshell32 -lopenblas -lcminpack -Wl,-Bdynamic -lm
+C:/dev/hudson/workspace/OM_Win/OM/build/lib//omc/libOpenModelicaRuntimeC.a(base_array.o):base_array.c:(.rdata$.refptr.omc_assert[.refptr.omc_assert]+0x0): undefined reference to `omc_assert'
+C:/dev/hudson/workspace/OM_Win/OM/build/lib//omc/libOpenModelicaRuntimeC.a(omc_gc.o):omc_gc.c:(.rdata$.refptr.omc_assert_warning[.refptr.omc_assert_warning]+0x0): undefined reference to `omc_assert_warning'
+collect2.exe: error: ld returned 1 exit status
+Test_ext4.makefile:20: recipe for target 'Test_ext4' failed
+make: *** [Test_ext4] Error 1
+RESULT: 2
+"

Equation mismatch: omc-diff says:
Failed 'f' 'C'
Line 7: Text differs:
expected: "flattening/modelica/mosfiles/TestLibrary"
got:      "C:\\dev\\hudson\\workspace\\OM_Win\\OM\\testsuite\\flattening\\modelica\\mosfiles\\ExternalLibraryFunction.mos_temp

== 1 out of 1 tests failed [flattening/modelica/mosfiles/ExternalLibraryFunction.mos_temp1407, time: 18]

Powered by Hudson Open Source Continuous Integration Server from the Eclipse Foundation