Hudson logo

Failed

simulation_modelica_arrays.gc.mos (from (result.xml))

Failing for the past 1,565 builds (Since #9699 )

Stacktrace

Output mismatch (see stdout for details)

Standard Output

 + gc.mos [bug: #2980]                                                               ... equation mismatch [time: 33]

==== Log /tmp/omc-rtest-adrpo33/simulation/modelica/arrays/gc.mos_temp750/log-gc.mos
true
""
true
""
true
""
"function Modelica.Utilities.Streams.close \"Close file\"
  input String fileName \"Name of the file that shall be closed\";

  external \"C\" ModelicaStreams_closeFile(fileName);
end Modelica.Utilities.Streams.close;

function Modelica.Utilities.Streams.countLines \"Returns the number of lines in a file\"
  input String fileName \"Name of the file that shall be read\";
  output Integer numberOfLines \"Number of lines in file\";

  external \"C\" numberOfLines = ModelicaInternal_countLines(fileName);
end Modelica.Utilities.Streams.countLines;

function Modelica.Utilities.Streams.readFile \"Read content of a file and return it in a vector of strings\"
  input String fileName \"Name of the file that shall be read\";
  output String[Modelica.Utilities.Streams.countLines(fileName)] stringVector \"Content of file\";
algorithm
  for i in 1:size(stringVector, 1) loop
    stringVector[i] := Modelica.Utilities.Streams.readLine(fileName, i)[1];
  end for;
  Modelica.Utilities.Streams.close(fileName);
end Modelica.Utilities.Streams.readFile;

function Modelica.Utilities.Streams.readLine \"Reads a line of text from a file and returns it in a string\"
  input String fileName \"Name of the file that shall be read\";
  input Integer lineNumber(min = 1) \"Number of line to read\";
  output String string \"Line of text\";
  output Boolean endOfFile \"If true, end-of-file was reached when trying to read line\";

  external \"C\" string = ModelicaInternal_readLine(fileName, lineNumber, endOfFile);
end Modelica.Utilities.Streams.readLine;

class gctest
  String str[1];
  String str[2];
  String str[3];
  String str[4];
  String str[5];
  String str[6];
  String str[7];
  String str[8];
  String str[9];
  String str[10];
  String str[11];
  String str[12];
  String str[13];
  String str[14];
  String str[15];
  String s;
equation
  str = Modelica.Utilities.Streams.readFile(\"gc.mo\");
algorithm
  for i in 1:1000 loop
    s := String(i, 0, true) + \"
    \";
    if noEvent(i == 1000) then
      print(s);
    end if;
    for j in 1:15 loop
      s := str[j] + \"
      \";
      if noEvent(i == 1000) then
        print(s);
      end if;
    end for;
  end for;
end gctest;
"
"Error: Error building simulator. Build log: gcc  -falign-functions -fno-ipa-pure-const -mstackrealign -msse2 -mfpmath=sse   -I"C:/dev/hudson/workspace/OM_Win/OM/build/include/omc/c"  -c -o Modelica_Utilities_Streams_readFile.o Modelica_Utilities_Streams_readFile.c
Modelica_Utilities_Streams_readFile.c: In function 'in_Modelica_Utilities_Streams_readFile':
Modelica_Utilities_Streams_readFile.c:41:37: warning: passing argument 2 of 'read_modelica_string' from incompatible pointer type [-Wincompatible-pointer-types]
   if (read_modelica_string(&inArgs, (char**) &_fileName)) return 1;
                                     ^
In file included from C:/dev/hudson/workspace/OM_Win/OM/build/include/omc/c/util/modelica.h:62:0,
                 from Modelica_Utilities_Streams_readFile.h:4,
                 from Modelica_Utilities_Streams_readFile.c:2:
C:/dev/hudson/workspace/OM_Win/OM/build/include/omc/c/util/read_write.h:65:12: note: expected 'void **' but argument is of type 'char **'
 extern int read_modelica_string(type_description **descptr, modelica_string *str);
            ^
gcc  -falign-functions -fno-ipa-pure-const -mstackrealign -msse2 -mfpmath=sse   -I"C:/dev/hudson/workspace/OM_Win/OM/build/include/omc/c"  -c -o Modelica_Utilities_Streams_readFile_records.o Modelica_Utilities_Streams_readFile_records.c
g++ -shared -Xlinker --export-all-symbols -fPIC -o Modelica_Utilities_Streams_readFile.dll Modelica_Utilities_Streams_readFile.o Modelica_Utilities_Streams_readFile_records.o "-LC:/dev/hudson/workspace/OM_Win/OM/build/lib//omc" "-LC:/dev/hudson/workspace/OM_Win/OM/build/lib/" "-L%APPDATA%/.openmodelica/binaries/Modelica" "-Lc:/dev/hudson/workspace/OM_Win/OM/build/lib/omlibrary/Modelica 3.2.1/Resources/Library/mingw64" "-Lc:/dev/hudson/workspace/OM_Win/OM/build/lib/omlibrary/Modelica 3.2.1/Resources/Library/win64" "-Lc:/dev/hudson/workspace/OM_Win/OM/build/lib/omlibrary/Modelica 3.2.1/Resources/Library" -lModelicaExternalC  -falign-functions -fno-ipa-pure-const -mstackrealign -msse2 -mfpmath=sse   -I"C:/dev/hudson/workspace/OM_Win/OM/build/include/omc/c"  -L"C:/dev/hudson/workspace/OM_Win/OM/build/lib//omc" -Wl,--stack,16777216,-rpath,'C:/dev/hudson/workspace/OM_Win/OM/build/lib//omc'   -fopenmp -Wl,-Bstatic -lregex -ltre -lintl -liconv -lexpat -lomcgc -lpthread -loleaut32 -limagehlp -lhdf5 -lz -lszip -Wl,-Bdynamic  -lOpenModelicaRuntimeC -Wl,-Bstatic -lomcgc -lregex -ltre -lintl -liconv -lexpat -static-libgcc -luuid -loleaut32 -lole32 -limagehlp -lws2_32 -llis -lumfpack -lklu -lcolamd -lbtf -lamd  -lsundials_idas -lsundials_kinsol -lsundials_nvecserial -lipopt -lcoinmumps -lpthread -lm -lgfortranbegin -lgfortran -lquadmath -lmingw32 -lgcc_eh -lmoldname -lmingwex -lmsvcrt -luser32 -lkernel32 -ladvapi32 -lshell32 -lopenblas -lcminpack -Wl,-Bdynamic -lm
C:/dev/hudson/workspace/OM_Win/OM/build/lib//omc/libOpenModelicaRuntimeC.a(omc_gc.o):omc_gc.c:(.rdata$.refptr.omc_assert_warning[.refptr.omc_assert_warning]+0x0): undefined reference to `omc_assert_warning'
C:/dev/hudson/workspace/OM_Win/OM/build/lib//omc/libOpenModelicaRuntimeC.a(base_array.o):base_array.c:(.rdata$.refptr.omc_assert[.refptr.omc_assert]+0x0): undefined reference to `omc_assert'
collect2.exe: error: ld returned 1 exit status
Modelica_Utilities_Streams_readFile.makefile:20: recipe for target 'Modelica_Utilities_Streams_readFile' failed
make: *** [Modelica_Utilities_Streams_readFile] Error 1
RESULT: 2
"
record SimulationResult
    resultFile = "gctest_res.mat",
    simulationOptions = "startTime = 0.0, stopTime = 1.0, numberOfIntervals = 2, tolerance = 1e-006, method = 'dassl', fileNamePrefix = 'gctest', options = '', outputFormat = 'mat', variableFilter = '.*', cflags = '', simflags = ''",
    messages = "1000
model gctest
  String str[:] = Modelica.Utilities.Streams.readFile(\"gc.mo\"); // Reads itself
  String s;
algorithm
  for i in 1:1000 loop
    // print(String(i) + \"\\n\");
    s := String(i) + \"\\n\";
    if noEvent(i == 1000) then print(s); end if;
    for j in 1:size(str, 1) loop
      // print(str[j] + \"\\n\");
     s := str[j] + \"\\n\";
     if  noEvent(i == 1000) then print(s); end if;
    end for;
  end for;
end gctest;
1000
model gctest
  String str[:] = Modelica.Utilities.Streams.readFile(\"gc.mo\"); // Reads itself
  String s;
algorithm
  for i in 1:1000 loop
    // print(String(i) + \"\\n\");
    s := String(i) + \"\\n\";
    if noEvent(i == 1000) then print(s); end if;
    for j in 1:size(str, 1) loop
      // print(str[j] + \"\\n\");
     s := str[j] + \"\\n\";
     if  noEvent(i == 1000) then print(s); end if;
    end for;
  end for;
end gctest;
LOG_SUCCESS       | info    | The initialization finished successfully without homotopy method.
1000
model gctest
  String str[:] = Modelica.Utilities.Streams.readFile(\"gc.mo\"); // Reads itself
  String s;
algorithm
  for i in 1:1000 loop
    // print(String(i) + \"\\n\");
    s := String(i) + \"\\n\";
    if noEvent(i == 1000) then print(s); end if;
    for j in 1:size(str, 1) loop
      // print(str[j] + \"\\n\");
     s := str[j] + \"\\n\";
     if  noEvent(i == 1000) then print(s); end if;
    end for;
  end for;
end gctest;
1000
model gctest
  String str[:] = Modelica.Utilities.Streams.readFile(\"gc.mo\"); // Reads itself
  String s;
algorithm
  for i in 1:1000 loop
    // print(String(i) + \"\\n\");
    s := String(i) + \"\\n\";
    if noEvent(i == 1000) then print(s); end if;
    for j in 1:size(str, 1) loop
      // print(str[j] + \"\\n\");
     s := str[j] + \"\\n\";
     if  noEvent(i == 1000) then print(s); end if;
    end for;
  end for;
end gctest;
1000
model gctest
  String str[:] = Modelica.Utilities.Streams.readFile(\"gc.mo\"); // Reads itself
  String s;
algorithm
  for i in 1:1000 loop
    // print(String(i) + \"\\n\");
    s := String(i) + \"\\n\";
    if noEvent(i == 1000) then print(s); end if;
    for j in 1:size(str, 1) loop
      // print(str[j] + \"\\n\");
     s := str[j] + \"\\n\";
     if  noEvent(i == 1000) then print(s); end if;
    end for;
  end for;
end gctest;
LOG_SUCCESS       | info    | The simulation finished successfully.
"
end SimulationResult;
"Error: Error building simulator. Build log: gcc  -falign-functions -fno-ipa-pure-const -mstackrealign -msse2 -mfpmath=sse   -I"C:/dev/hudson/workspace/OM_Win/OM/build/include/omc/c"  -c -o Modelica_Utilities_Streams_readFile.o Modelica_Utilities_Streams_readFile.c
Modelica_Utilities_Streams_readFile.c: In function 'in_Modelica_Utilities_Streams_readFile':
Modelica_Utilities_Streams_readFile.c:41:37: warning: passing argument 2 of 'read_modelica_string' from incompatible pointer type [-Wincompatible-pointer-types]
   if (read_modelica_string(&inArgs, (char**) &_fileName)) return 1;
                                     ^
In file included from C:/dev/hudson/workspace/OM_Win/OM/build/include/omc/c/util/modelica.h:62:0,
                 from Modelica_Utilities_Streams_readFile.h:4,
                 from Modelica_Utilities_Streams_readFile.c:2:
C:/dev/hudson/workspace/OM_Win/OM/build/include/omc/c/util/read_write.h:65:12: note: expected 'void **' but argument is of type 'char **'
 extern int read_modelica_string(type_description **descptr, modelica_string *str);
            ^
gcc  -falign-functions -fno-ipa-pure-const -mstackrealign -msse2 -mfpmath=sse   -I"C:/dev/hudson/workspace/OM_Win/OM/build/include/omc/c"  -c -o Modelica_Utilities_Streams_readFile_records.o Modelica_Utilities_Streams_readFile_records.c
g++ -shared -Xlinker --export-all-symbols -fPIC -o Modelica_Utilities_Streams_readFile.dll Modelica_Utilities_Streams_readFile.o Modelica_Utilities_Streams_readFile_records.o "-LC:/dev/hudson/workspace/OM_Win/OM/build/lib//omc" "-LC:/dev/hudson/workspace/OM_Win/OM/build/lib/" "-L%APPDATA%/.openmodelica/binaries/Modelica" "-Lc:/dev/hudson/workspace/OM_Win/OM/build/lib/omlibrary/Modelica 3.2.1/Resources/Library/mingw64" "-Lc:/dev/hudson/workspace/OM_Win/OM/build/lib/omlibrary/Modelica 3.2.1/Resources/Library/win64" "-Lc:/dev/hudson/workspace/OM_Win/OM/build/lib/omlibrary/Modelica 3.2.1/Resources/Library" -lModelicaExternalC  -falign-functions -fno-ipa-pure-const -mstackrealign -msse2 -mfpmath=sse   -I"C:/dev/hudson/workspace/OM_Win/OM/build/include/omc/c"  -L"C:/dev/hudson/workspace/OM_Win/OM/build/lib//omc" -Wl,--stack,16777216,-rpath,'C:/dev/hudson/workspace/OM_Win/OM/build/lib//omc'   -fopenmp -Wl,-Bstatic -lregex -ltre -lintl -liconv -lexpat -lomcgc -lpthread -loleaut32 -limagehlp -lhdf5 -lz -lszip -Wl,-Bdynamic  -lOpenModelicaRuntimeC -Wl,-Bstatic -lomcgc -lregex -ltre -lintl -liconv -lexpat -static-libgcc -luuid -loleaut32 -lole32 -limagehlp -lws2_32 -llis -lumfpack -lklu -lcolamd -lbtf -lamd  -lsundials_idas -lsundials_kinsol -lsundials_nvecserial -lipopt -lcoinmumps -lpthread -lm -lgfortranbegin -lgfortran -lquadmath -lmingw32 -lgcc_eh -lmoldname -lmingwex -lmsvcrt -luser32 -lkernel32 -ladvapi32 -lshell32 -lopenblas -lcminpack -Wl,-Bdynamic -lm
C:/dev/hudson/workspace/OM_Win/OM/build/lib//omc/libOpenModelicaRuntimeC.a(omc_gc.o):omc_gc.c:(.rdata$.refptr.omc_assert_warning[.refptr.omc_assert_warning]+0x0): undefined reference to `omc_assert_warning'
C:/dev/hudson/workspace/OM_Win/OM/build/lib//omc/libOpenModelicaRuntimeC.a(base_array.o):base_array.c:(.rdata$.refptr.omc_assert[.refptr.omc_assert]+0x0): undefined reference to `omc_assert'
collect2.exe: error: ld returned 1 exit status
Modelica_Utilities_Streams_readFile.makefile:20: recipe for target 'Modelica_Utilities_Streams_readFile' failed
make: *** [Modelica_Utilities_Streams_readFile] Error 1
RESULT: 2
"

Equation mismatch: diff says:
--- /tmp/omc-rtest-adrpo33/simulation/modelica/arrays/gc.mos_temp750/equations-expected2019-05-07 12:58:08.275949300 +0200
+++ /tmp/omc-rtest-adrpo33/simulation/modelica/arrays/gc.mos_temp750/equations-got2019-05-07 12:58:41.058996100 +0200
@@ -52,11 +52,11 @@
 String str[13];
 String str[14];
 String str[15];
 String s;
 equation
-str = {\"model gctest\", \"  String str[:] = Modelica.Utilities.Streams.readFile(\\\"gc.mo\\\"); // Reads itself\", \"  String s;\", \"algorithm\", \"  for i in 1:1000 loop\", \"    // print(String(i) + \\\"\\\\n\\\");\", \"    s := String(i) + \\\"\\\\n\\\";\", \"    if noEvent(i == 1000) then print(s); end if;\", \"    for j in 1:size(str, 1) loop\", \"      // print(str[j] + \\\"\\\\n\\\");\", \"     s := str[j] + \\\"\\\\n\\\";\", \"     if  noEvent(i == 1000) then print(s); end if;\", \"    end for;\", \"  end for;\", \"end gctest;\"};
+str = Modelica.Utilities.Streams.readFile(\"gc.mo\");
 algorithm
 for i in 1:1000 loop
 s := String(i, 0, true) + \"
 \";
 if noEvent(i == 1000) then
@@ -70,14 +70,33 @@
 end if;
 end for;
 end for;
 end gctest;
 "
-""
+"Error: Error building simulator. Build log: gcc  -falign-functions -fno-ipa-pure-const -mstackrealign -msse2 -mfpmath=sse   -I"C:/dev/hudson/workspace/OM_Win/OM/build/include/omc/c"  -c -o Modelica_Utilities_Streams_readFile.o Modelica_Utilities_Streams_readFile.c
+Modelica_Utilities_Streams_readFile.c: In function 'in_Modelica_Utilities_Streams_readFile':
+Modelica_Utilities_Streams_readFile.c:41:37: warning: passing argument 2 of 'read_modelica_string' from incompatible pointer type [-Wincompatible-pointer-types]
+if (read_modelica_string(&inArgs, (char**) &_fileName)) return 1;
+^
+In file included from C:/dev/hudson/workspace/OM_Win/OM/build/include/omc/c/util/modelica.h:62:0,
+from Modelica_Utilities_Streams_readFile.h:4,
+from Modelica_Utilities_Streams_readFile.c:2:
+C:/dev/hudson/workspace/OM_Win/OM/build/include/omc/c/util/read_write.h:65:12: note: expected 'void **' but argument is of type 'char **'
+extern int read_modelica_string(type_description **descptr, modelica_string *str);
+^
+gcc -falign-functions -fno-ipa-pure-const -mstackrealign -msse2 -mfpmath=sse   -I"C:/dev/hudson/workspace/OM_Win/OM/build/include/omc/c"  -c -o Modelica_Utilities_Streams_readFile_records.o Modelica_Utilities_Streams_readFile_records.c
+g++ -shared -Xlinker --export-all-symbols -fPIC -o Modelica_Utilities_Streams_readFile.dll Modelica_Utilities_Streams_readFile.o Modelica_Utilities_Streams_readFile_records.o "-LC:/dev/hudson/workspace/OM_Win/OM/build/lib//omc" "-LC:/dev/hudson/workspace/OM_Win/OM/build/lib/" "-L%APPDATA%/.openmodelica/binaries/Modelica" "-Lc:/dev/hudson/workspace/OM_Win/OM/build/lib/omlibrary/Modelica 3.2.1/Resources/Library/mingw64" "-Lc:/dev/hudson/workspace/OM_Win/OM/build/lib/omlibrary/Modelica 3.2.1/Resources/Library/win64" "-Lc:/dev/hudson/workspace/OM_Win/OM/build/lib/omlibrary/Modelica 3.2.1/Resources/Library" -lModelicaExternalC  -falign-functions -fno-ipa-pure-const -mstackrealign -msse2 -mfpmath=sse   -I"C:/dev/hudson/workspace/OM_Win/OM/build/include/omc/c"  -L"C:/dev/hudson/workspace/OM_Win/OM/build/lib//omc" -Wl,--stack,16777216,-rpath,'C:/dev/hudson/workspace/OM_Win/OM/build/lib//omc'   -fopenmp -Wl,-Bstatic -lregex -ltre -lintl -liconv -lexpat -lomcgc -lpthread -loleaut32 -limagehlp -lhdf5 -lz -lszip -Wl,-Bdynamic  -lOpenModelicaRuntimeC -Wl,-Bstatic -lomcgc -lregex -ltre -lintl -liconv -lexpat -static-libgcc -luuid -loleaut32 -lole32 -limagehlp -lws2_32 -llis -lumfpack -lklu -lcolamd -lbtf -lamd  -lsundials_idas -lsundials_kinsol -lsundials_nvecserial -lipopt -lcoinmumps -lpthread -lm -lgfortranbegin -lgfortran -lquadmath -lmingw32 -lgcc_eh -lmoldname -lmingwex -lmsvcrt -luser32 -lkernel32 -ladvapi32 -lshell32 -lopenblas -lcminpack -Wl,-Bdynamic -lm
+C:/dev/hudson/workspace/OM_Win/OM/build/lib//omc/libOpenModelicaRuntimeC.a(omc_gc.o):omc_gc.c:(.rdata$.refptr.omc_assert_warning[.refptr.omc_assert_warning]+0x0): undefined reference to `omc_assert_warning'
+C:/dev/hudson/workspace/OM_Win/OM/build/lib//omc/libOpenModelicaRuntimeC.a(base_array.o):base_array.c:(.rdata$.refptr.omc_assert[.refptr.omc_assert]+0x0): undefined reference to `omc_assert'
+collect2.exe: error: ld returned 1 exit status
+Modelica_Utilities_Streams_readFile.makefile:20: recipe for target 'Modelica_Utilities_Streams_readFile' failed
+make: *** [Modelica_Utilities_Streams_readFile] Error 1
+RESULT: 2
+"
 record SimulationResult
 resultFile = "gctest_res.mat",
-simulationOptions = "startTime = 0.0, stopTime = 1.0, numberOfIntervals = 2, tolerance = 1e-06, method = 'dassl', fileNamePrefix = 'gctest', options = '', outputFormat = 'mat', variableFilter = '.*', cflags = '', simflags = ''",
+simulationOptions = "startTime = 0.0, stopTime = 1.0, numberOfIntervals = 2, tolerance = 1e-006, method = 'dassl', fileNamePrefix = 'gctest', options = '', outputFormat = 'mat', variableFilter = '.*', cflags = '', simflags = ''",
 messages = "1000
 model gctest
 String str[:] = Modelica.Utilities.Streams.readFile(\"gc.mo\"); // Reads itself
 String s;
 algorithm
@@ -158,6 +177,25 @@
 end for;
 end gctest;
 LOG_SUCCESS       | info    | The simulation finished successfully.
 "
 end SimulationResult;
-""
+"Error: Error building simulator. Build log: gcc  -falign-functions -fno-ipa-pure-const -mstackrealign -msse2 -mfpmath=sse   -I"C:/dev/hudson/workspace/OM_Win/OM/build/include/omc/c"  -c -o Modelica_Utilities_Streams_readFile.o Modelica_Utilities_Streams_readFile.c
+Modelica_Utilities_Streams_readFile.c: In function 'in_Modelica_Utilities_Streams_readFile':
+Modelica_Utilities_Streams_readFile.c:41:37: warning: passing argument 2 of 'read_modelica_string' from incompatible pointer type [-Wincompatible-pointer-types]
+if (read_modelica_string(&inArgs, (char**) &_fileName)) return 1;
+^
+In file included from C:/dev/hudson/workspace/OM_Win/OM/build/include/omc/c/util/modelica.h:62:0,
+from Modelica_Utilities_Streams_readFile.h:4,
+from Modelica_Utilities_Streams_readFile.c:2:
+C:/dev/hudson/workspace/OM_Win/OM/build/include/omc/c/util/read_write.h:65:12: note: expected 'void **' but argument is of type 'char **'
+extern int read_modelica_string(type_description **descptr, modelica_string *str);
+^
+gcc -falign-functions -fno-ipa-pure-const -mstackrealign -msse2 -mfpmath=sse   -I"C:/dev/hudson/workspace/OM_Win/OM/build/include/omc/c"  -c -o Modelica_Utilities_Streams_readFile_records.o Modelica_Utilities_Streams_readFile_records.c
+g++ -shared -Xlinker --export-all-symbols -fPIC -o Modelica_Utilities_Streams_readFile.dll Modelica_Utilities_Streams_readFile.o Modelica_Utilities_Streams_readFile_records.o "-LC:/dev/hudson/workspace/OM_Win/OM/build/lib//omc" "-LC:/dev/hudson/workspace/OM_Win/OM/build/lib/" "-L%APPDATA%/.openmodelica/binaries/Modelica" "-Lc:/dev/hudson/workspace/OM_Win/OM/build/lib/omlibrary/Modelica 3.2.1/Resources/Library/mingw64" "-Lc:/dev/hudson/workspace/OM_Win/OM/build/lib/omlibrary/Modelica 3.2.1/Resources/Library/win64" "-Lc:/dev/hudson/workspace/OM_Win/OM/build/lib/omlibrary/Modelica 3.2.1/Resources/Library" -lModelicaExternalC  -falign-functions -fno-ipa-pure-const -mstackrealign -msse2 -mfpmath=sse   -I"C:/dev/hudson/workspace/OM_Win/OM/build/include/omc/c"  -L"C:/dev/hudson/workspace/OM_Win/OM/build/lib//omc" -Wl,--stack,16777216,-rpath,'C:/dev/hudson/workspace/OM_Win/OM/build/lib//omc'   -fopenmp -Wl,-Bstatic -lregex -ltre -lintl -liconv -lexpat -lomcgc -lpthread -loleaut32 -limagehlp -lhdf5 -lz -lszip -Wl,-Bdynamic  -lOpenModelicaRuntimeC -Wl,-Bstatic -lomcgc -lregex -ltre -lintl -liconv -lexpat -static-libgcc -luuid -loleaut32 -lole32 -limagehlp -lws2_32 -llis -lumfpack -lklu -lcolamd -lbtf -lamd  -lsundials_idas -lsundials_kinsol -lsundials_nvecserial -lipopt -lcoinmumps -lpthread -lm -lgfortranbegin -lgfortran -lquadmath -lmingw32 -lgcc_eh -lmoldname -lmingwex -lmsvcrt -luser32 -lkernel32 -ladvapi32 -lshell32 -lopenblas -lcminpack -Wl,-Bdynamic -lm
+C:/dev/hudson/workspace/OM_Win/OM/build/lib//omc/libOpenModelicaRuntimeC.a(omc_gc.o):omc_gc.c:(.rdata$.refptr.omc_assert_warning[.refptr.omc_assert_warning]+0x0): undefined reference to `omc_assert_warning'
+C:/dev/hudson/workspace/OM_Win/OM/build/lib//omc/libOpenModelicaRuntimeC.a(base_array.o):base_array.c:(.rdata$.refptr.omc_assert[.refptr.omc_assert]+0x0): undefined reference to `omc_assert'
+collect2.exe: error: ld returned 1 exit status
+Modelica_Utilities_Streams_readFile.makefile:20: recipe for target 'Modelica_Utilities_Streams_readFile' failed
+make: *** [Modelica_Utilities_Streams_readFile] Error 1
+RESULT: 2
+"

Equation mismatch: omc-diff says:
Failed '{' 'M'
Line 57: Text differs:
expected: str = {\"model gctest\", \"  String str[:] = Modelica.Utilities.Streams.readFile(\\\"gc.mo\\\"); // Reads itself\", \"  String s;\", \"algorithm\", \"  for i in 
got:      str = Modelica.Utilities.Streams.readFile(\"gc.mo\");

== 1 out of 1 tests failed [simulation/modelica/arrays/gc.mos_temp750, time: 33]

Powered by Hudson Open Source Continuous Integration Server from the Eclipse Foundation