Hudson logo

Failed

simulation_modelica_algorithms_functions.ForIterator2.mos (from (result.xml))

Failing for the past 1,565 builds (Since #9699 )

Stacktrace

Output mismatch (see stdout for details)

Standard Output

 + ForIterator2                                                                      ... equation mismatch [time: 5]

==== Log /tmp/omc-rtest-adrpo33/simulation/modelica/algorithms_functions/ForIterator2.mos_temp4340/log-ForIterator2.mos
true
""
true
""

"Error: Error building simulator. Build log: gcc  -falign-functions -fno-ipa-pure-const -mstackrealign -msse2 -mfpmath=sse   -I"C:/dev/hudson/workspace/OM_Win/OM/build/include/omc/c"  -c -o ForIterator2_func.o ForIterator2_func.c
gcc  -falign-functions -fno-ipa-pure-const -mstackrealign -msse2 -mfpmath=sse   -I"C:/dev/hudson/workspace/OM_Win/OM/build/include/omc/c"  -c -o ForIterator2_func_records.o ForIterator2_func_records.c
g++ -shared -Xlinker --export-all-symbols -fPIC -o ForIterator2_func.dll ForIterator2_func.o ForIterator2_func_records.o   -falign-functions -fno-ipa-pure-const -mstackrealign -msse2 -mfpmath=sse   -I"C:/dev/hudson/workspace/OM_Win/OM/build/include/omc/c"  -L"C:/dev/hudson/workspace/OM_Win/OM/build/lib//omc" -Wl,--stack,16777216,-rpath,'C:/dev/hudson/workspace/OM_Win/OM/build/lib//omc'   -fopenmp -Wl,-Bstatic -lregex -ltre -lintl -liconv -lexpat -lomcgc -lpthread -loleaut32 -limagehlp -lhdf5 -lz -lszip -Wl,-Bdynamic  -lOpenModelicaRuntimeC -Wl,-Bstatic -lomcgc -lregex -ltre -lintl -liconv -lexpat -static-libgcc -luuid -loleaut32 -lole32 -limagehlp -lws2_32 -llis -lumfpack -lklu -lcolamd -lbtf -lamd  -lsundials_idas -lsundials_kinsol -lsundials_nvecserial -lipopt -lcoinmumps -lpthread -lm -lgfortranbegin -lgfortran -lquadmath -lmingw32 -lgcc_eh -lmoldname -lmingwex -lmsvcrt -luser32 -lkernel32 -ladvapi32 -lshell32 -lopenblas -lcminpack -Wl,-Bdynamic -lm
C:/dev/hudson/workspace/OM_Win/OM/build/lib//omc/libOpenModelicaRuntimeC.a(base_array.o):base_array.c:(.rdata$.refptr.omc_assert[.refptr.omc_assert]+0x0): undefined reference to `omc_assert'
C:/dev/hudson/workspace/OM_Win/OM/build/lib//omc/libOpenModelicaRuntimeC.a(omc_gc.o):omc_gc.c:(.rdata$.refptr.omc_assert_warning[.refptr.omc_assert_warning]+0x0): undefined reference to `omc_assert_warning'
collect2.exe: error: ld returned 1 exit status
ForIterator2_func.makefile:20: recipe for target 'ForIterator2_func' failed
make: *** [ForIterator2_func] Error 1
RESULT: 2
"

Equation mismatch: diff says:
--- /tmp/omc-rtest-adrpo33/simulation/modelica/algorithms_functions/ForIterator2.mos_temp4340/equations-expected2019-05-07 13:56:45.004001700 +0200
+++ /tmp/omc-rtest-adrpo33/simulation/modelica/algorithms_functions/ForIterator2.mos_temp4340/equations-got2019-05-07 13:56:50.769008800 +0200
@@ -1,6 +1,15 @@
 true
 ""
 true
 ""
-(54.0,10.5,8.0,7.0,2,4,7,8)
-""
+
+"Error: Error building simulator. Build log: gcc  -falign-functions -fno-ipa-pure-const -mstackrealign -msse2 -mfpmath=sse   -I"C:/dev/hudson/workspace/OM_Win/OM/build/include/omc/c"  -c -o ForIterator2_func.o ForIterator2_func.c
+gcc -falign-functions -fno-ipa-pure-const -mstackrealign -msse2 -mfpmath=sse   -I"C:/dev/hudson/workspace/OM_Win/OM/build/include/omc/c"  -c -o ForIterator2_func_records.o ForIterator2_func_records.c
+g++ -shared -Xlinker --export-all-symbols -fPIC -o ForIterator2_func.dll ForIterator2_func.o ForIterator2_func_records.o   -falign-functions -fno-ipa-pure-const -mstackrealign -msse2 -mfpmath=sse   -I"C:/dev/hudson/workspace/OM_Win/OM/build/include/omc/c"  -L"C:/dev/hudson/workspace/OM_Win/OM/build/lib//omc" -Wl,--stack,16777216,-rpath,'C:/dev/hudson/workspace/OM_Win/OM/build/lib//omc'   -fopenmp -Wl,-Bstatic -lregex -ltre -lintl -liconv -lexpat -lomcgc -lpthread -loleaut32 -limagehlp -lhdf5 -lz -lszip -Wl,-Bdynamic  -lOpenModelicaRuntimeC -Wl,-Bstatic -lomcgc -lregex -ltre -lintl -liconv -lexpat -static-libgcc -luuid -loleaut32 -lole32 -limagehlp -lws2_32 -llis -lumfpack -lklu -lcolamd -lbtf -lamd  -lsundials_idas -lsundials_kinsol -lsundials_nvecserial -lipopt -lcoinmumps -lpthread -lm -lgfortranbegin -lgfortran -lquadmath -lmingw32 -lgcc_eh -lmoldname -lmingwex -lmsvcrt -luser32 -lkernel32 -ladvapi32 -lshell32 -lopenblas -lcminpack -Wl,-Bdynamic -lm
+C:/dev/hudson/workspace/OM_Win/OM/build/lib//omc/libOpenModelicaRuntimeC.a(base_array.o):base_array.c:(.rdata$.refptr.omc_assert[.refptr.omc_assert]+0x0): undefined reference to `omc_assert'
+C:/dev/hudson/workspace/OM_Win/OM/build/lib//omc/libOpenModelicaRuntimeC.a(omc_gc.o):omc_gc.c:(.rdata$.refptr.omc_assert_warning[.refptr.omc_assert_warning]+0x0): undefined reference to `omc_assert_warning'
+collect2.exe: error: ld returned 1 exit status
+ForIterator2_func.makefile:20: recipe for target 'ForIterator2_func' failed
+make: *** [ForIterator2_func] Error 1
+RESULT: 2
+"

Equation mismatch: omc-diff says:
Line 5: Lexical token differs:
expected: (
got:      


== 1 out of 1 tests failed [simulation/modelica/algorithms_functions/ForIterator2.mos_temp4340, time: 6]

Powered by Hudson Open Source Continuous Integration Server from the Eclipse Foundation