Hudson logo

Failed

openmodelica_bootstrapping.HashTableTest.mos (from (result.xml))

Failing for the past 3,443 builds (Since #7821 )

Stacktrace

Output mismatch (see stdout for details)

Standard Output

 + HashTable Unit Testing                                                            ... equation mismatch [time: 27]

==== Log /tmp/omc-rtest-adrpo33/openmodelica/bootstrapping/HashTableTest.mos_temp8203/log-HashTableTest.mos
"
"
""
true
""
true

"Error: Error building simulator. Build log: gcc -g -falign-functions -fno-ipa-pure-const -mstackrealign -msse2 -mfpmath=sse   -I"C:/dev/hudson/workspace/OM_Win/OM/build/include/omc/c" "-IC:/dev/hudson/workspace/OM_Win/OM/OMCompiler/Compiler/Util/" -c -o HashTableTest_fn.o HashTableTest_fn.c
HashTableTest_fn.c: In function 'omc_Tpl_stringFile':
HashTableTest_fn.c:13980:3: warning: implicit declaration of function 'omc_File_File_destructor' [-Wimplicit-function-declaration]
   omc_File_File_destructor(threadData,_file);
   ^
HashTableTest_fn.c: In function 'omc_Absyn_pathStringWork':
HashTableTest_fn.c:38365:3: warning: implicit declaration of function 'omc_System_StringAllocator_destructor' [-Wimplicit-function-declaration]
   omc_System_StringAllocator_destructor(threadData,_sb);
   ^
gcc -g -falign-functions -fno-ipa-pure-const -mstackrealign -msse2 -mfpmath=sse   -I"C:/dev/hudson/workspace/OM_Win/OM/build/include/omc/c" "-IC:/dev/hudson/workspace/OM_Win/OM/OMCompiler/Compiler/Util/" -c -o HashTableTest_fn_records.o HashTableTest_fn_records.c
g++ -shared -Xlinker --export-all-symbols -fPIC -o HashTableTest_fn.dll HashTableTest_fn.o HashTableTest_fn_records.o "-LC:/dev/hudson/workspace/OM_Win/OM/build/lib//omc" "-LC:/dev/hudson/workspace/OM_Win/OM/build/lib/" "-L%APPDATA%/.openmodelica/binaries/System" "-LC:/dev/hudson/workspace/OM_Win/OM/OMCompiler/Compiler/Util/Resources/Library/mingw64" "-LC:/dev/hudson/workspace/OM_Win/OM/OMCompiler/Compiler/Util/Resources/Library/win64" "-LC:/dev/hudson/workspace/OM_Win/OM/OMCompiler/Compiler/Util/Resources/Library" -lomcruntime -lintl -liconv -lexpat -lsqlite3 -llpsolve55 -ltre -lomniORB420_rt -lomnithread40_rt -lws2_32 -lRpcrt4 -lregex "-L%APPDATA%/.openmodelica/binaries/ErrorExt" "-L%APPDATA%/.openmodelica/binaries/Print" -g -falign-functions -fno-ipa-pure-const -mstackrealign -msse2 -mfpmath=sse   -I"C:/dev/hudson/workspace/OM_Win/OM/build/include/omc/c" "-IC:/dev/hudson/workspace/OM_Win/OM/OMCompiler/Compiler/Util/" -L"C:/dev/hudson/workspace/OM_Win/OM/build/lib//omc" -Wl,--stack,16777216,-rpath,'C:/dev/hudson/workspace/OM_Win/OM/build/lib//omc'  -lOpenModelicaCompiler -fopenmp -Wl,-Bstatic -lregex -ltre -lintl -liconv -lexpat -lomcgc -lpthread -loleaut32 -limagehlp -lhdf5 -lz -lszip -Wl,-Bdynamic  -lOpenModelicaRuntimeC -Wl,-Bstatic -lomcgc -lregex -ltre -lintl -liconv -lexpat -static-libgcc -luuid -loleaut32 -lole32 -limagehlp -lws2_32 -llis -lumfpack -lklu -lcolamd -lbtf -lamd  -lsundials_idas -lsundials_kinsol -lsundials_nvecserial -lipopt -lcoinmumps -lpthread -lm -lgfortranbegin -lgfortran -lquadmath -lmingw32 -lgcc_eh -lmoldname -lmingwex -lmsvcrt -luser32 -lkernel32 -ladvapi32 -lshell32 -lopenblas -lcminpack -Wl,-Bdynamic -lm
C:/OMDev/tools/msys/mingw64/bin/../lib/gcc/x86_64-w64-mingw32/5.3.0/../../../../lib\libregex.a(systre.o):(.text+0x0): multiple definition of `regcomp'
C:/OMDev/tools/msys/mingw64/bin/../lib/gcc/x86_64-w64-mingw32/5.3.0/../../../../lib/libregex.dll.a(d000001.o):(.text+0x0): first defined here
C:/OMDev/tools/msys/mingw64/bin/../lib/gcc/x86_64-w64-mingw32/5.3.0/../../../../lib\libregex.a(systre.o):(.text+0x10): multiple definition of `regfree'
C:/OMDev/tools/msys/mingw64/bin/../lib/gcc/x86_64-w64-mingw32/5.3.0/../../../../lib/libregex.dll.a(d000004.o):(.text+0x0): first defined here
C:/OMDev/tools/msys/mingw64/bin/../lib/gcc/x86_64-w64-mingw32/5.3.0/../../../../lib\libregex.a(systre.o):(.text+0x30): multiple definition of `regexec'
C:/OMDev/tools/msys/mingw64/bin/../lib/gcc/x86_64-w64-mingw32/5.3.0/../../../../lib/libregex.dll.a(d000003.o):(.text+0x0): first defined here
collect2.exe: error: ld returned 1 exit status
HashTableTest_fn.makefile:20: recipe for target 'HashTableTest_fn' failed
make: *** [HashTableTest_fn] Error 1
RESULT: 2
"

Equation mismatch: diff says:
--- /tmp/omc-rtest-adrpo33/openmodelica/bootstrapping/HashTableTest.mos_temp8203/equations-expected2019-05-07 13:03:01.185532200 +0200
+++ /tmp/omc-rtest-adrpo33/openmodelica/bootstrapping/HashTableTest.mos_temp8203/equations-got2019-05-07 13:03:28.773571200 +0200
@@ -2,19 +2,28 @@
 "
 ""
 true
 ""
 true
-({record DAE.Exp.ICONST
-integer = 7
-end DAE.Exp.ICONST;,record DAE.Exp.ICONST
-integer = 3
-end DAE.Exp.ICONST;,record DAE.Exp.ICONST
-integer = 2
-end DAE.Exp.ICONST;,record DAE.Exp.ICONST
-integer = 1
-end DAE.Exp.ICONST;},{record DAE.Exp.ICONST
-integer = 2
-end DAE.Exp.ICONST;,record DAE.Exp.ICONST
-integer = 7
-end DAE.Exp.ICONST;})
-""
+
+"Error: Error building simulator. Build log: gcc -g -falign-functions -fno-ipa-pure-const -mstackrealign -msse2 -mfpmath=sse   -I"C:/dev/hudson/workspace/OM_Win/OM/build/include/omc/c" "-IC:/dev/hudson/workspace/OM_Win/OM/OMCompiler/Compiler/Util/" -c -o HashTableTest_fn.o HashTableTest_fn.c
+HashTableTest_fn.c: In function 'omc_Tpl_stringFile':
+HashTableTest_fn.c:13980:3: warning: implicit declaration of function 'omc_File_File_destructor' [-Wimplicit-function-declaration]
+omc_File_File_destructor(threadData,_file);
+^
+HashTableTest_fn.c: In function 'omc_Absyn_pathStringWork':
+HashTableTest_fn.c:38365:3: warning: implicit declaration of function 'omc_System_StringAllocator_destructor' [-Wimplicit-function-declaration]
+omc_System_StringAllocator_destructor(threadData,_sb);
+^
+gcc -g -falign-functions -fno-ipa-pure-const -mstackrealign -msse2 -mfpmath=sse   -I"C:/dev/hudson/workspace/OM_Win/OM/build/include/omc/c" "-IC:/dev/hudson/workspace/OM_Win/OM/OMCompiler/Compiler/Util/" -c -o HashTableTest_fn_records.o HashTableTest_fn_records.c
+g++ -shared -Xlinker --export-all-symbols -fPIC -o HashTableTest_fn.dll HashTableTest_fn.o HashTableTest_fn_records.o "-LC:/dev/hudson/workspace/OM_Win/OM/build/lib//omc" "-LC:/dev/hudson/workspace/OM_Win/OM/build/lib/" "-L%APPDATA%/.openmodelica/binaries/System" "-LC:/dev/hudson/workspace/OM_Win/OM/OMCompiler/Compiler/Util/Resources/Library/mingw64" "-LC:/dev/hudson/workspace/OM_Win/OM/OMCompiler/Compiler/Util/Resources/Library/win64" "-LC:/dev/hudson/workspace/OM_Win/OM/OMCompiler/Compiler/Util/Resources/Library" -lomcruntime -lintl -liconv -lexpat -lsqlite3 -llpsolve55 -ltre -lomniORB420_rt -lomnithread40_rt -lws2_32 -lRpcrt4 -lregex "-L%APPDATA%/.openmodelica/binaries/ErrorExt" "-L%APPDATA%/.openmodelica/binaries/Print" -g -falign-functions -fno-ipa-pure-const -mstackrealign -msse2 -mfpmath=sse   -I"C:/dev/hudson/workspace/OM_Win/OM/build/include/omc/c" "-IC:/dev/hudson/workspace/OM_Win/OM/OMCompiler/Compiler/Util/" -L"C:/dev/hudson/workspace/OM_Win/OM/build/lib//omc" -Wl,--stack,16777216,-rpath,'C:/dev/hudson/workspace/OM_Win/OM/build/lib//omc'  -lOpenModelicaCompiler -fopenmp -Wl,-Bstatic -lregex -ltre -lintl -liconv -lexpat -lomcgc -lpthread -loleaut32 -limagehlp -lhdf5 -lz -lszip -Wl,-Bdynamic  -lOpenModelicaRuntimeC -Wl,-Bstatic -lomcgc -lregex -ltre -lintl -liconv -lexpat -static-libgcc -luuid -loleaut32 -lole32 -limagehlp -lws2_32 -llis -lumfpack -lklu -lcolamd -lbtf -lamd  -lsundials_idas -lsundials_kinsol -lsundials_nvecserial -lipopt -lcoinmumps -lpthread -lm -lgfortranbegin -lgfortran -lquadmath -lmingw32 -lgcc_eh -lmoldname -lmingwex -lmsvcrt -luser32 -lkernel32 -ladvapi32 -lshell32 -lopenblas -lcminpack -Wl,-Bdynamic -lm
+C:/OMDev/tools/msys/mingw64/bin/../lib/gcc/x86_64-w64-mingw32/5.3.0/../../../../lib\libregex.a(systre.o):(.text+0x0): multiple definition of `regcomp'
+C:/OMDev/tools/msys/mingw64/bin/../lib/gcc/x86_64-w64-mingw32/5.3.0/../../../../lib/libregex.dll.a(d000001.o):(.text+0x0): first defined here
+C:/OMDev/tools/msys/mingw64/bin/../lib/gcc/x86_64-w64-mingw32/5.3.0/../../../../lib\libregex.a(systre.o):(.text+0x10): multiple definition of `regfree'
+C:/OMDev/tools/msys/mingw64/bin/../lib/gcc/x86_64-w64-mingw32/5.3.0/../../../../lib/libregex.dll.a(d000004.o):(.text+0x0): first defined here
+C:/OMDev/tools/msys/mingw64/bin/../lib/gcc/x86_64-w64-mingw32/5.3.0/../../../../lib\libregex.a(systre.o):(.text+0x30): multiple definition of `regexec'
+C:/OMDev/tools/msys/mingw64/bin/../lib/gcc/x86_64-w64-mingw32/5.3.0/../../../../lib/libregex.dll.a(d000003.o):(.text+0x0): first defined here
+collect2.exe: error: ld returned 1 exit status
+HashTableTest_fn.makefile:20: recipe for target 'HashTableTest_fn' failed
+make: *** [HashTableTest_fn] Error 1
+RESULT: 2
+"

Equation mismatch: omc-diff says:
Line 7: Lexical token differs:
expected: ({record DAE.Exp.ICONST
got:      


== 1 out of 1 tests failed [openmodelica/bootstrapping/HashTableTest.mos_temp8203, time: 28]

Powered by Hudson Open Source Continuous Integration Server from the Eclipse Foundation