Hudson logo

Failed

openmodelica_bootstrapping.ExpressionTest.mos (from (result.xml))

Failing for the past 3,443 builds (Since #7821 )

Stacktrace

Output mismatch (see stdout for details)

Standard Output

 + SimplifyOperator                                                                  ... equation mismatch [time: 42]

==== Log /tmp/omc-rtest-adrpo33/openmodelica/bootstrapping/ExpressionTest.mos_temp7962/log-ExpressionTest.mos
"
"
""
true
""
true

"Error: Error building simulator. Build log: gcc -g -falign-functions -fno-ipa-pure-const -mstackrealign -msse2 -mfpmath=sse   -I"C:/dev/hudson/workspace/OM_Win/OM/build/include/omc/c" "-IC:/dev/hudson/workspace/OM_Win/OM/OMCompiler/Compiler/Util/" -c -o ExpressionTest_test.o ExpressionTest_test.c
ExpressionTest_test.c: In function 'omc_Tpl_stringFile':
ExpressionTest_test.c:15069:3: warning: implicit declaration of function 'omc_File_File_destructor' [-Wimplicit-function-declaration]
   omc_File_File_destructor(threadData,_file);
   ^
ExpressionTest_test.c: In function 'omc_Absyn_pathStringWork':
ExpressionTest_test.c:39454:3: warning: implicit declaration of function 'omc_System_StringAllocator_destructor' [-Wimplicit-function-declaration]
   omc_System_StringAllocator_destructor(threadData,_sb);
   ^
gcc -g -falign-functions -fno-ipa-pure-const -mstackrealign -msse2 -mfpmath=sse   -I"C:/dev/hudson/workspace/OM_Win/OM/build/include/omc/c" "-IC:/dev/hudson/workspace/OM_Win/OM/OMCompiler/Compiler/Util/" -c -o ExpressionTest_test_records.o ExpressionTest_test_records.c
g++ -shared -Xlinker --export-all-symbols -fPIC -o ExpressionTest_test.dll ExpressionTest_test.o ExpressionTest_test_records.o "-LC:/dev/hudson/workspace/OM_Win/OM/build/lib//omc" "-LC:/dev/hudson/workspace/OM_Win/OM/build/lib/" "-L%APPDATA%/.openmodelica/binaries/ErrorExt" "-LC:/dev/hudson/workspace/OM_Win/OM/OMCompiler/Compiler/Util/Resources/Library/mingw64" "-LC:/dev/hudson/workspace/OM_Win/OM/OMCompiler/Compiler/Util/Resources/Library/win64" "-LC:/dev/hudson/workspace/OM_Win/OM/OMCompiler/Compiler/Util/Resources/Library" -lomcruntime -lintl -liconv -lexpat -lsqlite3 -llpsolve55 -ltre -lomniORB420_rt -lomnithread40_rt -lws2_32 -lRpcrt4 -lregex "-L%APPDATA%/.openmodelica/binaries/System" "-L%APPDATA%/.openmodelica/binaries/Print" -g -falign-functions -fno-ipa-pure-const -mstackrealign -msse2 -mfpmath=sse   -I"C:/dev/hudson/workspace/OM_Win/OM/build/include/omc/c" "-IC:/dev/hudson/workspace/OM_Win/OM/OMCompiler/Compiler/Util/" -L"C:/dev/hudson/workspace/OM_Win/OM/build/lib//omc" -Wl,--stack,16777216,-rpath,'C:/dev/hudson/workspace/OM_Win/OM/build/lib//omc'  -lOpenModelicaCompiler -fopenmp -Wl,-Bstatic -lregex -ltre -lintl -liconv -lexpat -lomcgc -lpthread -loleaut32 -limagehlp -lhdf5 -lz -lszip -Wl,-Bdynamic  -lOpenModelicaRuntimeC -Wl,-Bstatic -lomcgc -lregex -ltre -lintl -liconv -lexpat -static-libgcc -luuid -loleaut32 -lole32 -limagehlp -lws2_32 -llis -lumfpack -lklu -lcolamd -lbtf -lamd  -lsundials_idas -lsundials_kinsol -lsundials_nvecserial -lipopt -lcoinmumps -lpthread -lm -lgfortranbegin -lgfortran -lquadmath -lmingw32 -lgcc_eh -lmoldname -lmingwex -lmsvcrt -luser32 -lkernel32 -ladvapi32 -lshell32 -lopenblas -lcminpack -Wl,-Bdynamic -lm
C:/OMDev/tools/msys/mingw64/bin/../lib/gcc/x86_64-w64-mingw32/5.3.0/../../../../lib\libregex.a(systre.o):(.text+0x0): multiple definition of `regcomp'
C:/OMDev/tools/msys/mingw64/bin/../lib/gcc/x86_64-w64-mingw32/5.3.0/../../../../lib/libregex.dll.a(d000001.o):(.text+0x0): first defined here
C:/OMDev/tools/msys/mingw64/bin/../lib/gcc/x86_64-w64-mingw32/5.3.0/../../../../lib\libregex.a(systre.o):(.text+0x10): multiple definition of `regfree'
C:/OMDev/tools/msys/mingw64/bin/../lib/gcc/x86_64-w64-mingw32/5.3.0/../../../../lib/libregex.dll.a(d000004.o):(.text+0x0): first defined here
C:/OMDev/tools/msys/mingw64/bin/../lib/gcc/x86_64-w64-mingw32/5.3.0/../../../../lib\libregex.a(systre.o):(.text+0x30): multiple definition of `regexec'
C:/OMDev/tools/msys/mingw64/bin/../lib/gcc/x86_64-w64-mingw32/5.3.0/../../../../lib/libregex.dll.a(d000003.o):(.text+0x0): first defined here
collect2.exe: error: ld returned 1 exit status
ExpressionTest_test.makefile:20: recipe for target 'ExpressionTest_test' failed
make: *** [ExpressionTest_test] Error 1
RESULT: 2
"

Equation mismatch: diff says:
--- /tmp/omc-rtest-adrpo33/openmodelica/bootstrapping/ExpressionTest.mos_temp7962/equations-expected2019-05-07 12:53:09.797923500 +0200
+++ /tmp/omc-rtest-adrpo33/openmodelica/bootstrapping/ExpressionTest.mos_temp7962/equations-got2019-05-07 12:53:51.404506500 +0200
@@ -2,32 +2,28 @@
 "
 ""
 true
 ""
 true
-1.0 * x == x
-x * 1.0 == x
-0.0 / x == 0.0
-x * 1.0 == x
-x + (-y) == x - y
-(-y) + x == x - y
-x - (-y) == x + y
-x + (-y) * z == x - y * z
-x + (-y) / z == x - y / z
-(-y) * z + x == x - y * z
-(-y) / z + x == x - y / z
-0.0 / 0.0 == 0.0 / 0.0
-x / 1.0 == x
-x - (-y) * z == x + y * z
-x - (-y) / z == x + y / z
-x ^ 1.0 == x
-x ^ 0.0 == 1.0
-0.0 ^ 0.0 == 1.0
-0.0 ^ x == 0.0 ^ x
-(-x) ^ 4.0 == x ^ 4.0
-(x / y) ^ (-z) == (y / x) ^ z
-(x / y) ^ (-7.0) == (y / x) ^ 7.0
-(-1.0) * x + (-x) * 1.0 + 0.0 + x / 1.0 + (x / y) ^ (-7.0) == (-1.0) * x + (-x) * 1.0 + 0.0 / x + x / 1.0 + (x / y) ^ (-7.0)
-(-1.0) * x + (-x) * 1.0 + 0.0 + x / 1.0 + (x / y) ^ (-7.0) == (-1.0) * x + (-x) * 1.0 + 0.0 / x + x / 1.0 + (x / y) ^ (-7.0)
-(-1.0) * x * (-x) * 1.0 * 0.0 / x * x / 1.0 * (x / y) ^ (-7.0) == (-1.0) * x * (-x) * 1.0 * 0.0 / x * x / 1.0 * (x / y) ^ (-7.0)
 
-""
+"Error: Error building simulator. Build log: gcc -g -falign-functions -fno-ipa-pure-const -mstackrealign -msse2 -mfpmath=sse   -I"C:/dev/hudson/workspace/OM_Win/OM/build/include/omc/c" "-IC:/dev/hudson/workspace/OM_Win/OM/OMCompiler/Compiler/Util/" -c -o ExpressionTest_test.o ExpressionTest_test.c
+ExpressionTest_test.c: In function 'omc_Tpl_stringFile':
+ExpressionTest_test.c:15069:3: warning: implicit declaration of function 'omc_File_File_destructor' [-Wimplicit-function-declaration]
+omc_File_File_destructor(threadData,_file);
+^
+ExpressionTest_test.c: In function 'omc_Absyn_pathStringWork':
+ExpressionTest_test.c:39454:3: warning: implicit declaration of function 'omc_System_StringAllocator_destructor' [-Wimplicit-function-declaration]
+omc_System_StringAllocator_destructor(threadData,_sb);
+^
+gcc -g -falign-functions -fno-ipa-pure-const -mstackrealign -msse2 -mfpmath=sse   -I"C:/dev/hudson/workspace/OM_Win/OM/build/include/omc/c" "-IC:/dev/hudson/workspace/OM_Win/OM/OMCompiler/Compiler/Util/" -c -o ExpressionTest_test_records.o ExpressionTest_test_records.c
+g++ -shared -Xlinker --export-all-symbols -fPIC -o ExpressionTest_test.dll ExpressionTest_test.o ExpressionTest_test_records.o "-LC:/dev/hudson/workspace/OM_Win/OM/build/lib//omc" "-LC:/dev/hudson/workspace/OM_Win/OM/build/lib/" "-L%APPDATA%/.openmodelica/binaries/ErrorExt" "-LC:/dev/hudson/workspace/OM_Win/OM/OMCompiler/Compiler/Util/Resources/Library/mingw64" "-LC:/dev/hudson/workspace/OM_Win/OM/OMCompiler/Compiler/Util/Resources/Library/win64" "-LC:/dev/hudson/workspace/OM_Win/OM/OMCompiler/Compiler/Util/Resources/Library" -lomcruntime -lintl -liconv -lexpat -lsqlite3 -llpsolve55 -ltre -lomniORB420_rt -lomnithread40_rt -lws2_32 -lRpcrt4 -lregex "-L%APPDATA%/.openmodelica/binaries/System" "-L%APPDATA%/.openmodelica/binaries/Print" -g -falign-functions -fno-ipa-pure-const -mstackrealign -msse2 -mfpmath=sse   -I"C:/dev/hudson/workspace/OM_Win/OM/build/include/omc/c" "-IC:/dev/hudson/workspace/OM_Win/OM/OMCompiler/Compiler/Util/" -L"C:/dev/hudson/workspace/OM_Win/OM/build/lib//omc" -Wl,--stack,16777216,-rpath,'C:/dev/hudson/workspace/OM_Win/OM/build/lib//omc'  -lOpenModelicaCompiler -fopenmp -Wl,-Bstatic -lregex -ltre -lintl -liconv -lexpat -lomcgc -lpthread -loleaut32 -limagehlp -lhdf5 -lz -lszip -Wl,-Bdynamic  -lOpenModelicaRuntimeC -Wl,-Bstatic -lomcgc -lregex -ltre -lintl -liconv -lexpat -static-libgcc -luuid -loleaut32 -lole32 -limagehlp -lws2_32 -llis -lumfpack -lklu -lcolamd -lbtf -lamd  -lsundials_idas -lsundials_kinsol -lsundials_nvecserial -lipopt -lcoinmumps -lpthread -lm -lgfortranbegin -lgfortran -lquadmath -lmingw32 -lgcc_eh -lmoldname -lmingwex -lmsvcrt -luser32 -lkernel32 -ladvapi32 -lshell32 -lopenblas -lcminpack -Wl,-Bdynamic -lm
+C:/OMDev/tools/msys/mingw64/bin/../lib/gcc/x86_64-w64-mingw32/5.3.0/../../../../lib\libregex.a(systre.o):(.text+0x0): multiple definition of `regcomp'
+C:/OMDev/tools/msys/mingw64/bin/../lib/gcc/x86_64-w64-mingw32/5.3.0/../../../../lib/libregex.dll.a(d000001.o):(.text+0x0): first defined here
+C:/OMDev/tools/msys/mingw64/bin/../lib/gcc/x86_64-w64-mingw32/5.3.0/../../../../lib\libregex.a(systre.o):(.text+0x10): multiple definition of `regfree'
+C:/OMDev/tools/msys/mingw64/bin/../lib/gcc/x86_64-w64-mingw32/5.3.0/../../../../lib/libregex.dll.a(d000004.o):(.text+0x0): first defined here
+C:/OMDev/tools/msys/mingw64/bin/../lib/gcc/x86_64-w64-mingw32/5.3.0/../../../../lib\libregex.a(systre.o):(.text+0x30): multiple definition of `regexec'
+C:/OMDev/tools/msys/mingw64/bin/../lib/gcc/x86_64-w64-mingw32/5.3.0/../../../../lib/libregex.dll.a(d000003.o):(.text+0x0): first defined here
+collect2.exe: error: ld returned 1 exit status
+ExpressionTest_test.makefile:20: recipe for target 'ExpressionTest_test' failed
+make: *** [ExpressionTest_test] Error 1
+RESULT: 2
+"

Equation mismatch: omc-diff says:
Line 7: Lexical token differs:
expected: 1.0
got:      


== 1 out of 1 tests failed [openmodelica/bootstrapping/ExpressionTest.mos_temp7962, time: 42]

Powered by Hudson Open Source Continuous Integration Server from the Eclipse Foundation