Hudson logo

Failed

openmodelica_bootstrapping.DumpTest.mos (from (result.xml))

Failing for the past 3,443 builds (Since #7821 )

Stacktrace

Output mismatch (see stdout for details)

Standard Output

 + DumpTest                                                                          ... equation mismatch [time: 130]

==== Log /tmp/omc-rtest-adrpo33/openmodelica/bootstrapping/DumpTest.mos_temp3182/log-DumpTest.mos
"
"
""
true
""
true
true
"DumpGraphviz.dump"

"Error: Error building simulator. Build log: gcc -g -falign-functions -fno-ipa-pure-const -mstackrealign -msse2 -mfpmath=sse   -I"C:/dev/hudson/workspace/OM_Win/OM/build/include/omc/c" "-IC:/dev/hudson/workspace/OM_Win/OM/OMCompiler/Compiler/Util/" -c -o DumpGraphviz_dump.o DumpGraphviz_dump.c
DumpGraphviz_dump.c: In function 'omc_Tpl_tokFileText':
DumpGraphviz_dump.c:13193:3: warning: implicit declaration of function 'omc_File_File_destructor' [-Wimplicit-function-declaration]
   omc_File_File_destructor(threadData,_file);
   ^
DumpGraphviz_dump.c: In function 'omc_Absyn_pathStringWork':
DumpGraphviz_dump.c:32555:3: warning: implicit declaration of function 'omc_System_StringAllocator_destructor' [-Wimplicit-function-declaration]
   omc_System_StringAllocator_destructor(threadData,_sb);
   ^
gcc -g -falign-functions -fno-ipa-pure-const -mstackrealign -msse2 -mfpmath=sse   -I"C:/dev/hudson/workspace/OM_Win/OM/build/include/omc/c" "-IC:/dev/hudson/workspace/OM_Win/OM/OMCompiler/Compiler/Util/" -c -o DumpGraphviz_dump_records.o DumpGraphviz_dump_records.c
g++ -shared -Xlinker --export-all-symbols -fPIC -o DumpGraphviz_dump.dll DumpGraphviz_dump.o DumpGraphviz_dump_records.o "-LC:/dev/hudson/workspace/OM_Win/OM/build/lib//omc" "-LC:/dev/hudson/workspace/OM_Win/OM/build/lib/" "-L%APPDATA%/.openmodelica/binaries/System" "-LC:/dev/hudson/workspace/OM_Win/OM/OMCompiler/Compiler/Util/Resources/Library/mingw64" "-LC:/dev/hudson/workspace/OM_Win/OM/OMCompiler/Compiler/Util/Resources/Library/win64" "-LC:/dev/hudson/workspace/OM_Win/OM/OMCompiler/Compiler/Util/Resources/Library" -lomcruntime -lintl -liconv -lexpat -lsqlite3 -llpsolve55 -ltre -lomniORB420_rt -lomnithread40_rt -lws2_32 -lRpcrt4 -lregex "-L%APPDATA%/.openmodelica/binaries/ErrorExt" "-L%APPDATA%/.openmodelica/binaries/Print" -g -falign-functions -fno-ipa-pure-const -mstackrealign -msse2 -mfpmath=sse   -I"C:/dev/hudson/workspace/OM_Win/OM/build/include/omc/c" "-IC:/dev/hudson/workspace/OM_Win/OM/OMCompiler/Compiler/Util/" -L"C:/dev/hudson/workspace/OM_Win/OM/build/lib//omc" -Wl,--stack,16777216,-rpath,'C:/dev/hudson/workspace/OM_Win/OM/build/lib//omc'  -lOpenModelicaCompiler -fopenmp -Wl,-Bstatic -lregex -ltre -lintl -liconv -lexpat -lomcgc -lpthread -loleaut32 -limagehlp -lhdf5 -lz -lszip -Wl,-Bdynamic  -lOpenModelicaRuntimeC -Wl,-Bstatic -lomcgc -lregex -ltre -lintl -liconv -lexpat -static-libgcc -luuid -loleaut32 -lole32 -limagehlp -lws2_32 -llis -lumfpack -lklu -lcolamd -lbtf -lamd  -lsundials_idas -lsundials_kinsol -lsundials_nvecserial -lipopt -lcoinmumps -lpthread -lm -lgfortranbegin -lgfortran -lquadmath -lmingw32 -lgcc_eh -lmoldname -lmingwex -lmsvcrt -luser32 -lkernel32 -ladvapi32 -lshell32 -lopenblas -lcminpack -Wl,-Bdynamic -lm
C:/OMDev/tools/msys/mingw64/bin/../lib/gcc/x86_64-w64-mingw32/5.3.0/../../../../lib\libregex.a(systre.o):(.text+0x0): multiple definition of `regcomp'
C:/OMDev/tools/msys/mingw64/bin/../lib/gcc/x86_64-w64-mingw32/5.3.0/../../../../lib/libregex.dll.a(d000001.o):(.text+0x0): first defined here
C:/OMDev/tools/msys/mingw64/bin/../lib/gcc/x86_64-w64-mingw32/5.3.0/../../../../lib\libregex.a(systre.o):(.text+0x10): multiple definition of `regfree'
C:/OMDev/tools/msys/mingw64/bin/../lib/gcc/x86_64-w64-mingw32/5.3.0/../../../../lib/libregex.dll.a(d000004.o):(.text+0x0): first defined here
C:/OMDev/tools/msys/mingw64/bin/../lib/gcc/x86_64-w64-mingw32/5.3.0/../../../../lib\libregex.a(systre.o):(.text+0x30): multiple definition of `regexec'
C:/OMDev/tools/msys/mingw64/bin/../lib/gcc/x86_64-w64-mingw32/5.3.0/../../../../lib/libregex.dll.a(d000003.o):(.text+0x0): first defined here
collect2.exe: error: ld returned 1 exit status
DumpGraphviz_dump.makefile:20: recipe for target 'DumpGraphviz_dump' failed
make: *** [DumpGraphviz_dump] Error 1
RESULT: 2
"
"Dump.dump"

"Error: Error building simulator. Build log: gcc -g -falign-functions -fno-ipa-pure-const -mstackrealign -msse2 -mfpmath=sse   -I"C:/dev/hudson/workspace/OM_Win/OM/build/include/omc/c" "-IC:/dev/hudson/workspace/OM_Win/OM/OMCompiler/Compiler/Util/" -c -o DumpTest_dump.o DumpTest_dump.c
DumpTest_dump.c: In function 'omc_Absyn_pathStringWork':
DumpTest_dump.c:9957:3: warning: implicit declaration of function 'omc_System_StringAllocator_destructor' [-Wimplicit-function-declaration]
   omc_System_StringAllocator_destructor(threadData,_sb);
   ^
DumpTest_dump.c: In function 'omc_Tpl_tokFileText':
DumpTest_dump.c:15340:3: warning: implicit declaration of function 'omc_File_File_destructor' [-Wimplicit-function-declaration]
   omc_File_File_destructor(threadData,_file);
   ^
gcc -g -falign-functions -fno-ipa-pure-const -mstackrealign -msse2 -mfpmath=sse   -I"C:/dev/hudson/workspace/OM_Win/OM/build/include/omc/c" "-IC:/dev/hudson/workspace/OM_Win/OM/OMCompiler/Compiler/Util/" -c -o DumpTest_dump_records.o DumpTest_dump_records.c
g++ -shared -Xlinker --export-all-symbols -fPIC -o DumpTest_dump.dll DumpTest_dump.o DumpTest_dump_records.o "-LC:/dev/hudson/workspace/OM_Win/OM/build/lib//omc" "-LC:/dev/hudson/workspace/OM_Win/OM/build/lib/" "-L%APPDATA%/.openmodelica/binaries/Print" "-LC:/dev/hudson/workspace/OM_Win/OM/OMCompiler/Compiler/Util/Resources/Library/mingw64" "-LC:/dev/hudson/workspace/OM_Win/OM/OMCompiler/Compiler/Util/Resources/Library/win64" "-LC:/dev/hudson/workspace/OM_Win/OM/OMCompiler/Compiler/Util/Resources/Library" -lomcruntime -lintl -liconv -lexpat -lsqlite3 -llpsolve55 -ltre -lomniORB420_rt -lomnithread40_rt -lws2_32 -lRpcrt4 -lregex "-L%APPDATA%/.openmodelica/binaries/System" "-L%APPDATA%/.openmodelica/binaries/ErrorExt" -g -falign-functions -fno-ipa-pure-const -mstackrealign -msse2 -mfpmath=sse   -I"C:/dev/hudson/workspace/OM_Win/OM/build/include/omc/c" "-IC:/dev/hudson/workspace/OM_Win/OM/OMCompiler/Compiler/Util/" -L"C:/dev/hudson/workspace/OM_Win/OM/build/lib//omc" -Wl,--stack,16777216,-rpath,'C:/dev/hudson/workspace/OM_Win/OM/build/lib//omc'  -lOpenModelicaCompiler -fopenmp -Wl,-Bstatic -lregex -ltre -lintl -liconv -lexpat -lomcgc -lpthread -loleaut32 -limagehlp -lhdf5 -lz -lszip -Wl,-Bdynamic  -lOpenModelicaRuntimeC -Wl,-Bstatic -lomcgc -lregex -ltre -lintl -liconv -lexpat -static-libgcc -luuid -loleaut32 -lole32 -limagehlp -lws2_32 -llis -lumfpack -lklu -lcolamd -lbtf -lamd  -lsundials_idas -lsundials_kinsol -lsundials_nvecserial -lipopt -lcoinmumps -lpthread -lm -lgfortranbegin -lgfortran -lquadmath -lmingw32 -lgcc_eh -lmoldname -lmingwex -lmsvcrt -luser32 -lkernel32 -ladvapi32 -lshell32 -lopenblas -lcminpack -Wl,-Bdynamic -lm
C:/OMDev/tools/msys/mingw64/bin/../lib/gcc/x86_64-w64-mingw32/5.3.0/../../../../lib\libregex.a(systre.o):(.text+0x0): multiple definition of `regcomp'
C:/OMDev/tools/msys/mingw64/bin/../lib/gcc/x86_64-w64-mingw32/5.3.0/../../../../lib/libregex.dll.a(d000001.o):(.text+0x0): first defined here
C:/OMDev/tools/msys/mingw64/bin/../lib/gcc/x86_64-w64-mingw32/5.3.0/../../../../lib\libregex.a(systre.o):(.text+0x10): multiple definition of `regfree'
C:/OMDev/tools/msys/mingw64/bin/../lib/gcc/x86_64-w64-mingw32/5.3.0/../../../../lib/libregex.dll.a(d000004.o):(.text+0x0): first defined here
C:/OMDev/tools/msys/mingw64/bin/../lib/gcc/x86_64-w64-mingw32/5.3.0/../../../../lib\libregex.a(systre.o):(.text+0x30): multiple definition of `regexec'
C:/OMDev/tools/msys/mingw64/bin/../lib/gcc/x86_64-w64-mingw32/5.3.0/../../../../lib/libregex.dll.a(d000003.o):(.text+0x0): first defined here
collect2.exe: error: ld returned 1 exit status
DumpTest_dump.makefile:20: recipe for target 'DumpTest_dump' failed
make: *** [DumpTest_dump] Error 1
RESULT: 2
"
"Dump.unparseStr"

"Error: Error building simulator. Build log: gcc -g -falign-functions -fno-ipa-pure-const -mstackrealign -msse2 -mfpmath=sse   -I"C:/dev/hudson/workspace/OM_Win/OM/build/include/omc/c" "-IC:/dev/hudson/workspace/OM_Win/OM/OMCompiler/Compiler/Util/" -c -o Dump_unparseStr.o Dump_unparseStr.c
Dump_unparseStr.c: In function 'omc_Tpl_tokFileText':
Dump_unparseStr.c:10983:3: warning: implicit declaration of function 'omc_File_File_destructor' [-Wimplicit-function-declaration]
   omc_File_File_destructor(threadData,_file);
   ^
gcc -g -falign-functions -fno-ipa-pure-const -mstackrealign -msse2 -mfpmath=sse   -I"C:/dev/hudson/workspace/OM_Win/OM/build/include/omc/c" "-IC:/dev/hudson/workspace/OM_Win/OM/OMCompiler/Compiler/Util/" -c -o Dump_unparseStr_records.o Dump_unparseStr_records.c
g++ -shared -Xlinker --export-all-symbols -fPIC -o Dump_unparseStr.dll Dump_unparseStr.o Dump_unparseStr_records.o "-LC:/dev/hudson/workspace/OM_Win/OM/build/lib//omc" "-LC:/dev/hudson/workspace/OM_Win/OM/build/lib/" "-L%APPDATA%/.openmodelica/binaries/System" "-LC:/dev/hudson/workspace/OM_Win/OM/OMCompiler/Compiler/Util/Resources/Library/mingw64" "-LC:/dev/hudson/workspace/OM_Win/OM/OMCompiler/Compiler/Util/Resources/Library/win64" "-LC:/dev/hudson/workspace/OM_Win/OM/OMCompiler/Compiler/Util/Resources/Library" -lomcruntime -lintl -liconv -lexpat -lsqlite3 -llpsolve55 -ltre -lomniORB420_rt -lomnithread40_rt -lws2_32 -lRpcrt4 -lregex "-L%APPDATA%/.openmodelica/binaries/ErrorExt" "-L%APPDATA%/.openmodelica/binaries/Print" -g -falign-functions -fno-ipa-pure-const -mstackrealign -msse2 -mfpmath=sse   -I"C:/dev/hudson/workspace/OM_Win/OM/build/include/omc/c" "-IC:/dev/hudson/workspace/OM_Win/OM/OMCompiler/Compiler/Util/" -L"C:/dev/hudson/workspace/OM_Win/OM/build/lib//omc" -Wl,--stack,16777216,-rpath,'C:/dev/hudson/workspace/OM_Win/OM/build/lib//omc'  -lOpenModelicaCompiler -fopenmp -Wl,-Bstatic -lregex -ltre -lintl -liconv -lexpat -lomcgc -lpthread -loleaut32 -limagehlp -lhdf5 -lz -lszip -Wl,-Bdynamic  -lOpenModelicaRuntimeC -Wl,-Bstatic -lomcgc -lregex -ltre -lintl -liconv -lexpat -static-libgcc -luuid -loleaut32 -lole32 -limagehlp -lws2_32 -llis -lumfpack -lklu -lcolamd -lbtf -lamd  -lsundials_idas -lsundials_kinsol -lsundials_nvecserial -lipopt -lcoinmumps -lpthread -lm -lgfortranbegin -lgfortran -lquadmath -lmingw32 -lgcc_eh -lmoldname -lmingwex -lmsvcrt -luser32 -lkernel32 -ladvapi32 -lshell32 -lopenblas -lcminpack -Wl,-Bdynamic -lm
C:/OMDev/tools/msys/mingw64/bin/../lib/gcc/x86_64-w64-mingw32/5.3.0/../../../../lib\libregex.a(systre.o):(.text+0x0): multiple definition of `regcomp'
C:/OMDev/tools/msys/mingw64/bin/../lib/gcc/x86_64-w64-mingw32/5.3.0/../../../../lib/libregex.dll.a(d000001.o):(.text+0x0): first defined here
C:/OMDev/tools/msys/mingw64/bin/../lib/gcc/x86_64-w64-mingw32/5.3.0/../../../../lib\libregex.a(systre.o):(.text+0x10): multiple definition of `regfree'
C:/OMDev/tools/msys/mingw64/bin/../lib/gcc/x86_64-w64-mingw32/5.3.0/../../../../lib/libregex.dll.a(d000004.o):(.text+0x0): first defined here
C:/OMDev/tools/msys/mingw64/bin/../lib/gcc/x86_64-w64-mingw32/5.3.0/../../../../lib\libregex.a(systre.o):(.text+0x30): multiple definition of `regexec'
C:/OMDev/tools/msys/mingw64/bin/../lib/gcc/x86_64-w64-mingw32/5.3.0/../../../../lib/libregex.dll.a(d000003.o):(.text+0x0): first defined here
collect2.exe: error: ld returned 1 exit status
Dump_unparseStr.makefile:20: recipe for target 'Dump_unparseStr' failed
make: *** [Dump_unparseStr] Error 1
RESULT: 2
"
"Dump.getAstAsCorbaString"

"Error: Error building simulator. Build log: gcc -g -falign-functions -fno-ipa-pure-const -mstackrealign -msse2 -mfpmath=sse   -I"C:/dev/hudson/workspace/OM_Win/OM/build/include/omc/c"  -c -o DumpTest_getAstAsCorbaString.o DumpTest_getAstAsCorbaString.c
gcc -g -falign-functions -fno-ipa-pure-const -mstackrealign -msse2 -mfpmath=sse   -I"C:/dev/hudson/workspace/OM_Win/OM/build/include/omc/c"  -c -o DumpTest_getAstAsCorbaString_records.o DumpTest_getAstAsCorbaString_records.c
g++ -shared -Xlinker --export-all-symbols -fPIC -o DumpTest_getAstAsCorbaString.dll DumpTest_getAstAsCorbaString.o DumpTest_getAstAsCorbaString_records.o "-LC:/dev/hudson/workspace/OM_Win/OM/build/lib//omc" "-LC:/dev/hudson/workspace/OM_Win/OM/build/lib/" "-L%APPDATA%/.openmodelica/binaries/System" "-LC:/dev/hudson/workspace/OM_Win/OM/OMCompiler/Compiler/Util/Resources/Library/mingw64" "-LC:/dev/hudson/workspace/OM_Win/OM/OMCompiler/Compiler/Util/Resources/Library/win64" "-LC:/dev/hudson/workspace/OM_Win/OM/OMCompiler/Compiler/Util/Resources/Library" -lomcruntime -lintl -liconv -lexpat -lsqlite3 -llpsolve55 -ltre -lomniORB420_rt -lomnithread40_rt -lws2_32 -lRpcrt4 -lregex "-L%APPDATA%/.openmodelica/binaries/ErrorExt" "-L%APPDATA%/.openmodelica/binaries/Print" -g -falign-functions -fno-ipa-pure-const -mstackrealign -msse2 -mfpmath=sse   -I"C:/dev/hudson/workspace/OM_Win/OM/build/include/omc/c"  -L"C:/dev/hudson/workspace/OM_Win/OM/build/lib//omc" -Wl,--stack,16777216,-rpath,'C:/dev/hudson/workspace/OM_Win/OM/build/lib//omc'  -lOpenModelicaCompiler -fopenmp -Wl,-Bstatic -lregex -ltre -lintl -liconv -lexpat -lomcgc -lpthread -loleaut32 -limagehlp -lhdf5 -lz -lszip -Wl,-Bdynamic  -lOpenModelicaRuntimeC -Wl,-Bstatic -lomcgc -lregex -ltre -lintl -liconv -lexpat -static-libgcc -luuid -loleaut32 -lole32 -limagehlp -lws2_32 -llis -lumfpack -lklu -lcolamd -lbtf -lamd  -lsundials_idas -lsundials_kinsol -lsundials_nvecserial -lipopt -lcoinmumps -lpthread -lm -lgfortranbegin -lgfortran -lquadmath -lmingw32 -lgcc_eh -lmoldname -lmingwex -lmsvcrt -luser32 -lkernel32 -ladvapi32 -lshell32 -lopenblas -lcminpack -Wl,-Bdynamic -lm
C:/OMDev/tools/msys/mingw64/bin/../lib/gcc/x86_64-w64-mingw32/5.3.0/../../../../lib\libregex.a(systre.o):(.text+0x0): multiple definition of `regcomp'
C:/OMDev/tools/msys/mingw64/bin/../lib/gcc/x86_64-w64-mingw32/5.3.0/../../../../lib/libregex.dll.a(d000001.o):(.text+0x0): first defined here
C:/OMDev/tools/msys/mingw64/bin/../lib/gcc/x86_64-w64-mingw32/5.3.0/../../../../lib\libregex.a(systre.o):(.text+0x10): multiple definition of `regfree'
C:/OMDev/tools/msys/mingw64/bin/../lib/gcc/x86_64-w64-mingw32/5.3.0/../../../../lib/libregex.dll.a(d000004.o):(.text+0x0): first defined here
C:/OMDev/tools/msys/mingw64/bin/../lib/gcc/x86_64-w64-mingw32/5.3.0/../../../../lib\libregex.a(systre.o):(.text+0x30): multiple definition of `regexec'
C:/OMDev/tools/msys/mingw64/bin/../lib/gcc/x86_64-w64-mingw32/5.3.0/../../../../lib/libregex.dll.a(d000003.o):(.text+0x0): first defined here
collect2.exe: error: ld returned 1 exit status
DumpTest_getAstAsCorbaString.makefile:20: recipe for target 'DumpTest_getAstAsCorbaString' failed
make: *** [DumpTest_getAstAsCorbaString] Error 1
RESULT: 2
"
record DAE.Exp.ICONST
    integer = 42
end DAE.Exp.ICONST;
""
"ExpressionDump.printExpStr"

"Error: Error building simulator. Build log: gcc -g -falign-functions -fno-ipa-pure-const -mstackrealign -msse2 -mfpmath=sse   -I"C:/dev/hudson/workspace/OM_Win/OM/build/include/omc/c" "-IC:/dev/hudson/workspace/OM_Win/OM/OMCompiler/Compiler/Util/" -c -o ExpressionDump_printExpStr.o ExpressionDump_printExpStr.c
ExpressionDump_printExpStr.c: In function 'omc_Tpl_stringFile':
ExpressionDump_printExpStr.c:13259:3: warning: implicit declaration of function 'omc_File_File_destructor' [-Wimplicit-function-declaration]
   omc_File_File_destructor(threadData,_file);
   ^
ExpressionDump_printExpStr.c: In function 'omc_Absyn_pathStringWork':
ExpressionDump_printExpStr.c:37644:3: warning: implicit declaration of function 'omc_System_StringAllocator_destructor' [-Wimplicit-function-declaration]
   omc_System_StringAllocator_destructor(threadData,_sb);
   ^
gcc -g -falign-functions -fno-ipa-pure-const -mstackrealign -msse2 -mfpmath=sse   -I"C:/dev/hudson/workspace/OM_Win/OM/build/include/omc/c" "-IC:/dev/hudson/workspace/OM_Win/OM/OMCompiler/Compiler/Util/" -c -o ExpressionDump_printExpStr_records.o ExpressionDump_printExpStr_records.c
g++ -shared -Xlinker --export-all-symbols -fPIC -o ExpressionDump_printExpStr.dll ExpressionDump_printExpStr.o ExpressionDump_printExpStr_records.o "-LC:/dev/hudson/workspace/OM_Win/OM/build/lib//omc" "-LC:/dev/hudson/workspace/OM_Win/OM/build/lib/" "-L%APPDATA%/.openmodelica/binaries/System" "-LC:/dev/hudson/workspace/OM_Win/OM/OMCompiler/Compiler/Util/Resources/Library/mingw64" "-LC:/dev/hudson/workspace/OM_Win/OM/OMCompiler/Compiler/Util/Resources/Library/win64" "-LC:/dev/hudson/workspace/OM_Win/OM/OMCompiler/Compiler/Util/Resources/Library" -lomcruntime -lintl -liconv -lexpat -lsqlite3 -llpsolve55 -ltre -lomniORB420_rt -lomnithread40_rt -lws2_32 -lRpcrt4 -lregex "-L%APPDATA%/.openmodelica/binaries/ErrorExt" "-L%APPDATA%/.openmodelica/binaries/Print" -g -falign-functions -fno-ipa-pure-const -mstackrealign -msse2 -mfpmath=sse   -I"C:/dev/hudson/workspace/OM_Win/OM/build/include/omc/c" "-IC:/dev/hudson/workspace/OM_Win/OM/OMCompiler/Compiler/Util/" -L"C:/dev/hudson/workspace/OM_Win/OM/build/lib//omc" -Wl,--stack,16777216,-rpath,'C:/dev/hudson/workspace/OM_Win/OM/build/lib//omc'  -lOpenModelicaCompiler -fopenmp -Wl,-Bstatic -lregex -ltre -lintl -liconv -lexpat -lomcgc -lpthread -loleaut32 -limagehlp -lhdf5 -lz -lszip -Wl,-Bdynamic  -lOpenModelicaRuntimeC -Wl,-Bstatic -lomcgc -lregex -ltre -lintl -liconv -lexpat -static-libgcc -luuid -loleaut32 -lole32 -limagehlp -lws2_32 -llis -lumfpack -lklu -lcolamd -lbtf -lamd  -lsundials_idas -lsundials_kinsol -lsundials_nvecserial -lipopt -lcoinmumps -lpthread -lm -lgfortranbegin -lgfortran -lquadmath -lmingw32 -lgcc_eh -lmoldname -lmingwex -lmsvcrt -luser32 -lkernel32 -ladvapi32 -lshell32 -lopenblas -lcminpack -Wl,-Bdynamic -lm
C:/OMDev/tools/msys/mingw64/bin/../lib/gcc/x86_64-w64-mingw32/5.3.0/../../../../lib\libregex.a(systre.o):(.text+0x0): multiple definition of `regcomp'
C:/OMDev/tools/msys/mingw64/bin/../lib/gcc/x86_64-w64-mingw32/5.3.0/../../../../lib/libregex.dll.a(d000001.o):(.text+0x0): first defined here
C:/OMDev/tools/msys/mingw64/bin/../lib/gcc/x86_64-w64-mingw32/5.3.0/../../../../lib\libregex.a(systre.o):(.text+0x10): multiple definition of `regfree'
C:/OMDev/tools/msys/mingw64/bin/../lib/gcc/x86_64-w64-mingw32/5.3.0/../../../../lib/libregex.dll.a(d000004.o):(.text+0x0): first defined here
C:/OMDev/tools/msys/mingw64/bin/../lib/gcc/x86_64-w64-mingw32/5.3.0/../../../../lib\libregex.a(systre.o):(.text+0x30): multiple definition of `regexec'
C:/OMDev/tools/msys/mingw64/bin/../lib/gcc/x86_64-w64-mingw32/5.3.0/../../../../lib/libregex.dll.a(d000003.o):(.text+0x0): first defined here
collect2.exe: error: ld returned 1 exit status
ExpressionDump_printExpStr.makefile:20: recipe for target 'ExpressionDump_printExpStr' failed
make: *** [ExpressionDump_printExpStr] Error 1
RESULT: 2
"
record DAE.DAElist.DAE
    elementLst = {}
end DAE.DAElist.DAE;
""
"DAEDump.dumpDebugDAE"

"Error: Error building simulator. Build log: gcc -g -falign-functions -fno-ipa-pure-const -mstackrealign -msse2 -mfpmath=sse   -I"C:/dev/hudson/workspace/OM_Win/OM/build/include/omc/c" "-IC:/dev/hudson/workspace/OM_Win/OM/OMCompiler/Compiler/Util/" -c -o DAEDump_dumpDebugDAE.o DAEDump_dumpDebugDAE.c
DAEDump_dumpDebugDAE.c: In function 'omc_Tpl_stringFile':
DAEDump_dumpDebugDAE.c:14886:3: warning: implicit declaration of function 'omc_File_File_destructor' [-Wimplicit-function-declaration]
   omc_File_File_destructor(threadData,_file);
   ^
DAEDump_dumpDebugDAE.c: In function 'omc_Absyn_pathStringWork':
DAEDump_dumpDebugDAE.c:39375:3: warning: implicit declaration of function 'omc_System_StringAllocator_destructor' [-Wimplicit-function-declaration]
   omc_System_StringAllocator_destructor(threadData,_sb);
   ^
gcc -g -falign-functions -fno-ipa-pure-const -mstackrealign -msse2 -mfpmath=sse   -I"C:/dev/hudson/workspace/OM_Win/OM/build/include/omc/c" "-IC:/dev/hudson/workspace/OM_Win/OM/OMCompiler/Compiler/Util/" -c -o DAEDump_dumpDebugDAE_records.o DAEDump_dumpDebugDAE_records.c
g++ -shared -Xlinker --export-all-symbols -fPIC -o DAEDump_dumpDebugDAE.dll DAEDump_dumpDebugDAE.o DAEDump_dumpDebugDAE_records.o "-LC:/dev/hudson/workspace/OM_Win/OM/build/lib//omc" "-LC:/dev/hudson/workspace/OM_Win/OM/build/lib/" "-L%APPDATA%/.openmodelica/binaries/Print" "-LC:/dev/hudson/workspace/OM_Win/OM/OMCompiler/Compiler/Util/Resources/Library/mingw64" "-LC:/dev/hudson/workspace/OM_Win/OM/OMCompiler/Compiler/Util/Resources/Library/win64" "-LC:/dev/hudson/workspace/OM_Win/OM/OMCompiler/Compiler/Util/Resources/Library" -lomcruntime -lintl -liconv -lexpat -lsqlite3 -llpsolve55 -ltre -lomniORB420_rt -lomnithread40_rt -lws2_32 -lRpcrt4 -lregex "-L%APPDATA%/.openmodelica/binaries/System" "-L%APPDATA%/.openmodelica/binaries/ErrorExt" -g -falign-functions -fno-ipa-pure-const -mstackrealign -msse2 -mfpmath=sse   -I"C:/dev/hudson/workspace/OM_Win/OM/build/include/omc/c" "-IC:/dev/hudson/workspace/OM_Win/OM/OMCompiler/Compiler/Util/" -L"C:/dev/hudson/workspace/OM_Win/OM/build/lib//omc" -Wl,--stack,16777216,-rpath,'C:/dev/hudson/workspace/OM_Win/OM/build/lib//omc'  -lOpenModelicaCompiler -fopenmp -Wl,-Bstatic -lregex -ltre -lintl -liconv -lexpat -lomcgc -lpthread -loleaut32 -limagehlp -lhdf5 -lz -lszip -Wl,-Bdynamic  -lOpenModelicaRuntimeC -Wl,-Bstatic -lomcgc -lregex -ltre -lintl -liconv -lexpat -static-libgcc -luuid -loleaut32 -lole32 -limagehlp -lws2_32 -llis -lumfpack -lklu -lcolamd -lbtf -lamd  -lsundials_idas -lsundials_kinsol -lsundials_nvecserial -lipopt -lcoinmumps -lpthread -lm -lgfortranbegin -lgfortran -lquadmath -lmingw32 -lgcc_eh -lmoldname -lmingwex -lmsvcrt -luser32 -lkernel32 -ladvapi32 -lshell32 -lopenblas -lcminpack -Wl,-Bdynamic -lm
C:/OMDev/tools/msys/mingw64/bin/../lib/gcc/x86_64-w64-mingw32/5.3.0/../../../../lib\libregex.a(systre.o):(.text+0x0): multiple definition of `regcomp'
C:/OMDev/tools/msys/mingw64/bin/../lib/gcc/x86_64-w64-mingw32/5.3.0/../../../../lib/libregex.dll.a(d000001.o):(.text+0x0): first defined here
C:/OMDev/tools/msys/mingw64/bin/../lib/gcc/x86_64-w64-mingw32/5.3.0/../../../../lib\libregex.a(systre.o):(.text+0x10): multiple definition of `regfree'
C:/OMDev/tools/msys/mingw64/bin/../lib/gcc/x86_64-w64-mingw32/5.3.0/../../../../lib/libregex.dll.a(d000004.o):(.text+0x0): first defined here
C:/OMDev/tools/msys/mingw64/bin/../lib/gcc/x86_64-w64-mingw32/5.3.0/../../../../lib\libregex.a(systre.o):(.text+0x30): multiple definition of `regexec'
C:/OMDev/tools/msys/mingw64/bin/../lib/gcc/x86_64-w64-mingw32/5.3.0/../../../../lib/libregex.dll.a(d000003.o):(.text+0x0): first defined here
collect2.exe: error: ld returned 1 exit status
DAEDump_dumpDebugDAE.makefile:20: recipe for target 'DAEDump_dumpDebugDAE' failed
make: *** [DAEDump_dumpDebugDAE] Error 1
RESULT: 2
"
record Values.Value.INTEGER
    integer = 42
end Values.Value.INTEGER;
""
"ValuesUtil.valString"

"Error: Error building simulator. Build log: gcc -g -falign-functions -fno-ipa-pure-const -mstackrealign -msse2 -mfpmath=sse   -I"C:/dev/hudson/workspace/OM_Win/OM/build/include/omc/c" "-IC:/dev/hudson/workspace/OM_Win/OM/OMCompiler/Compiler/Util/" -c -o ValuesUtil_valString.o ValuesUtil_valString.c
ValuesUtil_valString.c: In function 'omc_Absyn_pathStringWork':
ValuesUtil_valString.c:9206:3: warning: implicit declaration of function 'omc_System_StringAllocator_destructor' [-Wimplicit-function-declaration]
   omc_System_StringAllocator_destructor(threadData,_sb);
   ^
ValuesUtil_valString.c: In function 'omc_Tpl_tokFileText':
ValuesUtil_valString.c:12218:3: warning: implicit declaration of function 'omc_File_File_destructor' [-Wimplicit-function-declaration]
   omc_File_File_destructor(threadData,_file);
   ^
gcc -g -falign-functions -fno-ipa-pure-const -mstackrealign -msse2 -mfpmath=sse   -I"C:/dev/hudson/workspace/OM_Win/OM/build/include/omc/c" "-IC:/dev/hudson/workspace/OM_Win/OM/OMCompiler/Compiler/Util/" -c -o ValuesUtil_valString_records.o ValuesUtil_valString_records.c
g++ -shared -Xlinker --export-all-symbols -fPIC -o ValuesUtil_valString.dll ValuesUtil_valString.o ValuesUtil_valString_records.o "-LC:/dev/hudson/workspace/OM_Win/OM/build/lib//omc" "-LC:/dev/hudson/workspace/OM_Win/OM/build/lib/" "-L%APPDATA%/.openmodelica/binaries/System" "-LC:/dev/hudson/workspace/OM_Win/OM/OMCompiler/Compiler/Util/Resources/Library/mingw64" "-LC:/dev/hudson/workspace/OM_Win/OM/OMCompiler/Compiler/Util/Resources/Library/win64" "-LC:/dev/hudson/workspace/OM_Win/OM/OMCompiler/Compiler/Util/Resources/Library" -lomcruntime -lintl -liconv -lexpat -lsqlite3 -llpsolve55 -ltre -lomniORB420_rt -lomnithread40_rt -lws2_32 -lRpcrt4 -lregex "-L%APPDATA%/.openmodelica/binaries/ErrorExt" "-L%APPDATA%/.openmodelica/binaries/Print" -g -falign-functions -fno-ipa-pure-const -mstackrealign -msse2 -mfpmath=sse   -I"C:/dev/hudson/workspace/OM_Win/OM/build/include/omc/c" "-IC:/dev/hudson/workspace/OM_Win/OM/OMCompiler/Compiler/Util/" -L"C:/dev/hudson/workspace/OM_Win/OM/build/lib//omc" -Wl,--stack,16777216,-rpath,'C:/dev/hudson/workspace/OM_Win/OM/build/lib//omc'  -lOpenModelicaCompiler -fopenmp -Wl,-Bstatic -lregex -ltre -lintl -liconv -lexpat -lomcgc -lpthread -loleaut32 -limagehlp -lhdf5 -lz -lszip -Wl,-Bdynamic  -lOpenModelicaRuntimeC -Wl,-Bstatic -lomcgc -lregex -ltre -lintl -liconv -lexpat -static-libgcc -luuid -loleaut32 -lole32 -limagehlp -lws2_32 -llis -lumfpack -lklu -lcolamd -lbtf -lamd  -lsundials_idas -lsundials_kinsol -lsundials_nvecserial -lipopt -lcoinmumps -lpthread -lm -lgfortranbegin -lgfortran -lquadmath -lmingw32 -lgcc_eh -lmoldname -lmingwex -lmsvcrt -luser32 -lkernel32 -ladvapi32 -lshell32 -lopenblas -lcminpack -Wl,-Bdynamic -lm
C:/OMDev/tools/msys/mingw64/bin/../lib/gcc/x86_64-w64-mingw32/5.3.0/../../../../lib\libregex.a(systre.o):(.text+0x0): multiple definition of `regcomp'
C:/OMDev/tools/msys/mingw64/bin/../lib/gcc/x86_64-w64-mingw32/5.3.0/../../../../lib/libregex.dll.a(d000001.o):(.text+0x0): first defined here
C:/OMDev/tools/msys/mingw64/bin/../lib/gcc/x86_64-w64-mingw32/5.3.0/../../../../lib\libregex.a(systre.o):(.text+0x10): multiple definition of `regfree'
C:/OMDev/tools/msys/mingw64/bin/../lib/gcc/x86_64-w64-mingw32/5.3.0/../../../../lib/libregex.dll.a(d000004.o):(.text+0x0): first defined here
C:/OMDev/tools/msys/mingw64/bin/../lib/gcc/x86_64-w64-mingw32/5.3.0/../../../../lib\libregex.a(systre.o):(.text+0x30): multiple definition of `regexec'
C:/OMDev/tools/msys/mingw64/bin/../lib/gcc/x86_64-w64-mingw32/5.3.0/../../../../lib/libregex.dll.a(d000003.o):(.text+0x0): first defined here
collect2.exe: error: ld returned 1 exit status
ValuesUtil_valString.makefile:20: recipe for target 'ValuesUtil_valString' failed
make: *** [ValuesUtil_valString] Error 1
RESULT: 2
"

Equation mismatch: diff says:
--- /tmp/omc-rtest-adrpo33/openmodelica/bootstrapping/DumpTest.mos_temp3182/equations-expected2019-05-07 12:38:13.095188600 +0200
+++ /tmp/omc-rtest-adrpo33/openmodelica/bootstrapping/DumpTest.mos_temp3182/equations-got2019-05-07 12:40:23.521376200 +0200
@@ -4,47 +4,172 @@
 true
 ""
 true
 true
 "DumpGraphviz.dump"
-graph AST {
-GVNOD0[label="ROOT"];GVNOD1[label="PURE FUNCTION"];GVNOD1 -- GVNOD0;
-}
 
-""
+"Error: Error building simulator. Build log: gcc -g -falign-functions -fno-ipa-pure-const -mstackrealign -msse2 -mfpmath=sse   -I"C:/dev/hudson/workspace/OM_Win/OM/build/include/omc/c" "-IC:/dev/hudson/workspace/OM_Win/OM/OMCompiler/Compiler/Util/" -c -o DumpGraphviz_dump.o DumpGraphviz_dump.c
+DumpGraphviz_dump.c: In function 'omc_Tpl_tokFileText':
+DumpGraphviz_dump.c:13193:3: warning: implicit declaration of function 'omc_File_File_destructor' [-Wimplicit-function-declaration]
+omc_File_File_destructor(threadData,_file);
+^
+DumpGraphviz_dump.c: In function 'omc_Absyn_pathStringWork':
+DumpGraphviz_dump.c:32555:3: warning: implicit declaration of function 'omc_System_StringAllocator_destructor' [-Wimplicit-function-declaration]
+omc_System_StringAllocator_destructor(threadData,_sb);
+^
+gcc -g -falign-functions -fno-ipa-pure-const -mstackrealign -msse2 -mfpmath=sse   -I"C:/dev/hudson/workspace/OM_Win/OM/build/include/omc/c" "-IC:/dev/hudson/workspace/OM_Win/OM/OMCompiler/Compiler/Util/" -c -o DumpGraphviz_dump_records.o DumpGraphviz_dump_records.c
+g++ -shared -Xlinker --export-all-symbols -fPIC -o DumpGraphviz_dump.dll DumpGraphviz_dump.o DumpGraphviz_dump_records.o "-LC:/dev/hudson/workspace/OM_Win/OM/build/lib//omc" "-LC:/dev/hudson/workspace/OM_Win/OM/build/lib/" "-L%APPDATA%/.openmodelica/binaries/System" "-LC:/dev/hudson/workspace/OM_Win/OM/OMCompiler/Compiler/Util/Resources/Library/mingw64" "-LC:/dev/hudson/workspace/OM_Win/OM/OMCompiler/Compiler/Util/Resources/Library/win64" "-LC:/dev/hudson/workspace/OM_Win/OM/OMCompiler/Compiler/Util/Resources/Library" -lomcruntime -lintl -liconv -lexpat -lsqlite3 -llpsolve55 -ltre -lomniORB420_rt -lomnithread40_rt -lws2_32 -lRpcrt4 -lregex "-L%APPDATA%/.openmodelica/binaries/ErrorExt" "-L%APPDATA%/.openmodelica/binaries/Print" -g -falign-functions -fno-ipa-pure-const -mstackrealign -msse2 -mfpmath=sse   -I"C:/dev/hudson/workspace/OM_Win/OM/build/include/omc/c" "-IC:/dev/hudson/workspace/OM_Win/OM/OMCompiler/Compiler/Util/" -L"C:/dev/hudson/workspace/OM_Win/OM/build/lib//omc" -Wl,--stack,16777216,-rpath,'C:/dev/hudson/workspace/OM_Win/OM/build/lib//omc'  -lOpenModelicaCompiler -fopenmp -Wl,-Bstatic -lregex -ltre -lintl -liconv -lexpat -lomcgc -lpthread -loleaut32 -limagehlp -lhdf5 -lz -lszip -Wl,-Bdynamic  -lOpenModelicaRuntimeC -Wl,-Bstatic -lomcgc -lregex -ltre -lintl -liconv -lexpat -static-libgcc -luuid -loleaut32 -lole32 -limagehlp -lws2_32 -llis -lumfpack -lklu -lcolamd -lbtf -lamd  -lsundials_idas -lsundials_kinsol -lsundials_nvecserial -lipopt -lcoinmumps -lpthread -lm -lgfortranbegin -lgfortran -lquadmath -lmingw32 -lgcc_eh -lmoldname -lmingwex -lmsvcrt -luser32 -lkernel32 -ladvapi32 -lshell32 -lopenblas -lcminpack -Wl,-Bdynamic -lm
+C:/OMDev/tools/msys/mingw64/bin/../lib/gcc/x86_64-w64-mingw32/5.3.0/../../../../lib\libregex.a(systre.o):(.text+0x0): multiple definition of `regcomp'
+C:/OMDev/tools/msys/mingw64/bin/../lib/gcc/x86_64-w64-mingw32/5.3.0/../../../../lib/libregex.dll.a(d000001.o):(.text+0x0): first defined here
+C:/OMDev/tools/msys/mingw64/bin/../lib/gcc/x86_64-w64-mingw32/5.3.0/../../../../lib\libregex.a(systre.o):(.text+0x10): multiple definition of `regfree'
+C:/OMDev/tools/msys/mingw64/bin/../lib/gcc/x86_64-w64-mingw32/5.3.0/../../../../lib/libregex.dll.a(d000004.o):(.text+0x0): first defined here
+C:/OMDev/tools/msys/mingw64/bin/../lib/gcc/x86_64-w64-mingw32/5.3.0/../../../../lib\libregex.a(systre.o):(.text+0x30): multiple definition of `regexec'
+C:/OMDev/tools/msys/mingw64/bin/../lib/gcc/x86_64-w64-mingw32/5.3.0/../../../../lib/libregex.dll.a(d000003.o):(.text+0x0): first defined here
+collect2.exe: error: ld returned 1 exit status
+DumpGraphviz_dump.makefile:20: recipe for target 'DumpGraphviz_dump' failed
+make: *** [DumpGraphviz_dump] Error 1
+RESULT: 2
+"
 "Dump.dump"
-"Absyn.PROGRAM([
-Absyn.CLASS(\"dummyClass\", true, true, true, Absyn.R_FUNCTION(Absyn.FR_NORMAL_FUNCTION(Absyn.PURE)), Absyn.PARTS([], NONE()), SOURCEINFO(\"\", false, 0, 0, 0, 0))
-],Absyn.TOP)
+
+"Error: Error building simulator. Build log: gcc -g -falign-functions -fno-ipa-pure-const -mstackrealign -msse2 -mfpmath=sse   -I"C:/dev/hudson/workspace/OM_Win/OM/build/include/omc/c" "-IC:/dev/hudson/workspace/OM_Win/OM/OMCompiler/Compiler/Util/" -c -o DumpTest_dump.o DumpTest_dump.c
+DumpTest_dump.c: In function 'omc_Absyn_pathStringWork':
+DumpTest_dump.c:9957:3: warning: implicit declaration of function 'omc_System_StringAllocator_destructor' [-Wimplicit-function-declaration]
+omc_System_StringAllocator_destructor(threadData,_sb);
+^
+DumpTest_dump.c: In function 'omc_Tpl_tokFileText':
+DumpTest_dump.c:15340:3: warning: implicit declaration of function 'omc_File_File_destructor' [-Wimplicit-function-declaration]
+omc_File_File_destructor(threadData,_file);
+^
+gcc -g -falign-functions -fno-ipa-pure-const -mstackrealign -msse2 -mfpmath=sse   -I"C:/dev/hudson/workspace/OM_Win/OM/build/include/omc/c" "-IC:/dev/hudson/workspace/OM_Win/OM/OMCompiler/Compiler/Util/" -c -o DumpTest_dump_records.o DumpTest_dump_records.c
+g++ -shared -Xlinker --export-all-symbols -fPIC -o DumpTest_dump.dll DumpTest_dump.o DumpTest_dump_records.o "-LC:/dev/hudson/workspace/OM_Win/OM/build/lib//omc" "-LC:/dev/hudson/workspace/OM_Win/OM/build/lib/" "-L%APPDATA%/.openmodelica/binaries/Print" "-LC:/dev/hudson/workspace/OM_Win/OM/OMCompiler/Compiler/Util/Resources/Library/mingw64" "-LC:/dev/hudson/workspace/OM_Win/OM/OMCompiler/Compiler/Util/Resources/Library/win64" "-LC:/dev/hudson/workspace/OM_Win/OM/OMCompiler/Compiler/Util/Resources/Library" -lomcruntime -lintl -liconv -lexpat -lsqlite3 -llpsolve55 -ltre -lomniORB420_rt -lomnithread40_rt -lws2_32 -lRpcrt4 -lregex "-L%APPDATA%/.openmodelica/binaries/System" "-L%APPDATA%/.openmodelica/binaries/ErrorExt" -g -falign-functions -fno-ipa-pure-const -mstackrealign -msse2 -mfpmath=sse   -I"C:/dev/hudson/workspace/OM_Win/OM/build/include/omc/c" "-IC:/dev/hudson/workspace/OM_Win/OM/OMCompiler/Compiler/Util/" -L"C:/dev/hudson/workspace/OM_Win/OM/build/lib//omc" -Wl,--stack,16777216,-rpath,'C:/dev/hudson/workspace/OM_Win/OM/build/lib//omc'  -lOpenModelicaCompiler -fopenmp -Wl,-Bstatic -lregex -ltre -lintl -liconv -lexpat -lomcgc -lpthread -loleaut32 -limagehlp -lhdf5 -lz -lszip -Wl,-Bdynamic  -lOpenModelicaRuntimeC -Wl,-Bstatic -lomcgc -lregex -ltre -lintl -liconv -lexpat -static-libgcc -luuid -loleaut32 -lole32 -limagehlp -lws2_32 -llis -lumfpack -lklu -lcolamd -lbtf -lamd  -lsundials_idas -lsundials_kinsol -lsundials_nvecserial -lipopt -lcoinmumps -lpthread -lm -lgfortranbegin -lgfortran -lquadmath -lmingw32 -lgcc_eh -lmoldname -lmingwex -lmsvcrt -luser32 -lkernel32 -ladvapi32 -lshell32 -lopenblas -lcminpack -Wl,-Bdynamic -lm
+C:/OMDev/tools/msys/mingw64/bin/../lib/gcc/x86_64-w64-mingw32/5.3.0/../../../../lib\libregex.a(systre.o):(.text+0x0): multiple definition of `regcomp'
+C:/OMDev/tools/msys/mingw64/bin/../lib/gcc/x86_64-w64-mingw32/5.3.0/../../../../lib/libregex.dll.a(d000001.o):(.text+0x0): first defined here
+C:/OMDev/tools/msys/mingw64/bin/../lib/gcc/x86_64-w64-mingw32/5.3.0/../../../../lib\libregex.a(systre.o):(.text+0x10): multiple definition of `regfree'
+C:/OMDev/tools/msys/mingw64/bin/../lib/gcc/x86_64-w64-mingw32/5.3.0/../../../../lib/libregex.dll.a(d000004.o):(.text+0x0): first defined here
+C:/OMDev/tools/msys/mingw64/bin/../lib/gcc/x86_64-w64-mingw32/5.3.0/../../../../lib\libregex.a(systre.o):(.text+0x30): multiple definition of `regexec'
+C:/OMDev/tools/msys/mingw64/bin/../lib/gcc/x86_64-w64-mingw32/5.3.0/../../../../lib/libregex.dll.a(d000003.o):(.text+0x0): first defined here
+collect2.exe: error: ld returned 1 exit status
+DumpTest_dump.makefile:20: recipe for target 'DumpTest_dump' failed
+make: *** [DumpTest_dump] Error 1
+RESULT: 2
 "
-""
 "Dump.unparseStr"
-"final encapsulated partial pure function dummyClass
-end dummyClass;"
-""
+
+"Error: Error building simulator. Build log: gcc -g -falign-functions -fno-ipa-pure-const -mstackrealign -msse2 -mfpmath=sse   -I"C:/dev/hudson/workspace/OM_Win/OM/build/include/omc/c" "-IC:/dev/hudson/workspace/OM_Win/OM/OMCompiler/Compiler/Util/" -c -o Dump_unparseStr.o Dump_unparseStr.c
+Dump_unparseStr.c: In function 'omc_Tpl_tokFileText':
+Dump_unparseStr.c:10983:3: warning: implicit declaration of function 'omc_File_File_destructor' [-Wimplicit-function-declaration]
+omc_File_File_destructor(threadData,_file);
+^
+gcc -g -falign-functions -fno-ipa-pure-const -mstackrealign -msse2 -mfpmath=sse   -I"C:/dev/hudson/workspace/OM_Win/OM/build/include/omc/c" "-IC:/dev/hudson/workspace/OM_Win/OM/OMCompiler/Compiler/Util/" -c -o Dump_unparseStr_records.o Dump_unparseStr_records.c
+g++ -shared -Xlinker --export-all-symbols -fPIC -o Dump_unparseStr.dll Dump_unparseStr.o Dump_unparseStr_records.o "-LC:/dev/hudson/workspace/OM_Win/OM/build/lib//omc" "-LC:/dev/hudson/workspace/OM_Win/OM/build/lib/" "-L%APPDATA%/.openmodelica/binaries/System" "-LC:/dev/hudson/workspace/OM_Win/OM/OMCompiler/Compiler/Util/Resources/Library/mingw64" "-LC:/dev/hudson/workspace/OM_Win/OM/OMCompiler/Compiler/Util/Resources/Library/win64" "-LC:/dev/hudson/workspace/OM_Win/OM/OMCompiler/Compiler/Util/Resources/Library" -lomcruntime -lintl -liconv -lexpat -lsqlite3 -llpsolve55 -ltre -lomniORB420_rt -lomnithread40_rt -lws2_32 -lRpcrt4 -lregex "-L%APPDATA%/.openmodelica/binaries/ErrorExt" "-L%APPDATA%/.openmodelica/binaries/Print" -g -falign-functions -fno-ipa-pure-const -mstackrealign -msse2 -mfpmath=sse   -I"C:/dev/hudson/workspace/OM_Win/OM/build/include/omc/c" "-IC:/dev/hudson/workspace/OM_Win/OM/OMCompiler/Compiler/Util/" -L"C:/dev/hudson/workspace/OM_Win/OM/build/lib//omc" -Wl,--stack,16777216,-rpath,'C:/dev/hudson/workspace/OM_Win/OM/build/lib//omc'  -lOpenModelicaCompiler -fopenmp -Wl,-Bstatic -lregex -ltre -lintl -liconv -lexpat -lomcgc -lpthread -loleaut32 -limagehlp -lhdf5 -lz -lszip -Wl,-Bdynamic  -lOpenModelicaRuntimeC -Wl,-Bstatic -lomcgc -lregex -ltre -lintl -liconv -lexpat -static-libgcc -luuid -loleaut32 -lole32 -limagehlp -lws2_32 -llis -lumfpack -lklu -lcolamd -lbtf -lamd  -lsundials_idas -lsundials_kinsol -lsundials_nvecserial -lipopt -lcoinmumps -lpthread -lm -lgfortranbegin -lgfortran -lquadmath -lmingw32 -lgcc_eh -lmoldname -lmingwex -lmsvcrt -luser32 -lkernel32 -ladvapi32 -lshell32 -lopenblas -lcminpack -Wl,-Bdynamic -lm
+C:/OMDev/tools/msys/mingw64/bin/../lib/gcc/x86_64-w64-mingw32/5.3.0/../../../../lib\libregex.a(systre.o):(.text+0x0): multiple definition of `regcomp'
+C:/OMDev/tools/msys/mingw64/bin/../lib/gcc/x86_64-w64-mingw32/5.3.0/../../../../lib/libregex.dll.a(d000001.o):(.text+0x0): first defined here
+C:/OMDev/tools/msys/mingw64/bin/../lib/gcc/x86_64-w64-mingw32/5.3.0/../../../../lib\libregex.a(systre.o):(.text+0x10): multiple definition of `regfree'
+C:/OMDev/tools/msys/mingw64/bin/../lib/gcc/x86_64-w64-mingw32/5.3.0/../../../../lib/libregex.dll.a(d000004.o):(.text+0x0): first defined here
+C:/OMDev/tools/msys/mingw64/bin/../lib/gcc/x86_64-w64-mingw32/5.3.0/../../../../lib\libregex.a(systre.o):(.text+0x30): multiple definition of `regexec'
+C:/OMDev/tools/msys/mingw64/bin/../lib/gcc/x86_64-w64-mingw32/5.3.0/../../../../lib/libregex.dll.a(d000003.o):(.text+0x0): first defined here
+collect2.exe: error: ld returned 1 exit status
+Dump_unparseStr.makefile:20: recipe for target 'Dump_unparseStr' failed
+make: *** [Dump_unparseStr] Error 1
+RESULT: 2
+"
 "Dump.getAstAsCorbaString"
-"record Absyn.PROGRAM
-classes = {record Absyn.CLASS name = \"dummyClass\", partialPrefix = true, finalPrefix = true, encapsulatedPrefix = true, restriction = record Absyn.R_FUNCTION functionRestriction = record Absyn.FR_NORMAL_FUNCTION purity = record Absyn.PURE end Absyn.PURE; end Absyn.FR_NORMAL_FUNCTION;end Absyn.R_FUNCTION;, body = record Absyn.PARTS typeVars = {}, classParts = {}, ann = {}, comment = NONE() end Absyn.PARTS;, info = record SOURCEINFO fileName = \"\", isReadOnly = false, lineNumberStart = 0, columnNumberStart = 0, lineNumberEnd = 0, columnNumberEnd = 0, lastModified = 0.0 end SOURCEINFO; end Absyn.CLASS;},
-within_ = record Absyn.TOP end Absyn.TOP;
-end Absyn.PROGRAM;"
-""
+
+"Error: Error building simulator. Build log: gcc -g -falign-functions -fno-ipa-pure-const -mstackrealign -msse2 -mfpmath=sse   -I"C:/dev/hudson/workspace/OM_Win/OM/build/include/omc/c"  -c -o DumpTest_getAstAsCorbaString.o DumpTest_getAstAsCorbaString.c
+gcc -g -falign-functions -fno-ipa-pure-const -mstackrealign -msse2 -mfpmath=sse   -I"C:/dev/hudson/workspace/OM_Win/OM/build/include/omc/c"  -c -o DumpTest_getAstAsCorbaString_records.o DumpTest_getAstAsCorbaString_records.c
+g++ -shared -Xlinker --export-all-symbols -fPIC -o DumpTest_getAstAsCorbaString.dll DumpTest_getAstAsCorbaString.o DumpTest_getAstAsCorbaString_records.o "-LC:/dev/hudson/workspace/OM_Win/OM/build/lib//omc" "-LC:/dev/hudson/workspace/OM_Win/OM/build/lib/" "-L%APPDATA%/.openmodelica/binaries/System" "-LC:/dev/hudson/workspace/OM_Win/OM/OMCompiler/Compiler/Util/Resources/Library/mingw64" "-LC:/dev/hudson/workspace/OM_Win/OM/OMCompiler/Compiler/Util/Resources/Library/win64" "-LC:/dev/hudson/workspace/OM_Win/OM/OMCompiler/Compiler/Util/Resources/Library" -lomcruntime -lintl -liconv -lexpat -lsqlite3 -llpsolve55 -ltre -lomniORB420_rt -lomnithread40_rt -lws2_32 -lRpcrt4 -lregex "-L%APPDATA%/.openmodelica/binaries/ErrorExt" "-L%APPDATA%/.openmodelica/binaries/Print" -g -falign-functions -fno-ipa-pure-const -mstackrealign -msse2 -mfpmath=sse   -I"C:/dev/hudson/workspace/OM_Win/OM/build/include/omc/c"  -L"C:/dev/hudson/workspace/OM_Win/OM/build/lib//omc" -Wl,--stack,16777216,-rpath,'C:/dev/hudson/workspace/OM_Win/OM/build/lib//omc'  -lOpenModelicaCompiler -fopenmp -Wl,-Bstatic -lregex -ltre -lintl -liconv -lexpat -lomcgc -lpthread -loleaut32 -limagehlp -lhdf5 -lz -lszip -Wl,-Bdynamic  -lOpenModelicaRuntimeC -Wl,-Bstatic -lomcgc -lregex -ltre -lintl -liconv -lexpat -static-libgcc -luuid -loleaut32 -lole32 -limagehlp -lws2_32 -llis -lumfpack -lklu -lcolamd -lbtf -lamd  -lsundials_idas -lsundials_kinsol -lsundials_nvecserial -lipopt -lcoinmumps -lpthread -lm -lgfortranbegin -lgfortran -lquadmath -lmingw32 -lgcc_eh -lmoldname -lmingwex -lmsvcrt -luser32 -lkernel32 -ladvapi32 -lshell32 -lopenblas -lcminpack -Wl,-Bdynamic -lm
+C:/OMDev/tools/msys/mingw64/bin/../lib/gcc/x86_64-w64-mingw32/5.3.0/../../../../lib\libregex.a(systre.o):(.text+0x0): multiple definition of `regcomp'
+C:/OMDev/tools/msys/mingw64/bin/../lib/gcc/x86_64-w64-mingw32/5.3.0/../../../../lib/libregex.dll.a(d000001.o):(.text+0x0): first defined here
+C:/OMDev/tools/msys/mingw64/bin/../lib/gcc/x86_64-w64-mingw32/5.3.0/../../../../lib\libregex.a(systre.o):(.text+0x10): multiple definition of `regfree'
+C:/OMDev/tools/msys/mingw64/bin/../lib/gcc/x86_64-w64-mingw32/5.3.0/../../../../lib/libregex.dll.a(d000004.o):(.text+0x0): first defined here
+C:/OMDev/tools/msys/mingw64/bin/../lib/gcc/x86_64-w64-mingw32/5.3.0/../../../../lib\libregex.a(systre.o):(.text+0x30): multiple definition of `regexec'
+C:/OMDev/tools/msys/mingw64/bin/../lib/gcc/x86_64-w64-mingw32/5.3.0/../../../../lib/libregex.dll.a(d000003.o):(.text+0x0): first defined here
+collect2.exe: error: ld returned 1 exit status
+DumpTest_getAstAsCorbaString.makefile:20: recipe for target 'DumpTest_getAstAsCorbaString' failed
+make: *** [DumpTest_getAstAsCorbaString] Error 1
+RESULT: 2
+"
 record DAE.Exp.ICONST
 integer = 42
 end DAE.Exp.ICONST;
 ""
 "ExpressionDump.printExpStr"
-"42"
-""
+
+"Error: Error building simulator. Build log: gcc -g -falign-functions -fno-ipa-pure-const -mstackrealign -msse2 -mfpmath=sse   -I"C:/dev/hudson/workspace/OM_Win/OM/build/include/omc/c" "-IC:/dev/hudson/workspace/OM_Win/OM/OMCompiler/Compiler/Util/" -c -o ExpressionDump_printExpStr.o ExpressionDump_printExpStr.c
+ExpressionDump_printExpStr.c: In function 'omc_Tpl_stringFile':
+ExpressionDump_printExpStr.c:13259:3: warning: implicit declaration of function 'omc_File_File_destructor' [-Wimplicit-function-declaration]
+omc_File_File_destructor(threadData,_file);
+^
+ExpressionDump_printExpStr.c: In function 'omc_Absyn_pathStringWork':
+ExpressionDump_printExpStr.c:37644:3: warning: implicit declaration of function 'omc_System_StringAllocator_destructor' [-Wimplicit-function-declaration]
+omc_System_StringAllocator_destructor(threadData,_sb);
+^
+gcc -g -falign-functions -fno-ipa-pure-const -mstackrealign -msse2 -mfpmath=sse   -I"C:/dev/hudson/workspace/OM_Win/OM/build/include/omc/c" "-IC:/dev/hudson/workspace/OM_Win/OM/OMCompiler/Compiler/Util/" -c -o ExpressionDump_printExpStr_records.o ExpressionDump_printExpStr_records.c
+g++ -shared -Xlinker --export-all-symbols -fPIC -o ExpressionDump_printExpStr.dll ExpressionDump_printExpStr.o ExpressionDump_printExpStr_records.o "-LC:/dev/hudson/workspace/OM_Win/OM/build/lib//omc" "-LC:/dev/hudson/workspace/OM_Win/OM/build/lib/" "-L%APPDATA%/.openmodelica/binaries/System" "-LC:/dev/hudson/workspace/OM_Win/OM/OMCompiler/Compiler/Util/Resources/Library/mingw64" "-LC:/dev/hudson/workspace/OM_Win/OM/OMCompiler/Compiler/Util/Resources/Library/win64" "-LC:/dev/hudson/workspace/OM_Win/OM/OMCompiler/Compiler/Util/Resources/Library" -lomcruntime -lintl -liconv -lexpat -lsqlite3 -llpsolve55 -ltre -lomniORB420_rt -lomnithread40_rt -lws2_32 -lRpcrt4 -lregex "-L%APPDATA%/.openmodelica/binaries/ErrorExt" "-L%APPDATA%/.openmodelica/binaries/Print" -g -falign-functions -fno-ipa-pure-const -mstackrealign -msse2 -mfpmath=sse   -I"C:/dev/hudson/workspace/OM_Win/OM/build/include/omc/c" "-IC:/dev/hudson/workspace/OM_Win/OM/OMCompiler/Compiler/Util/" -L"C:/dev/hudson/workspace/OM_Win/OM/build/lib//omc" -Wl,--stack,16777216,-rpath,'C:/dev/hudson/workspace/OM_Win/OM/build/lib//omc'  -lOpenModelicaCompiler -fopenmp -Wl,-Bstatic -lregex -ltre -lintl -liconv -lexpat -lomcgc -lpthread -loleaut32 -limagehlp -lhdf5 -lz -lszip -Wl,-Bdynamic  -lOpenModelicaRuntimeC -Wl,-Bstatic -lomcgc -lregex -ltre -lintl -liconv -lexpat -static-libgcc -luuid -loleaut32 -lole32 -limagehlp -lws2_32 -llis -lumfpack -lklu -lcolamd -lbtf -lamd  -lsundials_idas -lsundials_kinsol -lsundials_nvecserial -lipopt -lcoinmumps -lpthread -lm -lgfortranbegin -lgfortran -lquadmath -lmingw32 -lgcc_eh -lmoldname -lmingwex -lmsvcrt -luser32 -lkernel32 -ladvapi32 -lshell32 -lopenblas -lcminpack -Wl,-Bdynamic -lm
+C:/OMDev/tools/msys/mingw64/bin/../lib/gcc/x86_64-w64-mingw32/5.3.0/../../../../lib\libregex.a(systre.o):(.text+0x0): multiple definition of `regcomp'
+C:/OMDev/tools/msys/mingw64/bin/../lib/gcc/x86_64-w64-mingw32/5.3.0/../../../../lib/libregex.dll.a(d000001.o):(.text+0x0): first defined here
+C:/OMDev/tools/msys/mingw64/bin/../lib/gcc/x86_64-w64-mingw32/5.3.0/../../../../lib\libregex.a(systre.o):(.text+0x10): multiple definition of `regfree'
+C:/OMDev/tools/msys/mingw64/bin/../lib/gcc/x86_64-w64-mingw32/5.3.0/../../../../lib/libregex.dll.a(d000004.o):(.text+0x0): first defined here
+C:/OMDev/tools/msys/mingw64/bin/../lib/gcc/x86_64-w64-mingw32/5.3.0/../../../../lib\libregex.a(systre.o):(.text+0x30): multiple definition of `regexec'
+C:/OMDev/tools/msys/mingw64/bin/../lib/gcc/x86_64-w64-mingw32/5.3.0/../../../../lib/libregex.dll.a(d000003.o):(.text+0x0): first defined here
+collect2.exe: error: ld returned 1 exit status
+ExpressionDump_printExpStr.makefile:20: recipe for target 'ExpressionDump_printExpStr' failed
+make: *** [ExpressionDump_printExpStr] Error 1
+RESULT: 2
+"
 record DAE.DAElist.DAE
 elementLst = {}
 end DAE.DAElist.DAE;
 ""
 "DAEDump.dumpDebugDAE"
-""
-""
+
+"Error: Error building simulator. Build log: gcc -g -falign-functions -fno-ipa-pure-const -mstackrealign -msse2 -mfpmath=sse   -I"C:/dev/hudson/workspace/OM_Win/OM/build/include/omc/c" "-IC:/dev/hudson/workspace/OM_Win/OM/OMCompiler/Compiler/Util/" -c -o DAEDump_dumpDebugDAE.o DAEDump_dumpDebugDAE.c
+DAEDump_dumpDebugDAE.c: In function 'omc_Tpl_stringFile':
+DAEDump_dumpDebugDAE.c:14886:3: warning: implicit declaration of function 'omc_File_File_destructor' [-Wimplicit-function-declaration]
+omc_File_File_destructor(threadData,_file);
+^
+DAEDump_dumpDebugDAE.c: In function 'omc_Absyn_pathStringWork':
+DAEDump_dumpDebugDAE.c:39375:3: warning: implicit declaration of function 'omc_System_StringAllocator_destructor' [-Wimplicit-function-declaration]
+omc_System_StringAllocator_destructor(threadData,_sb);
+^
+gcc -g -falign-functions -fno-ipa-pure-const -mstackrealign -msse2 -mfpmath=sse   -I"C:/dev/hudson/workspace/OM_Win/OM/build/include/omc/c" "-IC:/dev/hudson/workspace/OM_Win/OM/OMCompiler/Compiler/Util/" -c -o DAEDump_dumpDebugDAE_records.o DAEDump_dumpDebugDAE_records.c
+g++ -shared -Xlinker --export-all-symbols -fPIC -o DAEDump_dumpDebugDAE.dll DAEDump_dumpDebugDAE.o DAEDump_dumpDebugDAE_records.o "-LC:/dev/hudson/workspace/OM_Win/OM/build/lib//omc" "-LC:/dev/hudson/workspace/OM_Win/OM/build/lib/" "-L%APPDATA%/.openmodelica/binaries/Print" "-LC:/dev/hudson/workspace/OM_Win/OM/OMCompiler/Compiler/Util/Resources/Library/mingw64" "-LC:/dev/hudson/workspace/OM_Win/OM/OMCompiler/Compiler/Util/Resources/Library/win64" "-LC:/dev/hudson/workspace/OM_Win/OM/OMCompiler/Compiler/Util/Resources/Library" -lomcruntime -lintl -liconv -lexpat -lsqlite3 -llpsolve55 -ltre -lomniORB420_rt -lomnithread40_rt -lws2_32 -lRpcrt4 -lregex "-L%APPDATA%/.openmodelica/binaries/System" "-L%APPDATA%/.openmodelica/binaries/ErrorExt" -g -falign-functions -fno-ipa-pure-const -mstackrealign -msse2 -mfpmath=sse   -I"C:/dev/hudson/workspace/OM_Win/OM/build/include/omc/c" "-IC:/dev/hudson/workspace/OM_Win/OM/OMCompiler/Compiler/Util/" -L"C:/dev/hudson/workspace/OM_Win/OM/build/lib//omc" -Wl,--stack,16777216,-rpath,'C:/dev/hudson/workspace/OM_Win/OM/build/lib//omc'  -lOpenModelicaCompiler -fopenmp -Wl,-Bstatic -lregex -ltre -lintl -liconv -lexpat -lomcgc -lpthread -loleaut32 -limagehlp -lhdf5 -lz -lszip -Wl,-Bdynamic  -lOpenModelicaRuntimeC -Wl,-Bstatic -lomcgc -lregex -ltre -lintl -liconv -lexpat -static-libgcc -luuid -loleaut32 -lole32 -limagehlp -lws2_32 -llis -lumfpack -lklu -lcolamd -lbtf -lamd  -lsundials_idas -lsundials_kinsol -lsundials_nvecserial -lipopt -lcoinmumps -lpthread -lm -lgfortranbegin -lgfortran -lquadmath -lmingw32 -lgcc_eh -lmoldname -lmingwex -lmsvcrt -luser32 -lkernel32 -ladvapi32 -lshell32 -lopenblas -lcminpack -Wl,-Bdynamic -lm
+C:/OMDev/tools/msys/mingw64/bin/../lib/gcc/x86_64-w64-mingw32/5.3.0/../../../../lib\libregex.a(systre.o):(.text+0x0): multiple definition of `regcomp'
+C:/OMDev/tools/msys/mingw64/bin/../lib/gcc/x86_64-w64-mingw32/5.3.0/../../../../lib/libregex.dll.a(d000001.o):(.text+0x0): first defined here
+C:/OMDev/tools/msys/mingw64/bin/../lib/gcc/x86_64-w64-mingw32/5.3.0/../../../../lib\libregex.a(systre.o):(.text+0x10): multiple definition of `regfree'
+C:/OMDev/tools/msys/mingw64/bin/../lib/gcc/x86_64-w64-mingw32/5.3.0/../../../../lib/libregex.dll.a(d000004.o):(.text+0x0): first defined here
+C:/OMDev/tools/msys/mingw64/bin/../lib/gcc/x86_64-w64-mingw32/5.3.0/../../../../lib\libregex.a(systre.o):(.text+0x30): multiple definition of `regexec'
+C:/OMDev/tools/msys/mingw64/bin/../lib/gcc/x86_64-w64-mingw32/5.3.0/../../../../lib/libregex.dll.a(d000003.o):(.text+0x0): first defined here
+collect2.exe: error: ld returned 1 exit status
+DAEDump_dumpDebugDAE.makefile:20: recipe for target 'DAEDump_dumpDebugDAE' failed
+make: *** [DAEDump_dumpDebugDAE] Error 1
+RESULT: 2
+"
 record Values.Value.INTEGER
 integer = 42
 end Values.Value.INTEGER;
 ""
 "ValuesUtil.valString"
-"42"
-""
+
+"Error: Error building simulator. Build log: gcc -g -falign-functions -fno-ipa-pure-const -mstackrealign -msse2 -mfpmath=sse   -I"C:/dev/hudson/workspace/OM_Win/OM/build/include/omc/c" "-IC:/dev/hudson/workspace/OM_Win/OM/OMCompiler/Compiler/Util/" -c -o ValuesUtil_valString.o ValuesUtil_valString.c
+ValuesUtil_valString.c: In function 'omc_Absyn_pathStringWork':
+ValuesUtil_valString.c:9206:3: warning: implicit declaration of function 'omc_System_StringAllocator_destructor' [-Wimplicit-function-declaration]
+omc_System_StringAllocator_destructor(threadData,_sb);
+^
+ValuesUtil_valString.c: In function 'omc_Tpl_tokFileText':
+ValuesUtil_valString.c:12218:3: warning: implicit declaration of function 'omc_File_File_destructor' [-Wimplicit-function-declaration]
+omc_File_File_destructor(threadData,_file);
+^
+gcc -g -falign-functions -fno-ipa-pure-const -mstackrealign -msse2 -mfpmath=sse   -I"C:/dev/hudson/workspace/OM_Win/OM/build/include/omc/c" "-IC:/dev/hudson/workspace/OM_Win/OM/OMCompiler/Compiler/Util/" -c -o ValuesUtil_valString_records.o ValuesUtil_valString_records.c
+g++ -shared -Xlinker --export-all-symbols -fPIC -o ValuesUtil_valString.dll ValuesUtil_valString.o ValuesUtil_valString_records.o "-LC:/dev/hudson/workspace/OM_Win/OM/build/lib//omc" "-LC:/dev/hudson/workspace/OM_Win/OM/build/lib/" "-L%APPDATA%/.openmodelica/binaries/System" "-LC:/dev/hudson/workspace/OM_Win/OM/OMCompiler/Compiler/Util/Resources/Library/mingw64" "-LC:/dev/hudson/workspace/OM_Win/OM/OMCompiler/Compiler/Util/Resources/Library/win64" "-LC:/dev/hudson/workspace/OM_Win/OM/OMCompiler/Compiler/Util/Resources/Library" -lomcruntime -lintl -liconv -lexpat -lsqlite3 -llpsolve55 -ltre -lomniORB420_rt -lomnithread40_rt -lws2_32 -lRpcrt4 -lregex "-L%APPDATA%/.openmodelica/binaries/ErrorExt" "-L%APPDATA%/.openmodelica/binaries/Print" -g -falign-functions -fno-ipa-pure-const -mstackrealign -msse2 -mfpmath=sse   -I"C:/dev/hudson/workspace/OM_Win/OM/build/include/omc/c" "-IC:/dev/hudson/workspace/OM_Win/OM/OMCompiler/Compiler/Util/" -L"C:/dev/hudson/workspace/OM_Win/OM/build/lib//omc" -Wl,--stack,16777216,-rpath,'C:/dev/hudson/workspace/OM_Win/OM/build/lib//omc'  -lOpenModelicaCompiler -fopenmp -Wl,-Bstatic -lregex -ltre -lintl -liconv -lexpat -lomcgc -lpthread -loleaut32 -limagehlp -lhdf5 -lz -lszip -Wl,-Bdynamic  -lOpenModelicaRuntimeC -Wl,-Bstatic -lomcgc -lregex -ltre -lintl -liconv -lexpat -static-libgcc -luuid -loleaut32 -lole32 -limagehlp -lws2_32 -llis -lumfpack -lklu -lcolamd -lbtf -lamd  -lsundials_idas -lsundials_kinsol -lsundials_nvecserial -lipopt -lcoinmumps -lpthread -lm -lgfortranbegin -lgfortran -lquadmath -lmingw32 -lgcc_eh -lmoldname -lmingwex -lmsvcrt -luser32 -lkernel32 -ladvapi32 -lshell32 -lopenblas -lcminpack -Wl,-Bdynamic -lm
+C:/OMDev/tools/msys/mingw64/bin/../lib/gcc/x86_64-w64-mingw32/5.3.0/../../../../lib\libregex.a(systre.o):(.text+0x0): multiple definition of `regcomp'
+C:/OMDev/tools/msys/mingw64/bin/../lib/gcc/x86_64-w64-mingw32/5.3.0/../../../../lib/libregex.dll.a(d000001.o):(.text+0x0): first defined here
+C:/OMDev/tools/msys/mingw64/bin/../lib/gcc/x86_64-w64-mingw32/5.3.0/../../../../lib\libregex.a(systre.o):(.text+0x10): multiple definition of `regfree'
+C:/OMDev/tools/msys/mingw64/bin/../lib/gcc/x86_64-w64-mingw32/5.3.0/../../../../lib/libregex.dll.a(d000004.o):(.text+0x0): first defined here
+C:/OMDev/tools/msys/mingw64/bin/../lib/gcc/x86_64-w64-mingw32/5.3.0/../../../../lib\libregex.a(systre.o):(.text+0x30): multiple definition of `regexec'
+C:/OMDev/tools/msys/mingw64/bin/../lib/gcc/x86_64-w64-mingw32/5.3.0/../../../../lib/libregex.dll.a(d000003.o):(.text+0x0): first defined here
+collect2.exe: error: ld returned 1 exit status
+ValuesUtil_valString.makefile:20: recipe for target 'ValuesUtil_valString' failed
+make: *** [ValuesUtil_valString] Error 1
+RESULT: 2
+"

Equation mismatch: omc-diff says:
Line 9: Lexical token differs:
expected: graph AST {
got:      


== 1 out of 1 tests failed [openmodelica/bootstrapping/DumpTest.mos_temp3182, time: 131]

Powered by Hudson Open Source Continuous Integration Server from the Eclipse Foundation